   ______                     ___  _                    ____    ____   ______
 .' ___  |                  .' ..](_)                  |_   \  /   _|.' ____ \
/ .'   \_|  .--.   _ .--.  _| |_  __   .--./)  ______    |   \/   |  | (___ \_|
| |       / .'`\ \[ `.-. |'-| |-'[  | / /'`\; |______|   | |\  /| |   _.____`.
\ `.___.'\| \__. | | | | |  | |   | | \ \._//           _| |_\/_| |_ | \____) |
 `.____ .' '.__.' [___||__][___] [___].',__`           |_____||_____| \______.'
                                     ( ( __))