{
  "linh một": "1",
  "linh hai": "2",
  "linh ba": "3",
  "linh bốn": "4",
  "linh năm": "5",
  "linh sáu": "6",
  "linh bảy": "7",
  "linh tám": "8",
  "linh chín": "9",
  "lẻ một": "1",
  "lẻ hai": "2",
  "lẻ ba": "3",
  "lẻ bốn": "4",
  "lẻ năm": "5",
  "lẻ sáu": "6",
  "lẻ bảy": "7",
  "lẻ tám": "8",
  "lẻ chín": "9",
  "ninh một": "1",
  "ninh hai": "2",
  "ninh ba": "3",
  "ninh bốn": "4",
  "ninh năm": "5",
  "ninh sáu": "6",
  "ninh bảy": "7",
  "ninh tám": "8",
  "ninh chín": "9",
  "không": "0",
  "một": "1",
  "mốt": "1",
  "hai": "2",
  "ba": "3",
  "bốn": "4",
  "tư": "4",
  "năm": "5",
  "sáu": "6",
  "bảy": "7",
  "tám": "8",
  "chín": "9",
  "mười": "10",
  "mười một": "11",
  "mười hai": "12",
  "mười ba": "13",
  "mười bốn": "14",
  "mười năm": "15",
  "mười sáu": "16",
  "mười bảy": "17",
  "mười tám": "18",
  "mười chín": "19",
  "hai mươi": "20",
  "hai mươi mốt": "21",
  "hai mươi hai": "22",
  "hai mươi ba": "23",
  "hai mươi tư": "24",
  "hai mươi năm": "25",
  "hai mươi sáu": "26",
  "hai mươi bảy": "27",
  "hai mươi tám": "28",
  "hai mươi chín": "29",
  "ba mươi": "30",
  "ba mươi mốt": "31",
  "ba mươi hai": "32",
  "ba mươi ba": "33",
  "ba mươi tư": "34",
  "ba mươi năm": "35",
  "ba mươi sáu": "36",
  "ba mươi bảy": "37",
  "ba mươi tám": "38",
  "ba mươi chín": "39",
  "bốn mươi": "40",
  "bốn mươi mốt": "41",
  "bốn mươi hai": "42",
  "bốn mươi ba": "43",
  "bốn mươi tư": "44",
  "bốn mươi năm": "45",
  "bốn mươi sáu": "46",
  "bốn mươi bảy": "47",
  "bốn mươi tám": "48",
  "bốn mươi chín": "49",
  "năm mươi": "50",
  "năm mươi mốt": "51",
  "năm mươi hai": "52",
  "năm mươi ba": "53",
  "năm mươi tư": "54",
  "năm mươi năm": "55",
  "năm mươi sáu": "56",
  "năm mươi bảy": "57",
  "năm mươi tám": "58",
  "năm mươi chín": "59",
  "sáu mươi": "60",
  "sáu mươi mốt": "61",
  "sáu mươi hai": "62",
  "sáu mươi ba": "63",
  "sáu mươi tư": "64",
  "sáu mươi năm": "65",
  "sáu mươi sáu": "66",
  "sáu mươi bảy": "67",
  "sáu mươi tám": "68",
  "sáu mươi chín": "69",
  "bảy mươi": "70",
  "bảy mươi mốt": "71",
  "bảy mươi hai": "72",
  "bảy mươi ba": "73",
  "bảy mươi tư": "74",
  "bảy mươi năm": "75",
  "bảy mươi sáu": "76",
  "bảy mươi bảy": "77",
  "bảy mươi tám": "78",
  "bảy mươi chín": "79",
  "tám mươi": "80",
  "tám mươi mốt": "81",
  "tám mươi hai": "82",
  "tám mươi ba": "83",
  "tám mươi tư": "84",
  "tám mươi năm": "85",
  "tám mươi sáu": "86",
  "tám mươi bảy": "87",
  "tám mươi tám": "88",
  "tám mươi chín": "89",
  "chín mươi": "90",
  "chín mươi mốt": "91",
  "chín mươi hai": "92",
  "chín mươi ba": "93",
  "chín mươi tư": "94",
  "chín mươi năm": "95",
  "chín mươi sáu": "96",
  "chín mươi bảy": "97",
  "chín mươi tám": "98",
  "chín mươi chín": "99",
  "hai mốt": "21",
  "hai hai": "22",
  "hai ba": "23",
  "hai tư": "24",
  "hai năm": "25",
  "hai sáu": "26",
  "hai bảy": "27",
  "hai tám": "28",
  "hai chín": "29",
  "ba mốt": "31",
  "ba hai": "32",
  "ba ba": "33",
  "ba tư": "34",
  "ba năm": "35",
  "ba sáu": "36",
  "ba bảy": "37",
  "ba tám": "38",
  "ba chín": "39",
  "bốn mốt": "41",
  "bốn hai": "42",
  "bốn ba": "43",
  "bốn tư": "44",
  "bốn năm": "45",
  "bốn sáu": "46",
  "bốn bảy": "47",
  "bốn tám": "48",
  "bốn chín": "49",
  "năm mốt": "51",
  "năm hai": "52",
  "năm ba": "53",
  "năm tư": "54",
  "năm năm": "55",
  "năm sáu": "56",
  "năm bảy": "57",
  "năm tám": "58",
  "năm chín": "59",
  "sáu mốt": "61",
  "sáu hai": "62",
  "sáu ba": "63",
  "sáu tư": "64",
  "sáu năm": "65",
  "sáu sáu": "66",
  "sáu bảy": "67",
  "sáu tám": "68",
  "sáu chín": "69",
  "bảy mốt": "71",
  "bảy hai": "72",
  "bảy ba": "73",
  "bảy tư": "74",
  "bảy năm": "75",
  "bảy sáu": "76",
  "bảy bảy": "77",
  "bảy tám": "78",
  "bảy chín": "79",
  "tám mốt": "81",
  "tám hai": "82",
  "tám ba": "83",
  "tám tư": "84",
  "tám năm": "85",
  "tám sáu": "86",
  "tám bảy": "87",
  "tám tám": "88",
  "tám chín": "89",
  "chín mốt": "91",
  "chín hai": "92",
  "chín ba": "93",
  "chín tư": "94",
  "chín năm": "95",
  "chín sáu": "96",
  "chín bảy": "97",
  "chín tám": "98",
  "chín chín": "99",
  "không trăm": "0",
  "một trăm": "100",
  "hai trăm": "200",
  "ba trăm": "300",
  "bốn trăm": "400",
  "năm trăm": "500",
  "sáu trăm": "600",
  "bảy trăm": "700",
  "tám trăm": "800",
  "chín trăm": "900",
  "một trăm rưỡi": "150",
  "hai trăm rưỡi": "250",
  "ba trăm rưỡi": "350",
  "bốn trăm rưỡi": "450",
  "năm trăm rưỡi": "550",
  "sáu trăm rưỡi": "650",
  "bảy trăm rưỡi": "750",
  "tám trăm rưỡi": "850",
  "chín trăm rưỡi": "950",
  "trăm": "100",
  "nghìn": "1000",
  "triệu": "1000000",
  "tỷ": "1000000000",
  "trăm rưỡi": "150",
  "nghìn rưỡi": "1500",
  "triệu rưỡi": "1500000",
  "tỷ rưỡi": "1500000000",
  "rưỡi": "1.5",
  "một trăm": "100",
  "một trăm linh một": "101",
  "một trăm linh hai": "102",
  "một trăm linh ba": "103",
  "một trăm linh bốn": "104",
  "một trăm linh năm": "105",
  "một trăm linh sáu": "106",
  "một trăm linh bảy": "107",
  "một trăm linh tám": "108",
  "một trăm linh chín": "109",
  "một trăm mười": "110",
  "một trăm mười một": "111",
  "một trăm mười hai": "112",
  "một trăm mười ba": "113",
  "một trăm mười bốn": "114",
  "một trăm mười năm": "115",
  "một trăm mười sáu": "116",
  "một trăm mười bảy": "117",
  "một trăm mười tám": "118",
  "một trăm mười chín": "119",
  "một trăm hai": "120",
  "một trăm hai mươi mốt": "121",
  "một trăm hai mươi hai": "122",
  "một trăm hai mươi ba": "123",
  "một trăm hai mươi tư": "124",
  "một trăm hai mươi năm": "125",
  "một trăm hai mươi sáu": "126",
  "một trăm hai mươi bảy": "127",
  "một trăm hai mươi tám": "128",
  "một trăm hai mươi chín": "129",
  "một trăm ba": "130",
  "một trăm ba mươi mốt": "131",
  "một trăm ba mươi hai": "132",
  "một trăm ba mươi ba": "133",
  "một trăm ba mươi tư": "134",
  "một trăm ba mươi năm": "135",
  "một trăm ba mươi sáu": "136",
  "một trăm ba mươi bảy": "137",
  "một trăm ba mươi tám": "138",
  "một trăm ba mươi chín": "139",
  "một trăm bốn": "140",
  "một trăm bốn mươi mốt": "141",
  "một trăm bốn mươi hai": "142",
  "một trăm bốn mươi ba": "143",
  "một trăm bốn mươi tư": "144",
  "một trăm bốn mươi năm": "145",
  "một trăm bốn mươi sáu": "146",
  "một trăm bốn mươi bảy": "147",
  "một trăm bốn mươi tám": "148",
  "một trăm bốn mươi chín": "149",
  "một trăm năm": "150",
  "một trăm năm mươi mốt": "151",
  "một trăm năm mươi hai": "152",
  "một trăm năm mươi ba": "153",
  "một trăm năm mươi tư": "154",
  "một trăm năm mươi năm": "155",
  "một trăm năm mươi sáu": "156",
  "một trăm năm mươi bảy": "157",
  "một trăm năm mươi tám": "158",
  "một trăm năm mươi chín": "159",
  "một trăm sáu": "160",
  "một trăm sáu mươi mốt": "161",
  "một trăm sáu mươi hai": "162",
  "một trăm sáu mươi ba": "163",
  "một trăm sáu mươi tư": "164",
  "một trăm sáu mươi năm": "165",
  "một trăm sáu mươi sáu": "166",
  "một trăm sáu mươi bảy": "167",
  "một trăm sáu mươi tám": "168",
  "một trăm sáu mươi chín": "169",
  "một trăm bảy": "170",
  "một trăm bảy mươi mốt": "171",
  "một trăm bảy mươi hai": "172",
  "một trăm bảy mươi ba": "173",
  "một trăm bảy mươi tư": "174",
  "một trăm bảy mươi năm": "175",
  "một trăm bảy mươi sáu": "176",
  "một trăm bảy mươi bảy": "177",
  "một trăm bảy mươi tám": "178",
  "một trăm bảy mươi chín": "179",
  "một trăm tám": "180",
  "một trăm tám mươi mốt": "181",
  "một trăm tám mươi hai": "182",
  "một trăm tám mươi ba": "183",
  "một trăm tám mươi tư": "184",
  "một trăm tám mươi năm": "185",
  "một trăm tám mươi sáu": "186",
  "một trăm tám mươi bảy": "187",
  "một trăm tám mươi tám": "188",
  "một trăm tám mươi chín": "189",
  "một trăm chín": "190",
  "một trăm chín mươi mốt": "191",
  "một trăm chín mươi hai": "192",
  "một trăm chín mươi ba": "193",
  "một trăm chín mươi tư": "194",
  "một trăm chín mươi năm": "195",
  "một trăm chín mươi sáu": "196",
  "một trăm chín mươi bảy": "197",
  "một trăm chín mươi tám": "198",
  "một trăm chín mươi chín": "199",
  "hai trăm": "200",
  "hai trăm linh một": "201",
  "hai trăm linh hai": "202",
  "hai trăm linh ba": "203",
  "hai trăm linh bốn": "204",
  "hai trăm linh năm": "205",
  "hai trăm linh sáu": "206",
  "hai trăm linh bảy": "207",
  "hai trăm linh tám": "208",
  "hai trăm linh chín": "209",
  "hai trăm mười": "210",
  "hai trăm mười một": "211",
  "hai trăm mười hai": "212",
  "hai trăm mười ba": "213",
  "hai trăm mười bốn": "214",
  "hai trăm mười năm": "215",
  "hai trăm mười sáu": "216",
  "hai trăm mười bảy": "217",
  "hai trăm mười tám": "218",
  "hai trăm mười chín": "219",
  "hai trăm hai": "220",
  "hai trăm hai mươi mốt": "221",
  "hai trăm hai mươi hai": "222",
  "hai trăm hai mươi ba": "223",
  "hai trăm hai mươi tư": "224",
  "hai trăm hai mươi năm": "225",
  "hai trăm hai mươi sáu": "226",
  "hai trăm hai mươi bảy": "227",
  "hai trăm hai mươi tám": "228",
  "hai trăm hai mươi chín": "229",
  "hai trăm ba": "230",
  "hai trăm ba mươi mốt": "231",
  "hai trăm ba mươi hai": "232",
  "hai trăm ba mươi ba": "233",
  "hai trăm ba mươi tư": "234",
  "hai trăm ba mươi năm": "235",
  "hai trăm ba mươi sáu": "236",
  "hai trăm ba mươi bảy": "237",
  "hai trăm ba mươi tám": "238",
  "hai trăm ba mươi chín": "239",
  "hai trăm bốn": "240",
  "hai trăm bốn mươi mốt": "241",
  "hai trăm bốn mươi hai": "242",
  "hai trăm bốn mươi ba": "243",
  "hai trăm bốn mươi tư": "244",
  "hai trăm bốn mươi năm": "245",
  "hai trăm bốn mươi sáu": "246",
  "hai trăm bốn mươi bảy": "247",
  "hai trăm bốn mươi tám": "248",
  "hai trăm bốn mươi chín": "249",
  "hai trăm năm": "250",
  "hai trăm năm mươi mốt": "251",
  "hai trăm năm mươi hai": "252",
  "hai trăm năm mươi ba": "253",
  "hai trăm năm mươi tư": "254",
  "hai trăm năm mươi năm": "255",
  "hai trăm năm mươi sáu": "256",
  "hai trăm năm mươi bảy": "257",
  "hai trăm năm mươi tám": "258",
  "hai trăm năm mươi chín": "259",
  "hai trăm sáu": "260",
  "hai trăm sáu mươi mốt": "261",
  "hai trăm sáu mươi hai": "262",
  "hai trăm sáu mươi ba": "263",
  "hai trăm sáu mươi tư": "264",
  "hai trăm sáu mươi năm": "265",
  "hai trăm sáu mươi sáu": "266",
  "hai trăm sáu mươi bảy": "267",
  "hai trăm sáu mươi tám": "268",
  "hai trăm sáu mươi chín": "269",
  "hai trăm bảy": "270",
  "hai trăm bảy mươi mốt": "271",
  "hai trăm bảy mươi hai": "272",
  "hai trăm bảy mươi ba": "273",
  "hai trăm bảy mươi tư": "274",
  "hai trăm bảy mươi năm": "275",
  "hai trăm bảy mươi sáu": "276",
  "hai trăm bảy mươi bảy": "277",
  "hai trăm bảy mươi tám": "278",
  "hai trăm bảy mươi chín": "279",
  "hai trăm tám": "280",
  "hai trăm tám mươi mốt": "281",
  "hai trăm tám mươi hai": "282",
  "hai trăm tám mươi ba": "283",
  "hai trăm tám mươi tư": "284",
  "hai trăm tám mươi năm": "285",
  "hai trăm tám mươi sáu": "286",
  "hai trăm tám mươi bảy": "287",
  "hai trăm tám mươi tám": "288",
  "hai trăm tám mươi chín": "289",
  "hai trăm chín": "290",
  "hai trăm chín mươi mốt": "291",
  "hai trăm chín mươi hai": "292",
  "hai trăm chín mươi ba": "293",
  "hai trăm chín mươi tư": "294",
  "hai trăm chín mươi năm": "295",
  "hai trăm chín mươi sáu": "296",
  "hai trăm chín mươi bảy": "297",
  "hai trăm chín mươi tám": "298",
  "hai trăm chín mươi chín": "299",
  "ba trăm": "300",
  "ba trăm linh một": "301",
  "ba trăm linh hai": "302",
  "ba trăm linh ba": "303",
  "ba trăm linh bốn": "304",
  "ba trăm linh năm": "305",
  "ba trăm linh sáu": "306",
  "ba trăm linh bảy": "307",
  "ba trăm linh tám": "308",
  "ba trăm linh chín": "309",
  "ba trăm mười": "310",
  "ba trăm mười một": "311",
  "ba trăm mười hai": "312",
  "ba trăm mười ba": "313",
  "ba trăm mười bốn": "314",
  "ba trăm mười năm": "315",
  "ba trăm mười sáu": "316",
  "ba trăm mười bảy": "317",
  "ba trăm mười tám": "318",
  "ba trăm mười chín": "319",
  "ba trăm hai": "320",
  "ba trăm hai mươi mốt": "321",
  "ba trăm hai mươi hai": "322",
  "ba trăm hai mươi ba": "323",
  "ba trăm hai mươi tư": "324",
  "ba trăm hai mươi năm": "325",
  "ba trăm hai mươi sáu": "326",
  "ba trăm hai mươi bảy": "327",
  "ba trăm hai mươi tám": "328",
  "ba trăm hai mươi chín": "329",
  "ba trăm ba": "330",
  "ba trăm ba mươi mốt": "331",
  "ba trăm ba mươi hai": "332",
  "ba trăm ba mươi ba": "333",
  "ba trăm ba mươi tư": "334",
  "ba trăm ba mươi năm": "335",
  "ba trăm ba mươi sáu": "336",
  "ba trăm ba mươi bảy": "337",
  "ba trăm ba mươi tám": "338",
  "ba trăm ba mươi chín": "339",
  "ba trăm bốn": "340",
  "ba trăm bốn mươi mốt": "341",
  "ba trăm bốn mươi hai": "342",
  "ba trăm bốn mươi ba": "343",
  "ba trăm bốn mươi tư": "344",
  "ba trăm bốn mươi năm": "345",
  "ba trăm bốn mươi sáu": "346",
  "ba trăm bốn mươi bảy": "347",
  "ba trăm bốn mươi tám": "348",
  "ba trăm bốn mươi chín": "349",
  "ba trăm năm": "350",
  "ba trăm năm mươi mốt": "351",
  "ba trăm năm mươi hai": "352",
  "ba trăm năm mươi ba": "353",
  "ba trăm năm mươi tư": "354",
  "ba trăm năm mươi năm": "355",
  "ba trăm năm mươi sáu": "356",
  "ba trăm năm mươi bảy": "357",
  "ba trăm năm mươi tám": "358",
  "ba trăm năm mươi chín": "359",
  "ba trăm sáu": "360",
  "ba trăm sáu mươi mốt": "361",
  "ba trăm sáu mươi hai": "362",
  "ba trăm sáu mươi ba": "363",
  "ba trăm sáu mươi tư": "364",
  "ba trăm sáu mươi năm": "365",
  "ba trăm sáu mươi sáu": "366",
  "ba trăm sáu mươi bảy": "367",
  "ba trăm sáu mươi tám": "368",
  "ba trăm sáu mươi chín": "369",
  "ba trăm bảy": "370",
  "ba trăm bảy mươi mốt": "371",
  "ba trăm bảy mươi hai": "372",
  "ba trăm bảy mươi ba": "373",
  "ba trăm bảy mươi tư": "374",
  "ba trăm bảy mươi năm": "375",
  "ba trăm bảy mươi sáu": "376",
  "ba trăm bảy mươi bảy": "377",
  "ba trăm bảy mươi tám": "378",
  "ba trăm bảy mươi chín": "379",
  "ba trăm tám": "380",
  "ba trăm tám mươi mốt": "381",
  "ba trăm tám mươi hai": "382",
  "ba trăm tám mươi ba": "383",
  "ba trăm tám mươi tư": "384",
  "ba trăm tám mươi năm": "385",
  "ba trăm tám mươi sáu": "386",
  "ba trăm tám mươi bảy": "387",
  "ba trăm tám mươi tám": "388",
  "ba trăm tám mươi chín": "389",
  "ba trăm chín": "390",
  "ba trăm chín mươi mốt": "391",
  "ba trăm chín mươi hai": "392",
  "ba trăm chín mươi ba": "393",
  "ba trăm chín mươi tư": "394",
  "ba trăm chín mươi năm": "395",
  "ba trăm chín mươi sáu": "396",
  "ba trăm chín mươi bảy": "397",
  "ba trăm chín mươi tám": "398",
  "ba trăm chín mươi chín": "399",
  "bốn trăm": "400",
  "bốn trăm linh một": "401",
  "bốn trăm linh hai": "402",
  "bốn trăm linh ba": "403",
  "bốn trăm linh bốn": "404",
  "bốn trăm linh năm": "405",
  "bốn trăm linh sáu": "406",
  "bốn trăm linh bảy": "407",
  "bốn trăm linh tám": "408",
  "bốn trăm linh chín": "409",
  "bốn trăm mười": "410",
  "bốn trăm mười một": "411",
  "bốn trăm mười hai": "412",
  "bốn trăm mười ba": "413",
  "bốn trăm mười bốn": "414",
  "bốn trăm mười năm": "415",
  "bốn trăm mười sáu": "416",
  "bốn trăm mười bảy": "417",
  "bốn trăm mười tám": "418",
  "bốn trăm mười chín": "419",
  "bốn trăm hai": "420",
  "bốn trăm hai mươi mốt": "421",
  "bốn trăm hai mươi hai": "422",
  "bốn trăm hai mươi ba": "423",
  "bốn trăm hai mươi tư": "424",
  "bốn trăm hai mươi năm": "425",
  "bốn trăm hai mươi sáu": "426",
  "bốn trăm hai mươi bảy": "427",
  "bốn trăm hai mươi tám": "428",
  "bốn trăm hai mươi chín": "429",
  "bốn trăm ba": "430",
  "bốn trăm ba mươi mốt": "431",
  "bốn trăm ba mươi hai": "432",
  "bốn trăm ba mươi ba": "433",
  "bốn trăm ba mươi tư": "434",
  "bốn trăm ba mươi năm": "435",
  "bốn trăm ba mươi sáu": "436",
  "bốn trăm ba mươi bảy": "437",
  "bốn trăm ba mươi tám": "438",
  "bốn trăm ba mươi chín": "439",
  "bốn trăm bốn": "440",
  "bốn trăm bốn mươi mốt": "441",
  "bốn trăm bốn mươi hai": "442",
  "bốn trăm bốn mươi ba": "443",
  "bốn trăm bốn mươi tư": "444",
  "bốn trăm bốn mươi năm": "445",
  "bốn trăm bốn mươi sáu": "446",
  "bốn trăm bốn mươi bảy": "447",
  "bốn trăm bốn mươi tám": "448",
  "bốn trăm bốn mươi chín": "449",
  "bốn trăm năm": "450",
  "bốn trăm năm mươi mốt": "451",
  "bốn trăm năm mươi hai": "452",
  "bốn trăm năm mươi ba": "453",
  "bốn trăm năm mươi tư": "454",
  "bốn trăm năm mươi năm": "455",
  "bốn trăm năm mươi sáu": "456",
  "bốn trăm năm mươi bảy": "457",
  "bốn trăm năm mươi tám": "458",
  "bốn trăm năm mươi chín": "459",
  "bốn trăm sáu": "460",
  "bốn trăm sáu mươi mốt": "461",
  "bốn trăm sáu mươi hai": "462",
  "bốn trăm sáu mươi ba": "463",
  "bốn trăm sáu mươi tư": "464",
  "bốn trăm sáu mươi năm": "465",
  "bốn trăm sáu mươi sáu": "466",
  "bốn trăm sáu mươi bảy": "467",
  "bốn trăm sáu mươi tám": "468",
  "bốn trăm sáu mươi chín": "469",
  "bốn trăm bảy": "470",
  "bốn trăm bảy mươi mốt": "471",
  "bốn trăm bảy mươi hai": "472",
  "bốn trăm bảy mươi ba": "473",
  "bốn trăm bảy mươi tư": "474",
  "bốn trăm bảy mươi năm": "475",
  "bốn trăm bảy mươi sáu": "476",
  "bốn trăm bảy mươi bảy": "477",
  "bốn trăm bảy mươi tám": "478",
  "bốn trăm bảy mươi chín": "479",
  "bốn trăm tám": "480",
  "bốn trăm tám mươi mốt": "481",
  "bốn trăm tám mươi hai": "482",
  "bốn trăm tám mươi ba": "483",
  "bốn trăm tám mươi tư": "484",
  "bốn trăm tám mươi năm": "485",
  "bốn trăm tám mươi sáu": "486",
  "bốn trăm tám mươi bảy": "487",
  "bốn trăm tám mươi tám": "488",
  "bốn trăm tám mươi chín": "489",
  "bốn trăm chín": "490",
  "bốn trăm chín mươi mốt": "491",
  "bốn trăm chín mươi hai": "492",
  "bốn trăm chín mươi ba": "493",
  "bốn trăm chín mươi tư": "494",
  "bốn trăm chín mươi năm": "495",
  "bốn trăm chín mươi sáu": "496",
  "bốn trăm chín mươi bảy": "497",
  "bốn trăm chín mươi tám": "498",
  "bốn trăm chín mươi chín": "499",
  "năm trăm": "500",
  "năm trăm linh một": "501",
  "năm trăm linh hai": "502",
  "năm trăm linh ba": "503",
  "năm trăm linh bốn": "504",
  "năm trăm linh năm": "505",
  "năm trăm linh sáu": "506",
  "năm trăm linh bảy": "507",
  "năm trăm linh tám": "508",
  "năm trăm linh chín": "509",
  "năm trăm mười": "510",
  "năm trăm mười một": "511",
  "năm trăm mười hai": "512",
  "năm trăm mười ba": "513",
  "năm trăm mười bốn": "514",
  "năm trăm mười năm": "515",
  "năm trăm mười sáu": "516",
  "năm trăm mười bảy": "517",
  "năm trăm mười tám": "518",
  "năm trăm mười chín": "519",
  "năm trăm hai": "520",
  "năm trăm hai mươi mốt": "521",
  "năm trăm hai mươi hai": "522",
  "năm trăm hai mươi ba": "523",
  "năm trăm hai mươi tư": "524",
  "năm trăm hai mươi năm": "525",
  "năm trăm hai mươi sáu": "526",
  "năm trăm hai mươi bảy": "527",
  "năm trăm hai mươi tám": "528",
  "năm trăm hai mươi chín": "529",
  "năm trăm ba": "530",
  "năm trăm ba mươi mốt": "531",
  "năm trăm ba mươi hai": "532",
  "năm trăm ba mươi ba": "533",
  "năm trăm ba mươi tư": "534",
  "năm trăm ba mươi năm": "535",
  "năm trăm ba mươi sáu": "536",
  "năm trăm ba mươi bảy": "537",
  "năm trăm ba mươi tám": "538",
  "năm trăm ba mươi chín": "539",
  "năm trăm bốn": "540",
  "năm trăm bốn mươi mốt": "541",
  "năm trăm bốn mươi hai": "542",
  "năm trăm bốn mươi ba": "543",
  "năm trăm bốn mươi tư": "544",
  "năm trăm bốn mươi năm": "545",
  "năm trăm bốn mươi sáu": "546",
  "năm trăm bốn mươi bảy": "547",
  "năm trăm bốn mươi tám": "548",
  "năm trăm bốn mươi chín": "549",
  "năm trăm năm": "550",
  "năm trăm năm mươi mốt": "551",
  "năm trăm năm mươi hai": "552",
  "năm trăm năm mươi ba": "553",
  "năm trăm năm mươi tư": "554",
  "năm trăm năm mươi năm": "555",
  "năm trăm năm mươi sáu": "556",
  "năm trăm năm mươi bảy": "557",
  "năm trăm năm mươi tám": "558",
  "năm trăm năm mươi chín": "559",
  "năm trăm sáu": "560",
  "năm trăm sáu mươi mốt": "561",
  "năm trăm sáu mươi hai": "562",
  "năm trăm sáu mươi ba": "563",
  "năm trăm sáu mươi tư": "564",
  "năm trăm sáu mươi năm": "565",
  "năm trăm sáu mươi sáu": "566",
  "năm trăm sáu mươi bảy": "567",
  "năm trăm sáu mươi tám": "568",
  "năm trăm sáu mươi chín": "569",
  "năm trăm bảy": "570",
  "năm trăm bảy mươi mốt": "571",
  "năm trăm bảy mươi hai": "572",
  "năm trăm bảy mươi ba": "573",
  "năm trăm bảy mươi tư": "574",
  "năm trăm bảy mươi năm": "575",
  "năm trăm bảy mươi sáu": "576",
  "năm trăm bảy mươi bảy": "577",
  "năm trăm bảy mươi tám": "578",
  "năm trăm bảy mươi chín": "579",
  "năm trăm tám": "580",
  "năm trăm tám mươi mốt": "581",
  "năm trăm tám mươi hai": "582",
  "năm trăm tám mươi ba": "583",
  "năm trăm tám mươi tư": "584",
  "năm trăm tám mươi năm": "585",
  "năm trăm tám mươi sáu": "586",
  "năm trăm tám mươi bảy": "587",
  "năm trăm tám mươi tám": "588",
  "năm trăm tám mươi chín": "589",
  "năm trăm chín": "590",
  "năm trăm chín mươi mốt": "591",
  "năm trăm chín mươi hai": "592",
  "năm trăm chín mươi ba": "593",
  "năm trăm chín mươi tư": "594",
  "năm trăm chín mươi năm": "595",
  "năm trăm chín mươi sáu": "596",
  "năm trăm chín mươi bảy": "597",
  "năm trăm chín mươi tám": "598",
  "năm trăm chín mươi chín": "599",
  "sáu trăm": "600",
  "sáu trăm linh một": "601",
  "sáu trăm linh hai": "602",
  "sáu trăm linh ba": "603",
  "sáu trăm linh bốn": "604",
  "sáu trăm linh năm": "605",
  "sáu trăm linh sáu": "606",
  "sáu trăm linh bảy": "607",
  "sáu trăm linh tám": "608",
  "sáu trăm linh chín": "609",
  "sáu trăm mười": "610",
  "sáu trăm mười một": "611",
  "sáu trăm mười hai": "612",
  "sáu trăm mười ba": "613",
  "sáu trăm mười bốn": "614",
  "sáu trăm mười năm": "615",
  "sáu trăm mười sáu": "616",
  "sáu trăm mười bảy": "617",
  "sáu trăm mười tám": "618",
  "sáu trăm mười chín": "619",
  "sáu trăm hai": "620",
  "sáu trăm hai mươi mốt": "621",
  "sáu trăm hai mươi hai": "622",
  "sáu trăm hai mươi ba": "623",
  "sáu trăm hai mươi tư": "624",
  "sáu trăm hai mươi năm": "625",
  "sáu trăm hai mươi sáu": "626",
  "sáu trăm hai mươi bảy": "627",
  "sáu trăm hai mươi tám": "628",
  "sáu trăm hai mươi chín": "629",
  "sáu trăm ba": "630",
  "sáu trăm ba mươi mốt": "631",
  "sáu trăm ba mươi hai": "632",
  "sáu trăm ba mươi ba": "633",
  "sáu trăm ba mươi tư": "634",
  "sáu trăm ba mươi năm": "635",
  "sáu trăm ba mươi sáu": "636",
  "sáu trăm ba mươi bảy": "637",
  "sáu trăm ba mươi tám": "638",
  "sáu trăm ba mươi chín": "639",
  "sáu trăm bốn": "640",
  "sáu trăm bốn mươi mốt": "641",
  "sáu trăm bốn mươi hai": "642",
  "sáu trăm bốn mươi ba": "643",
  "sáu trăm bốn mươi tư": "644",
  "sáu trăm bốn mươi năm": "645",
  "sáu trăm bốn mươi sáu": "646",
  "sáu trăm bốn mươi bảy": "647",
  "sáu trăm bốn mươi tám": "648",
  "sáu trăm bốn mươi chín": "649",
  "sáu trăm năm": "650",
  "sáu trăm năm mươi mốt": "651",
  "sáu trăm năm mươi hai": "652",
  "sáu trăm năm mươi ba": "653",
  "sáu trăm năm mươi tư": "654",
  "sáu trăm năm mươi năm": "655",
  "sáu trăm năm mươi sáu": "656",
  "sáu trăm năm mươi bảy": "657",
  "sáu trăm năm mươi tám": "658",
  "sáu trăm năm mươi chín": "659",
  "sáu trăm sáu": "660",
  "sáu trăm sáu mươi mốt": "661",
  "sáu trăm sáu mươi hai": "662",
  "sáu trăm sáu mươi ba": "663",
  "sáu trăm sáu mươi tư": "664",
  "sáu trăm sáu mươi năm": "665",
  "sáu trăm sáu mươi sáu": "666",
  "sáu trăm sáu mươi bảy": "667",
  "sáu trăm sáu mươi tám": "668",
  "sáu trăm sáu mươi chín": "669",
  "sáu trăm bảy": "670",
  "sáu trăm bảy mươi mốt": "671",
  "sáu trăm bảy mươi hai": "672",
  "sáu trăm bảy mươi ba": "673",
  "sáu trăm bảy mươi tư": "674",
  "sáu trăm bảy mươi năm": "675",
  "sáu trăm bảy mươi sáu": "676",
  "sáu trăm bảy mươi bảy": "677",
  "sáu trăm bảy mươi tám": "678",
  "sáu trăm bảy mươi chín": "679",
  "sáu trăm tám": "680",
  "sáu trăm tám mươi mốt": "681",
  "sáu trăm tám mươi hai": "682",
  "sáu trăm tám mươi ba": "683",
  "sáu trăm tám mươi tư": "684",
  "sáu trăm tám mươi năm": "685",
  "sáu trăm tám mươi sáu": "686",
  "sáu trăm tám mươi bảy": "687",
  "sáu trăm tám mươi tám": "688",
  "sáu trăm tám mươi chín": "689",
  "sáu trăm chín": "690",
  "sáu trăm chín mươi mốt": "691",
  "sáu trăm chín mươi hai": "692",
  "sáu trăm chín mươi ba": "693",
  "sáu trăm chín mươi tư": "694",
  "sáu trăm chín mươi năm": "695",
  "sáu trăm chín mươi sáu": "696",
  "sáu trăm chín mươi bảy": "697",
  "sáu trăm chín mươi tám": "698",
  "sáu trăm chín mươi chín": "699",
  "bảy trăm": "700",
  "bảy trăm linh một": "701",
  "bảy trăm linh hai": "702",
  "bảy trăm linh ba": "703",
  "bảy trăm linh bốn": "704",
  "bảy trăm linh năm": "705",
  "bảy trăm linh sáu": "706",
  "bảy trăm linh bảy": "707",
  "bảy trăm linh tám": "708",
  "bảy trăm linh chín": "709",
  "bảy trăm mười": "710",
  "bảy trăm mười một": "711",
  "bảy trăm mười hai": "712",
  "bảy trăm mười ba": "713",
  "bảy trăm mười bốn": "714",
  "bảy trăm mười năm": "715",
  "bảy trăm mười sáu": "716",
  "bảy trăm mười bảy": "717",
  "bảy trăm mười tám": "718",
  "bảy trăm mười chín": "719",
  "bảy trăm hai": "720",
  "bảy trăm hai mươi mốt": "721",
  "bảy trăm hai mươi hai": "722",
  "bảy trăm hai mươi ba": "723",
  "bảy trăm hai mươi tư": "724",
  "bảy trăm hai mươi năm": "725",
  "bảy trăm hai mươi sáu": "726",
  "bảy trăm hai mươi bảy": "727",
  "bảy trăm hai mươi tám": "728",
  "bảy trăm hai mươi chín": "729",
  "bảy trăm ba": "730",
  "bảy trăm ba mươi mốt": "731",
  "bảy trăm ba mươi hai": "732",
  "bảy trăm ba mươi ba": "733",
  "bảy trăm ba mươi tư": "734",
  "bảy trăm ba mươi năm": "735",
  "bảy trăm ba mươi sáu": "736",
  "bảy trăm ba mươi bảy": "737",
  "bảy trăm ba mươi tám": "738",
  "bảy trăm ba mươi chín": "739",
  "bảy trăm bốn": "740",
  "bảy trăm bốn mươi mốt": "741",
  "bảy trăm bốn mươi hai": "742",
  "bảy trăm bốn mươi ba": "743",
  "bảy trăm bốn mươi tư": "744",
  "bảy trăm bốn mươi năm": "745",
  "bảy trăm bốn mươi sáu": "746",
  "bảy trăm bốn mươi bảy": "747",
  "bảy trăm bốn mươi tám": "748",
  "bảy trăm bốn mươi chín": "749",
  "bảy trăm năm": "750",
  "bảy trăm năm mươi mốt": "751",
  "bảy trăm năm mươi hai": "752",
  "bảy trăm năm mươi ba": "753",
  "bảy trăm năm mươi tư": "754",
  "bảy trăm năm mươi năm": "755",
  "bảy trăm năm mươi sáu": "756",
  "bảy trăm năm mươi bảy": "757",
  "bảy trăm năm mươi tám": "758",
  "bảy trăm năm mươi chín": "759",
  "bảy trăm sáu": "760",
  "bảy trăm sáu mươi mốt": "761",
  "bảy trăm sáu mươi hai": "762",
  "bảy trăm sáu mươi ba": "763",
  "bảy trăm sáu mươi tư": "764",
  "bảy trăm sáu mươi năm": "765",
  "bảy trăm sáu mươi sáu": "766",
  "bảy trăm sáu mươi bảy": "767",
  "bảy trăm sáu mươi tám": "768",
  "bảy trăm sáu mươi chín": "769",
  "bảy trăm bảy": "770",
  "bảy trăm bảy mươi mốt": "771",
  "bảy trăm bảy mươi hai": "772",
  "bảy trăm bảy mươi ba": "773",
  "bảy trăm bảy mươi tư": "774",
  "bảy trăm bảy mươi năm": "775",
  "bảy trăm bảy mươi sáu": "776",
  "bảy trăm bảy mươi bảy": "777",
  "bảy trăm bảy mươi tám": "778",
  "bảy trăm bảy mươi chín": "779",
  "bảy trăm tám": "780",
  "bảy trăm tám mươi mốt": "781",
  "bảy trăm tám mươi hai": "782",
  "bảy trăm tám mươi ba": "783",
  "bảy trăm tám mươi tư": "784",
  "bảy trăm tám mươi năm": "785",
  "bảy trăm tám mươi sáu": "786",
  "bảy trăm tám mươi bảy": "787",
  "bảy trăm tám mươi tám": "788",
  "bảy trăm tám mươi chín": "789",
  "bảy trăm chín": "790",
  "bảy trăm chín mươi mốt": "791",
  "bảy trăm chín mươi hai": "792",
  "bảy trăm chín mươi ba": "793",
  "bảy trăm chín mươi tư": "794",
  "bảy trăm chín mươi năm": "795",
  "bảy trăm chín mươi sáu": "796",
  "bảy trăm chín mươi bảy": "797",
  "bảy trăm chín mươi tám": "798",
  "bảy trăm chín mươi chín": "799",
  "tám trăm": "800",
  "tám trăm linh một": "801",
  "tám trăm linh hai": "802",
  "tám trăm linh ba": "803",
  "tám trăm linh bốn": "804",
  "tám trăm linh năm": "805",
  "tám trăm linh sáu": "806",
  "tám trăm linh bảy": "807",
  "tám trăm linh tám": "808",
  "tám trăm linh chín": "809",
  "tám trăm mười": "810",
  "tám trăm mười một": "811",
  "tám trăm mười hai": "812",
  "tám trăm mười ba": "813",
  "tám trăm mười bốn": "814",
  "tám trăm mười năm": "815",
  "tám trăm mười sáu": "816",
  "tám trăm mười bảy": "817",
  "tám trăm mười tám": "818",
  "tám trăm mười chín": "819",
  "tám trăm hai": "820",
  "tám trăm hai mươi mốt": "821",
  "tám trăm hai mươi hai": "822",
  "tám trăm hai mươi ba": "823",
  "tám trăm hai mươi tư": "824",
  "tám trăm hai mươi năm": "825",
  "tám trăm hai mươi sáu": "826",
  "tám trăm hai mươi bảy": "827",
  "tám trăm hai mươi tám": "828",
  "tám trăm hai mươi chín": "829",
  "tám trăm ba": "830",
  "tám trăm ba mươi mốt": "831",
  "tám trăm ba mươi hai": "832",
  "tám trăm ba mươi ba": "833",
  "tám trăm ba mươi tư": "834",
  "tám trăm ba mươi năm": "835",
  "tám trăm ba mươi sáu": "836",
  "tám trăm ba mươi bảy": "837",
  "tám trăm ba mươi tám": "838",
  "tám trăm ba mươi chín": "839",
  "tám trăm bốn": "840",
  "tám trăm bốn mươi mốt": "841",
  "tám trăm bốn mươi hai": "842",
  "tám trăm bốn mươi ba": "843",
  "tám trăm bốn mươi tư": "844",
  "tám trăm bốn mươi năm": "845",
  "tám trăm bốn mươi sáu": "846",
  "tám trăm bốn mươi bảy": "847",
  "tám trăm bốn mươi tám": "848",
  "tám trăm bốn mươi chín": "849",
  "tám trăm năm": "850",
  "tám trăm năm mươi mốt": "851",
  "tám trăm năm mươi hai": "852",
  "tám trăm năm mươi ba": "853",
  "tám trăm năm mươi tư": "854",
  "tám trăm năm mươi năm": "855",
  "tám trăm năm mươi sáu": "856",
  "tám trăm năm mươi bảy": "857",
  "tám trăm năm mươi tám": "858",
  "tám trăm năm mươi chín": "859",
  "tám trăm sáu": "860",
  "tám trăm sáu mươi mốt": "861",
  "tám trăm sáu mươi hai": "862",
  "tám trăm sáu mươi ba": "863",
  "tám trăm sáu mươi tư": "864",
  "tám trăm sáu mươi năm": "865",
  "tám trăm sáu mươi sáu": "866",
  "tám trăm sáu mươi bảy": "867",
  "tám trăm sáu mươi tám": "868",
  "tám trăm sáu mươi chín": "869",
  "tám trăm bảy": "870",
  "tám trăm bảy mươi mốt": "871",
  "tám trăm bảy mươi hai": "872",
  "tám trăm bảy mươi ba": "873",
  "tám trăm bảy mươi tư": "874",
  "tám trăm bảy mươi năm": "875",
  "tám trăm bảy mươi sáu": "876",
  "tám trăm bảy mươi bảy": "877",
  "tám trăm bảy mươi tám": "878",
  "tám trăm bảy mươi chín": "879",
  "tám trăm tám": "880",
  "tám trăm tám mươi mốt": "881",
  "tám trăm tám mươi hai": "882",
  "tám trăm tám mươi ba": "883",
  "tám trăm tám mươi tư": "884",
  "tám trăm tám mươi năm": "885",
  "tám trăm tám mươi sáu": "886",
  "tám trăm tám mươi bảy": "887",
  "tám trăm tám mươi tám": "888",
  "tám trăm tám mươi chín": "889",
  "tám trăm chín": "890",
  "tám trăm chín mươi mốt": "891",
  "tám trăm chín mươi hai": "892",
  "tám trăm chín mươi ba": "893",
  "tám trăm chín mươi tư": "894",
  "tám trăm chín mươi năm": "895",
  "tám trăm chín mươi sáu": "896",
  "tám trăm chín mươi bảy": "897",
  "tám trăm chín mươi tám": "898",
  "tám trăm chín mươi chín": "899",
  "chín trăm": "900",
  "chín trăm linh một": "901",
  "chín trăm linh hai": "902",
  "chín trăm linh ba": "903",
  "chín trăm linh bốn": "904",
  "chín trăm linh năm": "905",
  "chín trăm linh sáu": "906",
  "chín trăm linh bảy": "907",
  "chín trăm linh tám": "908",
  "chín trăm linh chín": "909",
  "chín trăm mười": "910",
  "chín trăm mười một": "911",
  "chín trăm mười hai": "912",
  "chín trăm mười ba": "913",
  "chín trăm mười bốn": "914",
  "chín trăm mười năm": "915",
  "chín trăm mười sáu": "916",
  "chín trăm mười bảy": "917",
  "chín trăm mười tám": "918",
  "chín trăm mười chín": "919",
  "chín trăm hai": "920",
  "chín trăm hai mươi mốt": "921",
  "chín trăm hai mươi hai": "922",
  "chín trăm hai mươi ba": "923",
  "chín trăm hai mươi tư": "924",
  "chín trăm hai mươi năm": "925",
  "chín trăm hai mươi sáu": "926",
  "chín trăm hai mươi bảy": "927",
  "chín trăm hai mươi tám": "928",
  "chín trăm hai mươi chín": "929",
  "chín trăm ba": "930",
  "chín trăm ba mươi mốt": "931",
  "chín trăm ba mươi hai": "932",
  "chín trăm ba mươi ba": "933",
  "chín trăm ba mươi tư": "934",
  "chín trăm ba mươi năm": "935",
  "chín trăm ba mươi sáu": "936",
  "chín trăm ba mươi bảy": "937",
  "chín trăm ba mươi tám": "938",
  "chín trăm ba mươi chín": "939",
  "chín trăm bốn": "940",
  "chín trăm bốn mươi mốt": "941",
  "chín trăm bốn mươi hai": "942",
  "chín trăm bốn mươi ba": "943",
  "chín trăm bốn mươi tư": "944",
  "chín trăm bốn mươi năm": "945",
  "chín trăm bốn mươi sáu": "946",
  "chín trăm bốn mươi bảy": "947",
  "chín trăm bốn mươi tám": "948",
  "chín trăm bốn mươi chín": "949",
  "chín trăm năm": "950",
  "chín trăm năm mươi mốt": "951",
  "chín trăm năm mươi hai": "952",
  "chín trăm năm mươi ba": "953",
  "chín trăm năm mươi tư": "954",
  "chín trăm năm mươi năm": "955",
  "chín trăm năm mươi sáu": "956",
  "chín trăm năm mươi bảy": "957",
  "chín trăm năm mươi tám": "958",
  "chín trăm năm mươi chín": "959",
  "chín trăm sáu": "960",
  "chín trăm sáu mươi mốt": "961",
  "chín trăm sáu mươi hai": "962",
  "chín trăm sáu mươi ba": "963",
  "chín trăm sáu mươi tư": "964",
  "chín trăm sáu mươi năm": "965",
  "chín trăm sáu mươi sáu": "966",
  "chín trăm sáu mươi bảy": "967",
  "chín trăm sáu mươi tám": "968",
  "chín trăm sáu mươi chín": "969",
  "chín trăm bảy": "970",
  "chín trăm bảy mươi mốt": "971",
  "chín trăm bảy mươi hai": "972",
  "chín trăm bảy mươi ba": "973",
  "chín trăm bảy mươi tư": "974",
  "chín trăm bảy mươi năm": "975",
  "chín trăm bảy mươi sáu": "976",
  "chín trăm bảy mươi bảy": "977",
  "chín trăm bảy mươi tám": "978",
  "chín trăm bảy mươi chín": "979",
  "chín trăm tám": "980",
  "chín trăm tám mươi mốt": "981",
  "chín trăm tám mươi hai": "982",
  "chín trăm tám mươi ba": "983",
  "chín trăm tám mươi tư": "984",
  "chín trăm tám mươi năm": "985",
  "chín trăm tám mươi sáu": "986",
  "chín trăm tám mươi bảy": "987",
  "chín trăm tám mươi tám": "988",
  "chín trăm tám mươi chín": "989",
  "chín trăm chín": "990",
  "chín trăm chín mươi mốt": "991",
  "chín trăm chín mươi hai": "992",
  "chín trăm chín mươi ba": "993",
  "chín trăm chín mươi tư": "994",
  "chín trăm chín mươi năm": "995",
  "chín trăm chín mươi sáu": "996",
  "chín trăm chín mươi bảy": "997",
  "chín trăm chín mươi tám": "998",
  "chín trăm chín mươi chín": "999",
  "một trăm hai mốt": "121",
  "một trăm hai hai": "122",
  "một trăm hai ba": "123",
  "một trăm hai tư": "124",
  "một trăm hai năm": "125",
  "một trăm hai sáu": "126",
  "một trăm hai bảy": "127",
  "một trăm hai tám": "128",
  "một trăm hai chín": "129",
  "một trăm ba mốt": "131",
  "một trăm ba hai": "132",
  "một trăm ba ba": "133",
  "một trăm ba tư": "134",
  "một trăm ba năm": "135",
  "một trăm ba sáu": "136",
  "một trăm ba bảy": "137",
  "một trăm ba tám": "138",
  "một trăm ba chín": "139",
  "một trăm bốn mốt": "141",
  "một trăm bốn hai": "142",
  "một trăm bốn ba": "143",
  "một trăm bốn tư": "144",
  "một trăm bốn năm": "145",
  "một trăm bốn sáu": "146",
  "một trăm bốn bảy": "147",
  "một trăm bốn tám": "148",
  "một trăm bốn chín": "149",
  "một trăm năm mốt": "151",
  "một trăm năm hai": "152",
  "một trăm năm ba": "153",
  "một trăm năm tư": "154",
  "một trăm năm năm": "155",
  "một trăm năm sáu": "156",
  "một trăm năm bảy": "157",
  "một trăm năm tám": "158",
  "một trăm năm chín": "159",
  "một trăm sáu mốt": "161",
  "một trăm sáu hai": "162",
  "một trăm sáu ba": "163",
  "một trăm sáu tư": "164",
  "một trăm sáu năm": "165",
  "một trăm sáu sáu": "166",
  "một trăm sáu bảy": "167",
  "một trăm sáu tám": "168",
  "một trăm sáu chín": "169",
  "một trăm bảy mốt": "171",
  "một trăm bảy hai": "172",
  "một trăm bảy ba": "173",
  "một trăm bảy tư": "174",
  "một trăm bảy năm": "175",
  "một trăm bảy sáu": "176",
  "một trăm bảy bảy": "177",
  "một trăm bảy tám": "178",
  "một trăm bảy chín": "179",
  "một trăm tám mốt": "181",
  "một trăm tám hai": "182",
  "một trăm tám ba": "183",
  "một trăm tám tư": "184",
  "một trăm tám năm": "185",
  "một trăm tám sáu": "186",
  "một trăm tám bảy": "187",
  "một trăm tám tám": "188",
  "một trăm tám chín": "189",
  "một trăm chín mốt": "191",
  "một trăm chín hai": "192",
  "một trăm chín ba": "193",
  "một trăm chín tư": "194",
  "một trăm chín năm": "195",
  "một trăm chín sáu": "196",
  "một trăm chín bảy": "197",
  "một trăm chín tám": "198",
  "một trăm chín chín": "199",
  "hai trăm hai mốt": "221",
  "hai trăm hai hai": "222",
  "hai trăm hai ba": "223",
  "hai trăm hai tư": "224",
  "hai trăm hai năm": "225",
  "hai trăm hai sáu": "226",
  "hai trăm hai bảy": "227",
  "hai trăm hai tám": "228",
  "hai trăm hai chín": "229",
  "hai trăm ba mốt": "231",
  "hai trăm ba hai": "232",
  "hai trăm ba ba": "233",
  "hai trăm ba tư": "234",
  "hai trăm ba năm": "235",
  "hai trăm ba sáu": "236",
  "hai trăm ba bảy": "237",
  "hai trăm ba tám": "238",
  "hai trăm ba chín": "239",
  "hai trăm bốn mốt": "241",
  "hai trăm bốn hai": "242",
  "hai trăm bốn ba": "243",
  "hai trăm bốn tư": "244",
  "hai trăm bốn năm": "245",
  "hai trăm bốn sáu": "246",
  "hai trăm bốn bảy": "247",
  "hai trăm bốn tám": "248",
  "hai trăm bốn chín": "249",
  "hai trăm năm mốt": "251",
  "hai trăm năm hai": "252",
  "hai trăm năm ba": "253",
  "hai trăm năm tư": "254",
  "hai trăm năm năm": "255",
  "hai trăm năm sáu": "256",
  "hai trăm năm bảy": "257",
  "hai trăm năm tám": "258",
  "hai trăm năm chín": "259",
  "hai trăm sáu mốt": "261",
  "hai trăm sáu hai": "262",
  "hai trăm sáu ba": "263",
  "hai trăm sáu tư": "264",
  "hai trăm sáu năm": "265",
  "hai trăm sáu sáu": "266",
  "hai trăm sáu bảy": "267",
  "hai trăm sáu tám": "268",
  "hai trăm sáu chín": "269",
  "hai trăm bảy mốt": "271",
  "hai trăm bảy hai": "272",
  "hai trăm bảy ba": "273",
  "hai trăm bảy tư": "274",
  "hai trăm bảy năm": "275",
  "hai trăm bảy sáu": "276",
  "hai trăm bảy bảy": "277",
  "hai trăm bảy tám": "278",
  "hai trăm bảy chín": "279",
  "hai trăm tám mốt": "281",
  "hai trăm tám hai": "282",
  "hai trăm tám ba": "283",
  "hai trăm tám tư": "284",
  "hai trăm tám năm": "285",
  "hai trăm tám sáu": "286",
  "hai trăm tám bảy": "287",
  "hai trăm tám tám": "288",
  "hai trăm tám chín": "289",
  "hai trăm chín mốt": "291",
  "hai trăm chín hai": "292",
  "hai trăm chín ba": "293",
  "hai trăm chín tư": "294",
  "hai trăm chín năm": "295",
  "hai trăm chín sáu": "296",
  "hai trăm chín bảy": "297",
  "hai trăm chín tám": "298",
  "hai trăm chín chín": "299",
  "ba trăm hai mốt": "321",
  "ba trăm hai hai": "322",
  "ba trăm hai ba": "323",
  "ba trăm hai tư": "324",
  "ba trăm hai năm": "325",
  "ba trăm hai sáu": "326",
  "ba trăm hai bảy": "327",
  "ba trăm hai tám": "328",
  "ba trăm hai chín": "329",
  "ba trăm ba mốt": "331",
  "ba trăm ba hai": "332",
  "ba trăm ba ba": "333",
  "ba trăm ba tư": "334",
  "ba trăm ba năm": "335",
  "ba trăm ba sáu": "336",
  "ba trăm ba bảy": "337",
  "ba trăm ba tám": "338",
  "ba trăm ba chín": "339",
  "ba trăm bốn mốt": "341",
  "ba trăm bốn hai": "342",
  "ba trăm bốn ba": "343",
  "ba trăm bốn tư": "344",
  "ba trăm bốn năm": "345",
  "ba trăm bốn sáu": "346",
  "ba trăm bốn bảy": "347",
  "ba trăm bốn tám": "348",
  "ba trăm bốn chín": "349",
  "ba trăm năm mốt": "351",
  "ba trăm năm hai": "352",
  "ba trăm năm ba": "353",
  "ba trăm năm tư": "354",
  "ba trăm năm năm": "355",
  "ba trăm năm sáu": "356",
  "ba trăm năm bảy": "357",
  "ba trăm năm tám": "358",
  "ba trăm năm chín": "359",
  "ba trăm sáu mốt": "361",
  "ba trăm sáu hai": "362",
  "ba trăm sáu ba": "363",
  "ba trăm sáu tư": "364",
  "ba trăm sáu năm": "365",
  "ba trăm sáu sáu": "366",
  "ba trăm sáu bảy": "367",
  "ba trăm sáu tám": "368",
  "ba trăm sáu chín": "369",
  "ba trăm bảy mốt": "371",
  "ba trăm bảy hai": "372",
  "ba trăm bảy ba": "373",
  "ba trăm bảy tư": "374",
  "ba trăm bảy năm": "375",
  "ba trăm bảy sáu": "376",
  "ba trăm bảy bảy": "377",
  "ba trăm bảy tám": "378",
  "ba trăm bảy chín": "379",
  "ba trăm tám mốt": "381",
  "ba trăm tám hai": "382",
  "ba trăm tám ba": "383",
  "ba trăm tám tư": "384",
  "ba trăm tám năm": "385",
  "ba trăm tám sáu": "386",
  "ba trăm tám bảy": "387",
  "ba trăm tám tám": "388",
  "ba trăm tám chín": "389",
  "ba trăm chín mốt": "391",
  "ba trăm chín hai": "392",
  "ba trăm chín ba": "393",
  "ba trăm chín tư": "394",
  "ba trăm chín năm": "395",
  "ba trăm chín sáu": "396",
  "ba trăm chín bảy": "397",
  "ba trăm chín tám": "398",
  "ba trăm chín chín": "399",
  "bốn trăm hai mốt": "421",
  "bốn trăm hai hai": "422",
  "bốn trăm hai ba": "423",
  "bốn trăm hai tư": "424",
  "bốn trăm hai năm": "425",
  "bốn trăm hai sáu": "426",
  "bốn trăm hai bảy": "427",
  "bốn trăm hai tám": "428",
  "bốn trăm hai chín": "429",
  "bốn trăm ba mốt": "431",
  "bốn trăm ba hai": "432",
  "bốn trăm ba ba": "433",
  "bốn trăm ba tư": "434",
  "bốn trăm ba năm": "435",
  "bốn trăm ba sáu": "436",
  "bốn trăm ba bảy": "437",
  "bốn trăm ba tám": "438",
  "bốn trăm ba chín": "439",
  "bốn trăm bốn mốt": "441",
  "bốn trăm bốn hai": "442",
  "bốn trăm bốn ba": "443",
  "bốn trăm bốn tư": "444",
  "bốn trăm bốn năm": "445",
  "bốn trăm bốn sáu": "446",
  "bốn trăm bốn bảy": "447",
  "bốn trăm bốn tám": "448",
  "bốn trăm bốn chín": "449",
  "bốn trăm năm mốt": "451",
  "bốn trăm năm hai": "452",
  "bốn trăm năm ba": "453",
  "bốn trăm năm tư": "454",
  "bốn trăm năm năm": "455",
  "bốn trăm năm sáu": "456",
  "bốn trăm năm bảy": "457",
  "bốn trăm năm tám": "458",
  "bốn trăm năm chín": "459",
  "bốn trăm sáu mốt": "461",
  "bốn trăm sáu hai": "462",
  "bốn trăm sáu ba": "463",
  "bốn trăm sáu tư": "464",
  "bốn trăm sáu năm": "465",
  "bốn trăm sáu sáu": "466",
  "bốn trăm sáu bảy": "467",
  "bốn trăm sáu tám": "468",
  "bốn trăm sáu chín": "469",
  "bốn trăm bảy mốt": "471",
  "bốn trăm bảy hai": "472",
  "bốn trăm bảy ba": "473",
  "bốn trăm bảy tư": "474",
  "bốn trăm bảy năm": "475",
  "bốn trăm bảy sáu": "476",
  "bốn trăm bảy bảy": "477",
  "bốn trăm bảy tám": "478",
  "bốn trăm bảy chín": "479",
  "bốn trăm tám mốt": "481",
  "bốn trăm tám hai": "482",
  "bốn trăm tám ba": "483",
  "bốn trăm tám tư": "484",
  "bốn trăm tám năm": "485",
  "bốn trăm tám sáu": "486",
  "bốn trăm tám bảy": "487",
  "bốn trăm tám tám": "488",
  "bốn trăm tám chín": "489",
  "bốn trăm chín mốt": "491",
  "bốn trăm chín hai": "492",
  "bốn trăm chín ba": "493",
  "bốn trăm chín tư": "494",
  "bốn trăm chín năm": "495",
  "bốn trăm chín sáu": "496",
  "bốn trăm chín bảy": "497",
  "bốn trăm chín tám": "498",
  "bốn trăm chín chín": "499",
  "năm trăm hai mốt": "521",
  "năm trăm hai hai": "522",
  "năm trăm hai ba": "523",
  "năm trăm hai tư": "524",
  "năm trăm hai năm": "525",
  "năm trăm hai sáu": "526",
  "năm trăm hai bảy": "527",
  "năm trăm hai tám": "528",
  "năm trăm hai chín": "529",
  "năm trăm ba mốt": "531",
  "năm trăm ba hai": "532",
  "năm trăm ba ba": "533",
  "năm trăm ba tư": "534",
  "năm trăm ba năm": "535",
  "năm trăm ba sáu": "536",
  "năm trăm ba bảy": "537",
  "năm trăm ba tám": "538",
  "năm trăm ba chín": "539",
  "năm trăm bốn mốt": "541",
  "năm trăm bốn hai": "542",
  "năm trăm bốn ba": "543",
  "năm trăm bốn tư": "544",
  "năm trăm bốn năm": "545",
  "năm trăm bốn sáu": "546",
  "năm trăm bốn bảy": "547",
  "năm trăm bốn tám": "548",
  "năm trăm bốn chín": "549",
  "năm trăm năm mốt": "551",
  "năm trăm năm hai": "552",
  "năm trăm năm ba": "553",
  "năm trăm năm tư": "554",
  "năm trăm năm năm": "555",
  "năm trăm năm sáu": "556",
  "năm trăm năm bảy": "557",
  "năm trăm năm tám": "558",
  "năm trăm năm chín": "559",
  "năm trăm sáu mốt": "561",
  "năm trăm sáu hai": "562",
  "năm trăm sáu ba": "563",
  "năm trăm sáu tư": "564",
  "năm trăm sáu năm": "565",
  "năm trăm sáu sáu": "566",
  "năm trăm sáu bảy": "567",
  "năm trăm sáu tám": "568",
  "năm trăm sáu chín": "569",
  "năm trăm bảy mốt": "571",
  "năm trăm bảy hai": "572",
  "năm trăm bảy ba": "573",
  "năm trăm bảy tư": "574",
  "năm trăm bảy năm": "575",
  "năm trăm bảy sáu": "576",
  "năm trăm bảy bảy": "577",
  "năm trăm bảy tám": "578",
  "năm trăm bảy chín": "579",
  "năm trăm tám mốt": "581",
  "năm trăm tám hai": "582",
  "năm trăm tám ba": "583",
  "năm trăm tám tư": "584",
  "năm trăm tám năm": "585",
  "năm trăm tám sáu": "586",
  "năm trăm tám bảy": "587",
  "năm trăm tám tám": "588",
  "năm trăm tám chín": "589",
  "năm trăm chín mốt": "591",
  "năm trăm chín hai": "592",
  "năm trăm chín ba": "593",
  "năm trăm chín tư": "594",
  "năm trăm chín năm": "595",
  "năm trăm chín sáu": "596",
  "năm trăm chín bảy": "597",
  "năm trăm chín tám": "598",
  "năm trăm chín chín": "599",
  "sáu trăm hai mốt": "621",
  "sáu trăm hai hai": "622",
  "sáu trăm hai ba": "623",
  "sáu trăm hai tư": "624",
  "sáu trăm hai năm": "625",
  "sáu trăm hai sáu": "626",
  "sáu trăm hai bảy": "627",
  "sáu trăm hai tám": "628",
  "sáu trăm hai chín": "629",
  "sáu trăm ba mốt": "631",
  "sáu trăm ba hai": "632",
  "sáu trăm ba ba": "633",
  "sáu trăm ba tư": "634",
  "sáu trăm ba năm": "635",
  "sáu trăm ba sáu": "636",
  "sáu trăm ba bảy": "637",
  "sáu trăm ba tám": "638",
  "sáu trăm ba chín": "639",
  "sáu trăm bốn mốt": "641",
  "sáu trăm bốn hai": "642",
  "sáu trăm bốn ba": "643",
  "sáu trăm bốn tư": "644",
  "sáu trăm bốn năm": "645",
  "sáu trăm bốn sáu": "646",
  "sáu trăm bốn bảy": "647",
  "sáu trăm bốn tám": "648",
  "sáu trăm bốn chín": "649",
  "sáu trăm năm mốt": "651",
  "sáu trăm năm hai": "652",
  "sáu trăm năm ba": "653",
  "sáu trăm năm tư": "654",
  "sáu trăm năm năm": "655",
  "sáu trăm năm sáu": "656",
  "sáu trăm năm bảy": "657",
  "sáu trăm năm tám": "658",
  "sáu trăm năm chín": "659",
  "sáu trăm sáu mốt": "661",
  "sáu trăm sáu hai": "662",
  "sáu trăm sáu ba": "663",
  "sáu trăm sáu tư": "664",
  "sáu trăm sáu năm": "665",
  "sáu trăm sáu sáu": "666",
  "sáu trăm sáu bảy": "667",
  "sáu trăm sáu tám": "668",
  "sáu trăm sáu chín": "669",
  "sáu trăm bảy mốt": "671",
  "sáu trăm bảy hai": "672",
  "sáu trăm bảy ba": "673",
  "sáu trăm bảy tư": "674",
  "sáu trăm bảy năm": "675",
  "sáu trăm bảy sáu": "676",
  "sáu trăm bảy bảy": "677",
  "sáu trăm bảy tám": "678",
  "sáu trăm bảy chín": "679",
  "sáu trăm tám mốt": "681",
  "sáu trăm tám hai": "682",
  "sáu trăm tám ba": "683",
  "sáu trăm tám tư": "684",
  "sáu trăm tám năm": "685",
  "sáu trăm tám sáu": "686",
  "sáu trăm tám bảy": "687",
  "sáu trăm tám tám": "688",
  "sáu trăm tám chín": "689",
  "sáu trăm chín mốt": "691",
  "sáu trăm chín hai": "692",
  "sáu trăm chín ba": "693",
  "sáu trăm chín tư": "694",
  "sáu trăm chín năm": "695",
  "sáu trăm chín sáu": "696",
  "sáu trăm chín bảy": "697",
  "sáu trăm chín tám": "698",
  "sáu trăm chín chín": "699",
  "bảy trăm hai mốt": "721",
  "bảy trăm hai hai": "722",
  "bảy trăm hai ba": "723",
  "bảy trăm hai tư": "724",
  "bảy trăm hai năm": "725",
  "bảy trăm hai sáu": "726",
  "bảy trăm hai bảy": "727",
  "bảy trăm hai tám": "728",
  "bảy trăm hai chín": "729",
  "bảy trăm ba mốt": "731",
  "bảy trăm ba hai": "732",
  "bảy trăm ba ba": "733",
  "bảy trăm ba tư": "734",
  "bảy trăm ba năm": "735",
  "bảy trăm ba sáu": "736",
  "bảy trăm ba bảy": "737",
  "bảy trăm ba tám": "738",
  "bảy trăm ba chín": "739",
  "bảy trăm bốn mốt": "741",
  "bảy trăm bốn hai": "742",
  "bảy trăm bốn ba": "743",
  "bảy trăm bốn tư": "744",
  "bảy trăm bốn năm": "745",
  "bảy trăm bốn sáu": "746",
  "bảy trăm bốn bảy": "747",
  "bảy trăm bốn tám": "748",
  "bảy trăm bốn chín": "749",
  "bảy trăm năm mốt": "751",
  "bảy trăm năm hai": "752",
  "bảy trăm năm ba": "753",
  "bảy trăm năm tư": "754",
  "bảy trăm năm năm": "755",
  "bảy trăm năm sáu": "756",
  "bảy trăm năm bảy": "757",
  "bảy trăm năm tám": "758",
  "bảy trăm năm chín": "759",
  "bảy trăm sáu mốt": "761",
  "bảy trăm sáu hai": "762",
  "bảy trăm sáu ba": "763",
  "bảy trăm sáu tư": "764",
  "bảy trăm sáu năm": "765",
  "bảy trăm sáu sáu": "766",
  "bảy trăm sáu bảy": "767",
  "bảy trăm sáu tám": "768",
  "bảy trăm sáu chín": "769",
  "bảy trăm bảy mốt": "771",
  "bảy trăm bảy hai": "772",
  "bảy trăm bảy ba": "773",
  "bảy trăm bảy tư": "774",
  "bảy trăm bảy năm": "775",
  "bảy trăm bảy sáu": "776",
  "bảy trăm bảy bảy": "777",
  "bảy trăm bảy tám": "778",
  "bảy trăm bảy chín": "779",
  "bảy trăm tám mốt": "781",
  "bảy trăm tám hai": "782",
  "bảy trăm tám ba": "783",
  "bảy trăm tám tư": "784",
  "bảy trăm tám năm": "785",
  "bảy trăm tám sáu": "786",
  "bảy trăm tám bảy": "787",
  "bảy trăm tám tám": "788",
  "bảy trăm tám chín": "789",
  "bảy trăm chín mốt": "791",
  "bảy trăm chín hai": "792",
  "bảy trăm chín ba": "793",
  "bảy trăm chín tư": "794",
  "bảy trăm chín năm": "795",
  "bảy trăm chín sáu": "796",
  "bảy trăm chín bảy": "797",
  "bảy trăm chín tám": "798",
  "bảy trăm chín chín": "799",
  "tám trăm hai mốt": "821",
  "tám trăm hai hai": "822",
  "tám trăm hai ba": "823",
  "tám trăm hai tư": "824",
  "tám trăm hai năm": "825",
  "tám trăm hai sáu": "826",
  "tám trăm hai bảy": "827",
  "tám trăm hai tám": "828",
  "tám trăm hai chín": "829",
  "tám trăm ba mốt": "831",
  "tám trăm ba hai": "832",
  "tám trăm ba ba": "833",
  "tám trăm ba tư": "834",
  "tám trăm ba năm": "835",
  "tám trăm ba sáu": "836",
  "tám trăm ba bảy": "837",
  "tám trăm ba tám": "838",
  "tám trăm ba chín": "839",
  "tám trăm bốn mốt": "841",
  "tám trăm bốn hai": "842",
  "tám trăm bốn ba": "843",
  "tám trăm bốn tư": "844",
  "tám trăm bốn năm": "845",
  "tám trăm bốn sáu": "846",
  "tám trăm bốn bảy": "847",
  "tám trăm bốn tám": "848",
  "tám trăm bốn chín": "849",
  "tám trăm năm mốt": "851",
  "tám trăm năm hai": "852",
  "tám trăm năm ba": "853",
  "tám trăm năm tư": "854",
  "tám trăm năm năm": "855",
  "tám trăm năm sáu": "856",
  "tám trăm năm bảy": "857",
  "tám trăm năm tám": "858",
  "tám trăm năm chín": "859",
  "tám trăm sáu mốt": "861",
  "tám trăm sáu hai": "862",
  "tám trăm sáu ba": "863",
  "tám trăm sáu tư": "864",
  "tám trăm sáu năm": "865",
  "tám trăm sáu sáu": "866",
  "tám trăm sáu bảy": "867",
  "tám trăm sáu tám": "868",
  "tám trăm sáu chín": "869",
  "tám trăm bảy mốt": "871",
  "tám trăm bảy hai": "872",
  "tám trăm bảy ba": "873",
  "tám trăm bảy tư": "874",
  "tám trăm bảy năm": "875",
  "tám trăm bảy sáu": "876",
  "tám trăm bảy bảy": "877",
  "tám trăm bảy tám": "878",
  "tám trăm bảy chín": "879",
  "tám trăm tám mốt": "881",
  "tám trăm tám hai": "882",
  "tám trăm tám ba": "883",
  "tám trăm tám tư": "884",
  "tám trăm tám năm": "885",
  "tám trăm tám sáu": "886",
  "tám trăm tám bảy": "887",
  "tám trăm tám tám": "888",
  "tám trăm tám chín": "889",
  "tám trăm chín mốt": "891",
  "tám trăm chín hai": "892",
  "tám trăm chín ba": "893",
  "tám trăm chín tư": "894",
  "tám trăm chín năm": "895",
  "tám trăm chín sáu": "896",
  "tám trăm chín bảy": "897",
  "tám trăm chín tám": "898",
  "tám trăm chín chín": "899",
  "chín trăm hai mốt": "921",
  "chín trăm hai hai": "922",
  "chín trăm hai ba": "923",
  "chín trăm hai tư": "924",
  "chín trăm hai năm": "925",
  "chín trăm hai sáu": "926",
  "chín trăm hai bảy": "927",
  "chín trăm hai tám": "928",
  "chín trăm hai chín": "929",
  "chín trăm ba mốt": "931",
  "chín trăm ba hai": "932",
  "chín trăm ba ba": "933",
  "chín trăm ba tư": "934",
  "chín trăm ba năm": "935",
  "chín trăm ba sáu": "936",
  "chín trăm ba bảy": "937",
  "chín trăm ba tám": "938",
  "chín trăm ba chín": "939",
  "chín trăm bốn mốt": "941",
  "chín trăm bốn hai": "942",
  "chín trăm bốn ba": "943",
  "chín trăm bốn tư": "944",
  "chín trăm bốn năm": "945",
  "chín trăm bốn sáu": "946",
  "chín trăm bốn bảy": "947",
  "chín trăm bốn tám": "948",
  "chín trăm bốn chín": "949",
  "chín trăm năm mốt": "951",
  "chín trăm năm hai": "952",
  "chín trăm năm ba": "953",
  "chín trăm năm tư": "954",
  "chín trăm năm năm": "955",
  "chín trăm năm sáu": "956",
  "chín trăm năm bảy": "957",
  "chín trăm năm tám": "958",
  "chín trăm năm chín": "959",
  "chín trăm sáu mốt": "961",
  "chín trăm sáu hai": "962",
  "chín trăm sáu ba": "963",
  "chín trăm sáu tư": "964",
  "chín trăm sáu năm": "965",
  "chín trăm sáu sáu": "966",
  "chín trăm sáu bảy": "967",
  "chín trăm sáu tám": "968",
  "chín trăm sáu chín": "969",
  "chín trăm bảy mốt": "971",
  "chín trăm bảy hai": "972",
  "chín trăm bảy ba": "973",
  "chín trăm bảy tư": "974",
  "chín trăm bảy năm": "975",
  "chín trăm bảy sáu": "976",
  "chín trăm bảy bảy": "977",
  "chín trăm bảy tám": "978",
  "chín trăm bảy chín": "979",
  "chín trăm tám mốt": "981",
  "chín trăm tám hai": "982",
  "chín trăm tám ba": "983",
  "chín trăm tám tư": "984",
  "chín trăm tám năm": "985",
  "chín trăm tám sáu": "986",
  "chín trăm tám bảy": "987",
  "chín trăm tám tám": "988",
  "chín trăm tám chín": "989",
  "chín trăm chín mốt": "991",
  "chín trăm chín hai": "992",
  "chín trăm chín ba": "993",
  "chín trăm chín tư": "994",
  "chín trăm chín năm": "995",
  "chín trăm chín sáu": "996",
  "chín trăm chín bảy": "997",
  "chín trăm chín tám": "998",
  "chín trăm chín chín": "999",
  "một trăm lẻ một": "101",
  "một trăm lẻ hai": "102",
  "một trăm lẻ ba": "103",
  "một trăm lẻ bốn": "104",
  "một trăm lẻ năm": "105",
  "một trăm lẻ sáu": "106",
  "một trăm lẻ bảy": "107",
  "một trăm lẻ tám": "108",
  "một trăm lẻ chín": "109",
  "hai trăm lẻ một": "201",
  "hai trăm lẻ hai": "202",
  "hai trăm lẻ ba": "203",
  "hai trăm lẻ bốn": "204",
  "hai trăm lẻ năm": "205",
  "hai trăm lẻ sáu": "206",
  "hai trăm lẻ bảy": "207",
  "hai trăm lẻ tám": "208",
  "hai trăm lẻ chín": "209",
  "ba trăm lẻ một": "301",
  "ba trăm lẻ hai": "302",
  "ba trăm lẻ ba": "303",
  "ba trăm lẻ bốn": "304",
  "ba trăm lẻ năm": "305",
  "ba trăm lẻ sáu": "306",
  "ba trăm lẻ bảy": "307",
  "ba trăm lẻ tám": "308",
  "ba trăm lẻ chín": "309",
  "bốn trăm lẻ một": "401",
  "bốn trăm lẻ hai": "402",
  "bốn trăm lẻ ba": "403",
  "bốn trăm lẻ bốn": "404",
  "bốn trăm lẻ năm": "405",
  "bốn trăm lẻ sáu": "406",
  "bốn trăm lẻ bảy": "407",
  "bốn trăm lẻ tám": "408",
  "bốn trăm lẻ chín": "409",
  "năm trăm lẻ một": "501",
  "năm trăm lẻ hai": "502",
  "năm trăm lẻ ba": "503",
  "năm trăm lẻ bốn": "504",
  "năm trăm lẻ năm": "505",
  "năm trăm lẻ sáu": "506",
  "năm trăm lẻ bảy": "507",
  "năm trăm lẻ tám": "508",
  "năm trăm lẻ chín": "509",
  "sáu trăm lẻ một": "601",
  "sáu trăm lẻ hai": "602",
  "sáu trăm lẻ ba": "603",
  "sáu trăm lẻ bốn": "604",
  "sáu trăm lẻ năm": "605",
  "sáu trăm lẻ sáu": "606",
  "sáu trăm lẻ bảy": "607",
  "sáu trăm lẻ tám": "608",
  "sáu trăm lẻ chín": "609",
  "bảy trăm lẻ một": "701",
  "bảy trăm lẻ hai": "702",
  "bảy trăm lẻ ba": "703",
  "bảy trăm lẻ bốn": "704",
  "bảy trăm lẻ năm": "705",
  "bảy trăm lẻ sáu": "706",
  "bảy trăm lẻ bảy": "707",
  "bảy trăm lẻ tám": "708",
  "bảy trăm lẻ chín": "709",
  "tám trăm lẻ một": "801",
  "tám trăm lẻ hai": "802",
  "tám trăm lẻ ba": "803",
  "tám trăm lẻ bốn": "804",
  "tám trăm lẻ năm": "805",
  "tám trăm lẻ sáu": "806",
  "tám trăm lẻ bảy": "807",
  "tám trăm lẻ tám": "808",
  "tám trăm lẻ chín": "809",
  "chín trăm lẻ một": "901",
  "chín trăm lẻ hai": "902",
  "chín trăm lẻ ba": "903",
  "chín trăm lẻ bốn": "904",
  "chín trăm lẻ năm": "905",
  "chín trăm lẻ sáu": "906",
  "chín trăm lẻ bảy": "907",
  "chín trăm lẻ tám": "908",
  "chín trăm lẻ chín": "909",
  "một trăm ninh một": "101",
  "một trăm ninh hai": "102",
  "một trăm ninh ba": "103",
  "một trăm ninh bốn": "104",
  "một trăm ninh năm": "105",
  "một trăm ninh sáu": "106",
  "một trăm ninh bảy": "107",
  "một trăm ninh tám": "108",
  "một trăm ninh chín": "109",
  "hai trăm ninh một": "201",
  "hai trăm ninh hai": "202",
  "hai trăm ninh ba": "203",
  "hai trăm ninh bốn": "204",
  "hai trăm ninh năm": "205",
  "hai trăm ninh sáu": "206",
  "hai trăm ninh bảy": "207",
  "hai trăm ninh tám": "208",
  "hai trăm ninh chín": "209",
  "ba trăm ninh một": "301",
  "ba trăm ninh hai": "302",
  "ba trăm ninh ba": "303",
  "ba trăm ninh bốn": "304",
  "ba trăm ninh năm": "305",
  "ba trăm ninh sáu": "306",
  "ba trăm ninh bảy": "307",
  "ba trăm ninh tám": "308",
  "ba trăm ninh chín": "309",
  "bốn trăm ninh một": "401",
  "bốn trăm ninh hai": "402",
  "bốn trăm ninh ba": "403",
  "bốn trăm ninh bốn": "404",
  "bốn trăm ninh năm": "405",
  "bốn trăm ninh sáu": "406",
  "bốn trăm ninh bảy": "407",
  "bốn trăm ninh tám": "408",
  "bốn trăm ninh chín": "409",
  "năm trăm ninh một": "501",
  "năm trăm ninh hai": "502",
  "năm trăm ninh ba": "503",
  "năm trăm ninh bốn": "504",
  "năm trăm ninh năm": "505",
  "năm trăm ninh sáu": "506",
  "năm trăm ninh bảy": "507",
  "năm trăm ninh tám": "508",
  "năm trăm ninh chín": "509",
  "sáu trăm ninh một": "601",
  "sáu trăm ninh hai": "602",
  "sáu trăm ninh ba": "603",
  "sáu trăm ninh bốn": "604",
  "sáu trăm ninh năm": "605",
  "sáu trăm ninh sáu": "606",
  "sáu trăm ninh bảy": "607",
  "sáu trăm ninh tám": "608",
  "sáu trăm ninh chín": "609",
  "bảy trăm ninh một": "701",
  "bảy trăm ninh hai": "702",
  "bảy trăm ninh ba": "703",
  "bảy trăm ninh bốn": "704",
  "bảy trăm ninh năm": "705",
  "bảy trăm ninh sáu": "706",
  "bảy trăm ninh bảy": "707",
  "bảy trăm ninh tám": "708",
  "bảy trăm ninh chín": "709",
  "tám trăm ninh một": "801",
  "tám trăm ninh hai": "802",
  "tám trăm ninh ba": "803",
  "tám trăm ninh bốn": "804",
  "tám trăm ninh năm": "805",
  "tám trăm ninh sáu": "806",
  "tám trăm ninh bảy": "807",
  "tám trăm ninh tám": "808",
  "tám trăm ninh chín": "809",
  "chín trăm ninh một": "901",
  "chín trăm ninh hai": "902",
  "chín trăm ninh ba": "903",
  "chín trăm ninh bốn": "904",
  "chín trăm ninh năm": "905",
  "chín trăm ninh sáu": "906",
  "chín trăm ninh bảy": "907",
  "chín trăm ninh tám": "908",
  "chín trăm ninh chín": "909",
  "không trăm linh không": "01",
  "không trăm linh hai": "02",
  "không trăm linh ba": "03",
  "không trăm linh bốn": "04",
  "không trăm linh năm": "05",
  "không trăm linh sáu": "06",
  "không trăm linh bảy": "07",
  "không trăm linh tám": "08",
  "không trăm linh chín": "09",
  "không trăm mười": "10",
  "không trăm mười không": "11",
  "không trăm mười hai": "12",
  "không trăm mười ba": "13",
  "không trăm mười bốn": "14",
  "không trăm mười năm": "15",
  "không trăm mười sáu": "16",
  "không trăm mười bảy": "17",
  "không trăm mười tám": "18",
  "không trăm mười chín": "19",
  "không trăm hai": "20",
  "không trăm hai mươi mốt": "21",
  "không trăm hai mươi hai": "22",
  "không trăm hai mươi ba": "23",
  "không trăm hai mươi tư": "24",
  "không trăm hai mươi năm": "25",
  "không trăm hai mươi sáu": "26",
  "không trăm hai mươi bảy": "27",
  "không trăm hai mươi tám": "28",
  "không trăm hai mươi chín": "29",
  "không trăm ba": "30",
  "không trăm ba mươi mốt": "31",
  "không trăm ba mươi hai": "32",
  "không trăm ba mươi ba": "33",
  "không trăm ba mươi tư": "34",
  "không trăm ba mươi năm": "35",
  "không trăm ba mươi sáu": "36",
  "không trăm ba mươi bảy": "37",
  "không trăm ba mươi tám": "38",
  "không trăm ba mươi chín": "39",
  "không trăm bốn": "40",
  "không trăm bốn mươi mốt": "41",
  "không trăm bốn mươi hai": "42",
  "không trăm bốn mươi ba": "43",
  "không trăm bốn mươi tư": "44",
  "không trăm bốn mươi năm": "45",
  "không trăm bốn mươi sáu": "46",
  "không trăm bốn mươi bảy": "47",
  "không trăm bốn mươi tám": "48",
  "không trăm bốn mươi chín": "49",
  "không trăm năm": "50",
  "không trăm năm mươi mốt": "51",
  "không trăm năm mươi hai": "52",
  "không trăm năm mươi ba": "53",
  "không trăm năm mươi tư": "54",
  "không trăm năm mươi năm": "55",
  "không trăm năm mươi sáu": "56",
  "không trăm năm mươi bảy": "57",
  "không trăm năm mươi tám": "58",
  "không trăm năm mươi chín": "59",
  "không trăm sáu": "60",
  "không trăm sáu mươi mốt": "61",
  "không trăm sáu mươi hai": "62",
  "không trăm sáu mươi ba": "63",
  "không trăm sáu mươi tư": "64",
  "không trăm sáu mươi năm": "65",
  "không trăm sáu mươi sáu": "66",
  "không trăm sáu mươi bảy": "67",
  "không trăm sáu mươi tám": "68",
  "không trăm sáu mươi chín": "69",
  "không trăm bảy": "70",
  "không trăm bảy mươi mốt": "71",
  "không trăm bảy mươi hai": "72",
  "không trăm bảy mươi ba": "73",
  "không trăm bảy mươi tư": "74",
  "không trăm bảy mươi năm": "75",
  "không trăm bảy mươi sáu": "76",
  "không trăm bảy mươi bảy": "77",
  "không trăm bảy mươi tám": "78",
  "không trăm bảy mươi chín": "79",
  "không trăm tám": "80",
  "không trăm tám mươi mốt": "81",
  "không trăm tám mươi hai": "82",
  "không trăm tám mươi ba": "83",
  "không trăm tám mươi tư": "84",
  "không trăm tám mươi năm": "85",
  "không trăm tám mươi sáu": "86",
  "không trăm tám mươi bảy": "87",
  "không trăm tám mươi tám": "88",
  "không trăm tám mươi chín": "89",
  "không trăm chín": "90",
  "không trăm chín mươi mốt": "91",
  "không trăm chín mươi hai": "92",
  "không trăm chín mươi ba": "93",
  "không trăm chín mươi tư": "94",
  "không trăm chín mươi năm": "95",
  "không trăm chín mươi sáu": "96",
  "không trăm chín mươi bảy": "97",
  "không trăm chín mươi tám": "98",
  "không trăm chín mươi chín": "99",
  "linh tư": "4",
  "lẻ tư": "4",
  "ninh tư": "4",
  "tư": "4",
  "mười tư": "14",
  "một trăm linh tư": "104",
  "một trăm mười tư": "114",
  "một trăm tư": "140",
  "hai trăm linh tư": "204",
  "hai trăm mười tư": "214",
  "hai trăm tư": "240",
  "ba trăm linh tư": "304",
  "ba trăm mười tư": "314",
  "ba trăm tư": "340",
  "bốn trăm linh tư": "404",
  "bốn trăm mười tư": "414",
  "bốn trăm tư": "440",
  "năm trăm linh tư": "504",
  "năm trăm mười tư": "514",
  "năm trăm tư": "540",
  "sáu trăm linh tư": "604",
  "sáu trăm mười tư": "614",
  "sáu trăm tư": "640",
  "bảy trăm linh tư": "704",
  "bảy trăm mười tư": "714",
  "bảy trăm tư": "740",
  "tám trăm linh tư": "804",
  "tám trăm mười tư": "814",
  "tám trăm tư": "840",
  "chín trăm linh tư": "904",
  "chín trăm mười tư": "914",
  "chín trăm tư": "940",
  "một trăm lẻ tư": "104",
  "hai trăm lẻ tư": "204",
  "ba trăm lẻ tư": "304",
  "bốn trăm lẻ tư": "404",
  "năm trăm lẻ tư": "504",
  "sáu trăm lẻ tư": "604",
  "bảy trăm lẻ tư": "704",
  "tám trăm lẻ tư": "804",
  "chín trăm lẻ tư": "904",
  "một trăm ninh tư": "104",
  "hai trăm ninh tư": "204",
  "ba trăm ninh tư": "304",
  "bốn trăm ninh tư": "404",
  "năm trăm ninh tư": "504",
  "sáu trăm ninh tư": "604",
  "bảy trăm ninh tư": "704",
  "tám trăm ninh tư": "804",
  "chín trăm ninh tư": "904",
  "không trăm linh tư": "04",
  "không trăm mười tư": "14",
  "không trăm tư": "40",
  "bốn": "4",
  "hai mươi bốn": "24",
  "ba mươi bốn": "34",
  "bốn mươi bốn": "44",
  "năm mươi bốn": "54",
  "sáu mươi bốn": "64",
  "bảy mươi bốn": "74",
  "tám mươi bốn": "84",
  "chín mươi bốn": "94",
  "hai bốn": "24",
  "ba bốn": "34",
  "bốn bốn": "44",
  "năm bốn": "54",
  "sáu bốn": "64",
  "bảy bốn": "74",
  "tám bốn": "84",
  "chín bốn": "94",
  "một trăm hai mươi bốn": "124",
  "một trăm ba mươi bốn": "134",
  "một trăm bốn mươi bốn": "144",
  "một trăm năm mươi bốn": "154",
  "một trăm sáu mươi bốn": "164",
  "một trăm bảy mươi bốn": "174",
  "một trăm tám mươi bốn": "184",
  "một trăm chín mươi bốn": "194",
  "hai trăm hai mươi bốn": "224",
  "hai trăm ba mươi bốn": "234",
  "hai trăm bốn mươi bốn": "244",
  "hai trăm năm mươi bốn": "254",
  "hai trăm sáu mươi bốn": "264",
  "hai trăm bảy mươi bốn": "274",
  "hai trăm tám mươi bốn": "284",
  "hai trăm chín mươi bốn": "294",
  "ba trăm hai mươi bốn": "324",
  "ba trăm ba mươi bốn": "334",
  "ba trăm bốn mươi bốn": "344",
  "ba trăm năm mươi bốn": "354",
  "ba trăm sáu mươi bốn": "364",
  "ba trăm bảy mươi bốn": "374",
  "ba trăm tám mươi bốn": "384",
  "ba trăm chín mươi bốn": "394",
  "bốn trăm hai mươi bốn": "424",
  "bốn trăm ba mươi bốn": "434",
  "bốn trăm bốn mươi bốn": "444",
  "bốn trăm năm mươi bốn": "454",
  "bốn trăm sáu mươi bốn": "464",
  "bốn trăm bảy mươi bốn": "474",
  "bốn trăm tám mươi bốn": "484",
  "bốn trăm chín mươi bốn": "494",
  "năm trăm hai mươi bốn": "524",
  "năm trăm ba mươi bốn": "534",
  "năm trăm bốn mươi bốn": "544",
  "năm trăm năm mươi bốn": "554",
  "năm trăm sáu mươi bốn": "564",
  "năm trăm bảy mươi bốn": "574",
  "năm trăm tám mươi bốn": "584",
  "năm trăm chín mươi bốn": "594",
  "sáu trăm hai mươi bốn": "624",
  "sáu trăm ba mươi bốn": "634",
  "sáu trăm bốn mươi bốn": "644",
  "sáu trăm năm mươi bốn": "654",
  "sáu trăm sáu mươi bốn": "664",
  "sáu trăm bảy mươi bốn": "674",
  "sáu trăm tám mươi bốn": "684",
  "sáu trăm chín mươi bốn": "694",
  "bảy trăm hai mươi bốn": "724",
  "bảy trăm ba mươi bốn": "734",
  "bảy trăm bốn mươi bốn": "744",
  "bảy trăm năm mươi bốn": "754",
  "bảy trăm sáu mươi bốn": "764",
  "bảy trăm bảy mươi bốn": "774",
  "bảy trăm tám mươi bốn": "784",
  "bảy trăm chín mươi bốn": "794",
  "tám trăm hai mươi bốn": "824",
  "tám trăm ba mươi bốn": "834",
  "tám trăm bốn mươi bốn": "844",
  "tám trăm năm mươi bốn": "854",
  "tám trăm sáu mươi bốn": "864",
  "tám trăm bảy mươi bốn": "874",
  "tám trăm tám mươi bốn": "884",
  "tám trăm chín mươi bốn": "894",
  "chín trăm hai mươi bốn": "924",
  "chín trăm ba mươi bốn": "934",
  "chín trăm bốn mươi bốn": "944",
  "chín trăm năm mươi bốn": "954",
  "chín trăm sáu mươi bốn": "964",
  "chín trăm bảy mươi bốn": "974",
  "chín trăm tám mươi bốn": "984",
  "chín trăm chín mươi bốn": "994",
  "một trăm hai bốn": "124",
  "một trăm ba bốn": "134",
  "một trăm bốn bốn": "144",
  "một trăm năm bốn": "154",
  "một trăm sáu bốn": "164",
  "một trăm bảy bốn": "174",
  "một trăm tám bốn": "184",
  "một trăm chín bốn": "194",
  "hai trăm hai bốn": "224",
  "hai trăm ba bốn": "234",
  "hai trăm bốn bốn": "244",
  "hai trăm năm bốn": "254",
  "hai trăm sáu bốn": "264",
  "hai trăm bảy bốn": "274",
  "hai trăm tám bốn": "284",
  "hai trăm chín bốn": "294",
  "ba trăm hai bốn": "324",
  "ba trăm ba bốn": "334",
  "ba trăm bốn bốn": "344",
  "ba trăm năm bốn": "354",
  "ba trăm sáu bốn": "364",
  "ba trăm bảy bốn": "374",
  "ba trăm tám bốn": "384",
  "ba trăm chín bốn": "394",
  "bốn trăm hai bốn": "424",
  "bốn trăm ba bốn": "434",
  "bốn trăm bốn bốn": "444",
  "bốn trăm năm bốn": "454",
  "bốn trăm sáu bốn": "464",
  "bốn trăm bảy bốn": "474",
  "bốn trăm tám bốn": "484",
  "bốn trăm chín bốn": "494",
  "năm trăm hai bốn": "524",
  "năm trăm ba bốn": "534",
  "năm trăm bốn bốn": "544",
  "năm trăm năm bốn": "554",
  "năm trăm sáu bốn": "564",
  "năm trăm bảy bốn": "574",
  "năm trăm tám bốn": "584",
  "năm trăm chín bốn": "594",
  "sáu trăm hai bốn": "624",
  "sáu trăm ba bốn": "634",
  "sáu trăm bốn bốn": "644",
  "sáu trăm năm bốn": "654",
  "sáu trăm sáu bốn": "664",
  "sáu trăm bảy bốn": "674",
  "sáu trăm tám bốn": "684",
  "sáu trăm chín bốn": "694",
  "bảy trăm hai bốn": "724",
  "bảy trăm ba bốn": "734",
  "bảy trăm bốn bốn": "744",
  "bảy trăm năm bốn": "754",
  "bảy trăm sáu bốn": "764",
  "bảy trăm bảy bốn": "774",
  "bảy trăm tám bốn": "784",
  "bảy trăm chín bốn": "794",
  "tám trăm hai bốn": "824",
  "tám trăm ba bốn": "834",
  "tám trăm bốn bốn": "844",
  "tám trăm năm bốn": "854",
  "tám trăm sáu bốn": "864",
  "tám trăm bảy bốn": "874",
  "tám trăm tám bốn": "884",
  "tám trăm chín bốn": "894",
  "chín trăm hai bốn": "924",
  "chín trăm ba bốn": "934",
  "chín trăm bốn bốn": "944",
  "chín trăm năm bốn": "954",
  "chín trăm sáu bốn": "964",
  "chín trăm bảy bốn": "974",
  "chín trăm tám bốn": "984",
  "chín trăm chín bốn": "994",
  "không trăm hai mươi bốn": "24",
  "không trăm ba mươi bốn": "34",
  "không trăm bốn mươi bốn": "44",
  "không trăm năm mươi bốn": "54",
  "không trăm sáu mươi bốn": "64",
  "không trăm bảy mươi bốn": "74",
  "không trăm tám mươi bốn": "84",
  "không trăm chín mươi bốn": "94",
  "hai mươi": "20",
  "ba mươi": "30",
  "bốn mươi": "40",
  "năm mươi": "50",
  "sáu mươi": "60",
  "bảy mươi": "70",
  "tám mươi": "80",
  "chín mươi": "90",
  "một trăm hai mươi": "120",
  "một trăm ba mươi": "130",
  "một trăm bốn mươi": "140",
  "một trăm năm mươi": "150",
  "một trăm sáu mươi": "160",
  "một trăm bảy mươi": "170",
  "một trăm tám mươi": "180",
  "một trăm chín mươi": "190",
  "hai trăm hai mươi": "220",
  "hai trăm ba mươi": "230",
  "hai trăm bốn mươi": "240",
  "hai trăm năm mươi": "250",
  "hai trăm sáu mươi": "260",
  "hai trăm bảy mươi": "270",
  "hai trăm tám mươi": "280",
  "hai trăm chín mươi": "290",
  "ba trăm hai mươi": "320",
  "ba trăm ba mươi": "330",
  "ba trăm bốn mươi": "340",
  "ba trăm năm mươi": "350",
  "ba trăm sáu mươi": "360",
  "ba trăm bảy mươi": "370",
  "ba trăm tám mươi": "380",
  "ba trăm chín mươi": "390",
  "bốn trăm hai mươi": "420",
  "bốn trăm ba mươi": "430",
  "bốn trăm bốn mươi": "440",
  "bốn trăm năm mươi": "450",
  "bốn trăm sáu mươi": "460",
  "bốn trăm bảy mươi": "470",
  "bốn trăm tám mươi": "480",
  "bốn trăm chín mươi": "490",
  "năm trăm hai mươi": "520",
  "năm trăm ba mươi": "530",
  "năm trăm bốn mươi": "540",
  "năm trăm năm mươi": "550",
  "năm trăm sáu mươi": "560",
  "năm trăm bảy mươi": "570",
  "năm trăm tám mươi": "580",
  "năm trăm chín mươi": "590",
  "sáu trăm hai mươi": "620",
  "sáu trăm ba mươi": "630",
  "sáu trăm bốn mươi": "640",
  "sáu trăm năm mươi": "650",
  "sáu trăm sáu mươi": "660",
  "sáu trăm bảy mươi": "670",
  "sáu trăm tám mươi": "680",
  "sáu trăm chín mươi": "690",
  "bảy trăm hai mươi": "720",
  "bảy trăm ba mươi": "730",
  "bảy trăm bốn mươi": "740",
  "bảy trăm năm mươi": "750",
  "bảy trăm sáu mươi": "760",
  "bảy trăm bảy mươi": "770",
  "bảy trăm tám mươi": "780",
  "bảy trăm chín mươi": "790",
  "tám trăm hai mươi": "820",
  "tám trăm ba mươi": "830",
  "tám trăm bốn mươi": "840",
  "tám trăm năm mươi": "850",
  "tám trăm sáu mươi": "860",
  "tám trăm bảy mươi": "870",
  "tám trăm tám mươi": "880",
  "tám trăm chín mươi": "890",
  "chín trăm hai mươi": "920",
  "chín trăm ba mươi": "930",
  "chín trăm bốn mươi": "940",
  "chín trăm năm mươi": "950",
  "chín trăm sáu mươi": "960",
  "chín trăm bảy mươi": "970",
  "chín trăm tám mươi": "980",
  "chín trăm chín mươi": "990"
}