{
  "bilingual_action": {
    "shape": "table",
    "container": "1",
    "childLayout": "tableLayout",
    "rounded": "1",
    "fillColor": "#e1d5e7"
  },
  "english_action": {
    "shape": "table",
    "container": "1",
    "childLayout": "tableLayout",
    "rounded": "1",
    "fillColor": "#dae8fc"
  },
  "condition_flow": {
    "shape": "table",
    "container": "1",
    "childLayout": "tableLayout",
    "rounded": "0",
    "fillColor": "#f8cecc"
  },
  "intent_flow": {
    "shape": "table",
    "container": "1",
    "childLayout": "tableLayout",
    "rounded": "0",
    "fillColor": "#fff2cc"
  },
  "update_local": {
    "shape": "table",
    "container": "1",
    "childLayout": "tableLayout",
    "rounded": "0",
    "fillColor": "#d5e8d4"
  },
  "fixed_condition": {
    "rounded": "0",
    "fillColor": "#f8cecc",
    "container": null,
    "childLayout": null
  },
  "start_node": {
    "rounded": "1",
    "triangle": true,
    "fillColor": "#d5e8d4",
    "gradientDirection": "south",
    "gradientColor": "#97d077"
  },
  "end_node": {
    "rounded": "1",
    "shape": "process",
    "backgroundOutline": "1",
    "fillColor": "#f8cecc",
    "gradientDirection": "south",
    "gradientColor": "#ea6b66"
  },
  "destination_node": {
    "ellipse": true,
    "gradientDirection": "radial"
  },
  "shortcut_node": {
    "rounded": "0",
    "shape": "offPageConnector",
    "gradientDirection": "south"
  },
  "correction_node": {
    "rounded": "1",
    "shape": "hexagon",
    "fillColor": "#a0522d"
  },
  "api_node": {
    "ellipse": true,
    "rounded": "1",
    "shape": "cloud"
  },
  "user_information": {
    "shape": "table",
    "container": "1",
    "childLayout": "tableLayout",
    "rounded": "0",
    "fillColor": "#f5f5f5"
  },
  "notification_node": {
    "shape": "callout",
    "perimeter": "calloutPerimeter"
  },
  "table_row": {
    "shape": "tableRow"
  }
}