[
  {
    "phrase_wrong": "Work environment friendly",
    "phrase_correct": "Friendly work environment",
    "guide": "Khi dịch từ Việt sang Anh, mình phải dịch từ cuối lên đầu (Thân thiện – làm việc – môi trường)."
  },
  {
    "phrase_wrong": "I have been working at my company about a year",
    "phrase_correct": "I have been working at mycompany for about a year",
    "guide": "Khi nói về việc đã làm gì trong bao lâu, ta cần dùng giới từ 'for' trước thời gian."
  }
]