{
  "node": [
    "start_node",
    "end_node",
    "correction_node",
    "bilingual_action",
    "english_action",
    "api_node",
    "update_local",
    "intent_flow",
    "condition_flow",
    "fixed_condition"
  ],
  "intent_flow": [
    "intent_fallback"
  ],
  "condition_flow": [
    "priority"
  ],
  "fixed_condition": [
    "remain"
  ]
}