{
  "GwSGoYzUlG58vtmeYjiC-2": {
    "id": "GwSGoYzUlG58vtmeYjiC-2",
    "source": "GwSGoYzUlG58vtmeYjiC-3",
    "target": "GwSGoYzUlG58vtmeYjiC-134",
    "source_type": "english_action",
    "target_type": "destination_node"
  },
  "GwSGoYzUlG58vtmeYjiC-31": {
    "id": "GwSGoYzUlG58vtmeYjiC-31",
    "source": "GwSGoYzUlG58vtmeYjiC-134",
    "target": "GwSGoYzUlG58vtmeYjiC-40",
    "source_type": "destination_node",
    "target_type": "intent_flow"
  },
  "GwSGoYzUlG58vtmeYjiC-37": {
    "id": "GwSGoYzUlG58vtmeYjiC-37",
    "source": "GwSGoYzUlG58vtmeYjiC-40",
    "target": "GwSGoYzUlG58vtmeYjiC-48",
    "source_type": "intent_flow",
    "target_type": "fixed_condition"
  },
  "GwSGoYzUlG58vtmeYjiC-38": {
    "id": "GwSGoYzUlG58vtmeYjiC-38",
    "source": "GwSGoYzUlG58vtmeYjiC-40",
    "target": "GwSGoYzUlG58vtmeYjiC-44",
    "source_type": "intent_flow",
    "target_type": "fixed_condition"
  },
  "GwSGoYzUlG58vtmeYjiC-39": {
    "id": "GwSGoYzUlG58vtmeYjiC-39",
    "source": "GwSGoYzUlG58vtmeYjiC-40",
    "target": "GwSGoYzUlG58vtmeYjiC-46",
    "source_type": "intent_flow",
    "target_type": "fixed_condition"
  },
  "GwSGoYzUlG58vtmeYjiC-43": {
    "id": "GwSGoYzUlG58vtmeYjiC-43",
    "source": "GwSGoYzUlG58vtmeYjiC-44",
    "target": "GwSGoYzUlG58vtmeYjiC-74",
    "source_type": "fixed_condition",
    "target_type": "bilingual_action"
  },
  "GwSGoYzUlG58vtmeYjiC-45": {
    "id": "GwSGoYzUlG58vtmeYjiC-45",
    "source": "GwSGoYzUlG58vtmeYjiC-46",
    "target": "GwSGoYzUlG58vtmeYjiC-244",
    "source_type": "fixed_condition",
    "target_type": "bilingual_action"
  },
  "GwSGoYzUlG58vtmeYjiC-47": {
    "id": "GwSGoYzUlG58vtmeYjiC-47",
    "source": "GwSGoYzUlG58vtmeYjiC-48",
    "target": "GwSGoYzUlG58vtmeYjiC-270",
    "source_type": "fixed_condition",
    "target_type": "bilingual_action"
  },
  "GwSGoYzUlG58vtmeYjiC-49": {
    "id": "GwSGoYzUlG58vtmeYjiC-49",
    "source": "GwSGoYzUlG58vtmeYjiC-50",
    "target": "GwSGoYzUlG58vtmeYjiC-192",
    "source_type": "fixed_condition",
    "target_type": "bilingual_action"
  },
  "GwSGoYzUlG58vtmeYjiC-51": {
    "id": "GwSGoYzUlG58vtmeYjiC-51",
    "source": "GwSGoYzUlG58vtmeYjiC-52",
    "target": "GwSGoYzUlG58vtmeYjiC-373",
    "source_type": "fixed_condition",
    "target_type": "bilingual_action"
  },
  "GwSGoYzUlG58vtmeYjiC-64": {
    "id": "GwSGoYzUlG58vtmeYjiC-64",
    "source": "GwSGoYzUlG58vtmeYjiC-65",
    "target": "GwSGoYzUlG58vtmeYjiC-691",
    "source_type": "fixed_condition",
    "target_type": "fixed_condition"
  },
  "2HodqpUpLX2VSRIkugpp-9": {
    "id": "2HodqpUpLX2VSRIkugpp-9",
    "source": "GwSGoYzUlG58vtmeYjiC-65",
    "target": "2HodqpUpLX2VSRIkugpp-8",
    "source_type": "fixed_condition",
    "target_type": "fixed_condition"
  },
  "GwSGoYzUlG58vtmeYjiC-73": {
    "id": "GwSGoYzUlG58vtmeYjiC-73",
    "source": "GwSGoYzUlG58vtmeYjiC-74",
    "target": "GwSGoYzUlG58vtmeYjiC-99",
    "source_type": "bilingual_action",
    "target_type": "shortcut_node"
  },
  "GwSGoYzUlG58vtmeYjiC-106": {
    "id": "GwSGoYzUlG58vtmeYjiC-106",
    "source": "GwSGoYzUlG58vtmeYjiC-107",
    "target": "GwSGoYzUlG58vtmeYjiC-132",
    "source_type": "english_action",
    "target_type": "shortcut_node"
  },
  "GwSGoYzUlG58vtmeYjiC-133": {
    "id": "GwSGoYzUlG58vtmeYjiC-133",
    "source": "GwSGoYzUlG58vtmeYjiC-134",
    "target": "GwSGoYzUlG58vtmeYjiC-304",
    "source_type": "destination_node",
    "target_type": "intent_flow"
  },
  "GwSGoYzUlG58vtmeYjiC-135": {
    "id": "GwSGoYzUlG58vtmeYjiC-135",
    "source": "GwSGoYzUlG58vtmeYjiC-136",
    "target": "GwSGoYzUlG58vtmeYjiC-139",
    "source_type": "correction_node",
    "target_type": "bilingual_action"
  },
  "2HodqpUpLX2VSRIkugpp-47": {
    "id": "2HodqpUpLX2VSRIkugpp-47",
    "source": "GwSGoYzUlG58vtmeYjiC-139",
    "target": "2HodqpUpLX2VSRIkugpp-45",
    "source_type": "bilingual_action",
    "target_type": "fixed_condition"
  },
  "2HodqpUpLX2VSRIkugpp-48": {
    "id": "2HodqpUpLX2VSRIkugpp-48",
    "source": "GwSGoYzUlG58vtmeYjiC-139",
    "target": "2HodqpUpLX2VSRIkugpp-46",
    "source_type": "bilingual_action",
    "target_type": "fixed_condition"
  },
  "2HodqpUpLX2VSRIkugpp-93": {
    "id": "2HodqpUpLX2VSRIkugpp-93",
    "source": "GwSGoYzUlG58vtmeYjiC-166",
    "target": "2HodqpUpLX2VSRIkugpp-89",
    "source_type": "bilingual_action",
    "target_type": "fixed_condition"
  },
  "2HodqpUpLX2VSRIkugpp-94": {
    "id": "2HodqpUpLX2VSRIkugpp-94",
    "source": "GwSGoYzUlG58vtmeYjiC-166",
    "target": "2HodqpUpLX2VSRIkugpp-90",
    "source_type": "bilingual_action",
    "target_type": "fixed_condition"
  },
  "GwSGoYzUlG58vtmeYjiC-191": {
    "id": "GwSGoYzUlG58vtmeYjiC-191",
    "source": "GwSGoYzUlG58vtmeYjiC-192",
    "target": "GwSGoYzUlG58vtmeYjiC-218",
    "source_type": "bilingual_action",
    "target_type": "bilingual_action"
  },
  "GwSGoYzUlG58vtmeYjiC-217": {
    "id": "GwSGoYzUlG58vtmeYjiC-217",
    "source": "GwSGoYzUlG58vtmeYjiC-218",
    "target": "GwSGoYzUlG58vtmeYjiC-53",
    "source_type": "bilingual_action",
    "target_type": "shortcut_node"
  },
  "GwSGoYzUlG58vtmeYjiC-243": {
    "id": "GwSGoYzUlG58vtmeYjiC-243",
    "source": "GwSGoYzUlG58vtmeYjiC-244",
    "target": "GwSGoYzUlG58vtmeYjiC-546",
    "source_type": "bilingual_action",
    "target_type": "bilingual_action"
  },
  "GwSGoYzUlG58vtmeYjiC-269": {
    "id": "GwSGoYzUlG58vtmeYjiC-269",
    "source": "GwSGoYzUlG58vtmeYjiC-270",
    "target": "GwSGoYzUlG58vtmeYjiC-72",
    "source_type": "bilingual_action",
    "target_type": "shortcut_node"
  },
  "GwSGoYzUlG58vtmeYjiC-295": {
    "id": "GwSGoYzUlG58vtmeYjiC-295",
    "source": "GwSGoYzUlG58vtmeYjiC-296",
    "target": "GwSGoYzUlG58vtmeYjiC-634",
    "source_type": "start_node",
    "target_type": "intent_flow"
  },
  "GwSGoYzUlG58vtmeYjiC-297": {
    "id": "GwSGoYzUlG58vtmeYjiC-297",
    "source": "GwSGoYzUlG58vtmeYjiC-298",
    "target": "GwSGoYzUlG58vtmeYjiC-299",
    "source_type": "destination_node",
    "target_type": "end_node"
  },
  "GwSGoYzUlG58vtmeYjiC-300": {
    "id": "GwSGoYzUlG58vtmeYjiC-300",
    "source": "GwSGoYzUlG58vtmeYjiC-301",
    "target": "GwSGoYzUlG58vtmeYjiC-1603",
    "source_type": "fixed_condition",
    "target_type": "bilingual_action"
  },
  "GwSGoYzUlG58vtmeYjiC-303": {
    "id": "GwSGoYzUlG58vtmeYjiC-303",
    "source": "GwSGoYzUlG58vtmeYjiC-304",
    "target": "GwSGoYzUlG58vtmeYjiC-1629",
    "source_type": "intent_flow",
    "target_type": "fixed_condition"
  },
  "PnucuaZuXBeo7sRjAMGR-9": {
    "id": "PnucuaZuXBeo7sRjAMGR-9",
    "source": "GwSGoYzUlG58vtmeYjiC-304",
    "target": "PnucuaZuXBeo7sRjAMGR-8",
    "source_type": "intent_flow",
    "target_type": "fixed_condition"
  },
  "GwSGoYzUlG58vtmeYjiC-309": {
    "id": "GwSGoYzUlG58vtmeYjiC-309",
    "source": "GwSGoYzUlG58vtmeYjiC-310",
    "target": "GwSGoYzUlG58vtmeYjiC-1126",
    "source_type": "english_action",
    "target_type": "intent_flow"
  },
  "GwSGoYzUlG58vtmeYjiC-335": {
    "id": "GwSGoYzUlG58vtmeYjiC-335",
    "source": "GwSGoYzUlG58vtmeYjiC-336",
    "target": "GwSGoYzUlG58vtmeYjiC-1126",
    "source_type": "english_action",
    "target_type": "intent_flow"
  },
  "2HodqpUpLX2VSRIkugpp-97": {
    "id": "2HodqpUpLX2VSRIkugpp-97",
    "source": "GwSGoYzUlG58vtmeYjiC-373",
    "target": "2HodqpUpLX2VSRIkugpp-95",
    "source_type": "bilingual_action",
    "target_type": "fixed_condition"
  },
  "2HodqpUpLX2VSRIkugpp-98": {
    "id": "2HodqpUpLX2VSRIkugpp-98",
    "source": "GwSGoYzUlG58vtmeYjiC-373",
    "target": "2HodqpUpLX2VSRIkugpp-96",
    "source_type": "bilingual_action",
    "target_type": "fixed_condition"
  },
  "GwSGoYzUlG58vtmeYjiC-398": {
    "id": "GwSGoYzUlG58vtmeYjiC-398",
    "source": "GwSGoYzUlG58vtmeYjiC-399",
    "target": "GwSGoYzUlG58vtmeYjiC-1354",
    "source_type": "english_action",
    "target_type": "intent_flow"
  },
  "GwSGoYzUlG58vtmeYjiC-424": {
    "id": "GwSGoYzUlG58vtmeYjiC-424",
    "source": "GwSGoYzUlG58vtmeYjiC-425",
    "target": "GwSGoYzUlG58vtmeYjiC-1354",
    "source_type": "english_action",
    "target_type": "intent_flow"
  },
  "GwSGoYzUlG58vtmeYjiC-465": {
    "id": "GwSGoYzUlG58vtmeYjiC-465",
    "source": "GwSGoYzUlG58vtmeYjiC-466",
    "target": "GwSGoYzUlG58vtmeYjiC-1354",
    "source_type": "english_action",
    "target_type": "intent_flow"
  },
  "GwSGoYzUlG58vtmeYjiC-491": {
    "id": "GwSGoYzUlG58vtmeYjiC-491",
    "source": "GwSGoYzUlG58vtmeYjiC-492",
    "target": "GwSGoYzUlG58vtmeYjiC-1354",
    "source_type": "english_action",
    "target_type": "intent_flow"
  },
  "GwSGoYzUlG58vtmeYjiC-517": {
    "id": "GwSGoYzUlG58vtmeYjiC-517",
    "source": "GwSGoYzUlG58vtmeYjiC-518",
    "target": "GwSGoYzUlG58vtmeYjiC-136",
    "source_type": "bilingual_action",
    "target_type": "correction_node"
  },
  "2HodqpUpLX2VSRIkugpp-103": {
    "id": "2HodqpUpLX2VSRIkugpp-103",
    "source": "GwSGoYzUlG58vtmeYjiC-546",
    "target": "2HodqpUpLX2VSRIkugpp-101",
    "source_type": "bilingual_action",
    "target_type": "fixed_condition"
  },
  "2HodqpUpLX2VSRIkugpp-105": {
    "id": "2HodqpUpLX2VSRIkugpp-105",
    "source": "GwSGoYzUlG58vtmeYjiC-546",
    "target": "2HodqpUpLX2VSRIkugpp-102",
    "source_type": "bilingual_action",
    "target_type": "fixed_condition"
  },
  "GwSGoYzUlG58vtmeYjiC-571": {
    "id": "GwSGoYzUlG58vtmeYjiC-571",
    "source": "GwSGoYzUlG58vtmeYjiC-572",
    "target": "GwSGoYzUlG58vtmeYjiC-543",
    "source_type": "english_action",
    "target_type": "shortcut_node"
  },
  "GwSGoYzUlG58vtmeYjiC-597": {
    "id": "GwSGoYzUlG58vtmeYjiC-597",
    "source": "GwSGoYzUlG58vtmeYjiC-598",
    "target": "GwSGoYzUlG58vtmeYjiC-543",
    "source_type": "english_action",
    "target_type": "shortcut_node"
  },
  "PnucuaZuXBeo7sRjAMGR-4": {
    "id": "PnucuaZuXBeo7sRjAMGR-4",
    "source": "GwSGoYzUlG58vtmeYjiC-634",
    "target": "PnucuaZuXBeo7sRjAMGR-2",
    "source_type": "intent_flow",
    "target_type": "fixed_condition"
  },
  "PnucuaZuXBeo7sRjAMGR-6": {
    "id": "PnucuaZuXBeo7sRjAMGR-6",
    "source": "GwSGoYzUlG58vtmeYjiC-634",
    "target": "PnucuaZuXBeo7sRjAMGR-5",
    "source_type": "intent_flow",
    "target_type": "fixed_condition"
  },
  "GwSGoYzUlG58vtmeYjiC-651": {
    "id": "GwSGoYzUlG58vtmeYjiC-651",
    "source": "GwSGoYzUlG58vtmeYjiC-652",
    "target": "GwSGoYzUlG58vtmeYjiC-134",
    "source_type": "english_action",
    "target_type": "destination_node"
  },
  "GwSGoYzUlG58vtmeYjiC-690": {
    "id": "GwSGoYzUlG58vtmeYjiC-690",
    "source": "GwSGoYzUlG58vtmeYjiC-691",
    "target": "GwSGoYzUlG58vtmeYjiC-693",
    "source_type": "fixed_condition",
    "target_type": "bilingual_action"
  },
  "GwSGoYzUlG58vtmeYjiC-692": {
    "id": "GwSGoYzUlG58vtmeYjiC-692",
    "source": "GwSGoYzUlG58vtmeYjiC-693",
    "target": "GwSGoYzUlG58vtmeYjiC-720",
    "source_type": "bilingual_action",
    "target_type": "bilingual_action"
  },
  "2HodqpUpLX2VSRIkugpp-15": {
    "id": "2HodqpUpLX2VSRIkugpp-15",
    "source": "GwSGoYzUlG58vtmeYjiC-720",
    "target": "2HodqpUpLX2VSRIkugpp-11",
    "source_type": "bilingual_action",
    "target_type": "fixed_condition"
  },
  "2HodqpUpLX2VSRIkugpp-16": {
    "id": "2HodqpUpLX2VSRIkugpp-16",
    "source": "GwSGoYzUlG58vtmeYjiC-720",
    "target": "2HodqpUpLX2VSRIkugpp-12",
    "source_type": "bilingual_action",
    "target_type": "fixed_condition"
  },
  "GwSGoYzUlG58vtmeYjiC-745": {
    "id": "GwSGoYzUlG58vtmeYjiC-745",
    "source": "GwSGoYzUlG58vtmeYjiC-746",
    "target": "GwSGoYzUlG58vtmeYjiC-848",
    "source_type": "english_action",
    "target_type": "intent_flow"
  },
  "GwSGoYzUlG58vtmeYjiC-771": {
    "id": "GwSGoYzUlG58vtmeYjiC-771",
    "source": "GwSGoYzUlG58vtmeYjiC-772",
    "target": "GwSGoYzUlG58vtmeYjiC-848",
    "source_type": "english_action",
    "target_type": "intent_flow"
  },
  "GwSGoYzUlG58vtmeYjiC-807": {
    "id": "GwSGoYzUlG58vtmeYjiC-807",
    "source": "GwSGoYzUlG58vtmeYjiC-808",
    "target": "GwSGoYzUlG58vtmeYjiC-881",
    "source_type": "bilingual_action",
    "target_type": "shortcut_node"
  },
  "GwSGoYzUlG58vtmeYjiC-840": {
    "id": "GwSGoYzUlG58vtmeYjiC-840",
    "source": "GwSGoYzUlG58vtmeYjiC-841",
    "target": "GwSGoYzUlG58vtmeYjiC-1059",
    "source_type": "correction_node",
    "target_type": "bilingual_action"
  },
  "GwSGoYzUlG58vtmeYjiC-847": {
    "id": "GwSGoYzUlG58vtmeYjiC-847",
    "source": "GwSGoYzUlG58vtmeYjiC-848",
    "target": "GwSGoYzUlG58vtmeYjiC-883",
    "source_type": "intent_flow",
    "target_type": "fixed_condition"
  },
  "2HodqpUpLX2VSRIkugpp-27": {
    "id": "2HodqpUpLX2VSRIkugpp-27",
    "source": "GwSGoYzUlG58vtmeYjiC-848",
    "target": "2HodqpUpLX2VSRIkugpp-25",
    "source_type": "intent_flow",
    "target_type": "fixed_condition"
  },
  "GwSGoYzUlG58vtmeYjiC-854": {
    "id": "GwSGoYzUlG58vtmeYjiC-854",
    "source": "GwSGoYzUlG58vtmeYjiC-855",
    "target": "GwSGoYzUlG58vtmeYjiC-880",
    "source_type": "english_action",
    "target_type": "shortcut_node"
  },
  "GwSGoYzUlG58vtmeYjiC-882": {
    "id": "GwSGoYzUlG58vtmeYjiC-882",
    "source": "GwSGoYzUlG58vtmeYjiC-883",
    "target": "GwSGoYzUlG58vtmeYjiC-808",
    "source_type": "fixed_condition",
    "target_type": "bilingual_action"
  },
  "GwSGoYzUlG58vtmeYjiC-891": {
    "id": "GwSGoYzUlG58vtmeYjiC-891",
    "source": "GwSGoYzUlG58vtmeYjiC-892",
    "target": "GwSGoYzUlG58vtmeYjiC-917",
    "source_type": "bilingual_action",
    "target_type": "shortcut_node"
  },
  "GwSGoYzUlG58vtmeYjiC-918": {
    "id": "GwSGoYzUlG58vtmeYjiC-918",
    "source": "GwSGoYzUlG58vtmeYjiC-919",
    "target": "GwSGoYzUlG58vtmeYjiC-1020",
    "source_type": "bilingual_action",
    "target_type": "shortcut_node"
  },
  "GwSGoYzUlG58vtmeYjiC-952": {
    "id": "GwSGoYzUlG58vtmeYjiC-952",
    "source": "GwSGoYzUlG58vtmeYjiC-953",
    "target": "GwSGoYzUlG58vtmeYjiC-967",
    "source_type": "correction_node",
    "target_type": "bilingual_action"
  },
  "2HodqpUpLX2VSRIkugpp-80": {
    "id": "2HodqpUpLX2VSRIkugpp-80",
    "source": "GwSGoYzUlG58vtmeYjiC-960",
    "target": "2HodqpUpLX2VSRIkugpp-67",
    "source_type": "intent_flow",
    "target_type": "fixed_condition"
  },
  "GwSGoYzUlG58vtmeYjiC-964": {
    "id": "GwSGoYzUlG58vtmeYjiC-964",
    "source": "GwSGoYzUlG58vtmeYjiC-965",
    "target": "GwSGoYzUlG58vtmeYjiC-1029",
    "source_type": "fixed_condition",
    "target_type": "fixed_condition"
  },
  "2HodqpUpLX2VSRIkugpp-73": {
    "id": "2HodqpUpLX2VSRIkugpp-73",
    "source": "GwSGoYzUlG58vtmeYjiC-965",
    "target": "2HodqpUpLX2VSRIkugpp-72",
    "source_type": "fixed_condition",
    "target_type": "fixed_condition"
  },
  "GwSGoYzUlG58vtmeYjiC-966": {
    "id": "GwSGoYzUlG58vtmeYjiC-966",
    "source": "GwSGoYzUlG58vtmeYjiC-967",
    "target": "GwSGoYzUlG58vtmeYjiC-1019",
    "source_type": "bilingual_action",
    "target_type": "shortcut_node"
  },
  "GwSGoYzUlG58vtmeYjiC-992": {
    "id": "GwSGoYzUlG58vtmeYjiC-992",
    "source": "GwSGoYzUlG58vtmeYjiC-993",
    "target": "GwSGoYzUlG58vtmeYjiC-1018",
    "source_type": "english_action",
    "target_type": "shortcut_node"
  },
  "GwSGoYzUlG58vtmeYjiC-1021": {
    "id": "GwSGoYzUlG58vtmeYjiC-1021",
    "source": "GwSGoYzUlG58vtmeYjiC-1022",
    "target": "GwSGoYzUlG58vtmeYjiC-919",
    "source_type": "fixed_condition",
    "target_type": "bilingual_action"
  },
  "GwSGoYzUlG58vtmeYjiC-1028": {
    "id": "GwSGoYzUlG58vtmeYjiC-1028",
    "source": "GwSGoYzUlG58vtmeYjiC-1029",
    "target": "GwSGoYzUlG58vtmeYjiC-1031",
    "source_type": "fixed_condition",
    "target_type": "bilingual_action"
  },
  "GwSGoYzUlG58vtmeYjiC-1030": {
    "id": "GwSGoYzUlG58vtmeYjiC-1030",
    "source": "GwSGoYzUlG58vtmeYjiC-1031",
    "target": "GwSGoYzUlG58vtmeYjiC-1056",
    "source_type": "bilingual_action",
    "target_type": "shortcut_node"
  },
  "2HodqpUpLX2VSRIkugpp-34": {
    "id": "2HodqpUpLX2VSRIkugpp-34",
    "source": "GwSGoYzUlG58vtmeYjiC-1059",
    "target": "2HodqpUpLX2VSRIkugpp-32",
    "source_type": "bilingual_action",
    "target_type": "fixed_condition"
  },
  "2HodqpUpLX2VSRIkugpp-36": {
    "id": "2HodqpUpLX2VSRIkugpp-36",
    "source": "GwSGoYzUlG58vtmeYjiC-1059",
    "target": "2HodqpUpLX2VSRIkugpp-33",
    "source_type": "bilingual_action",
    "target_type": "fixed_condition"
  },
  "GwSGoYzUlG58vtmeYjiC-1084": {
    "id": "GwSGoYzUlG58vtmeYjiC-1084",
    "source": "GwSGoYzUlG58vtmeYjiC-1085",
    "target": "GwSGoYzUlG58vtmeYjiC-960",
    "source_type": "destination_node",
    "target_type": "intent_flow"
  },
  "GwSGoYzUlG58vtmeYjiC-1086": {
    "id": "GwSGoYzUlG58vtmeYjiC-1086",
    "source": "GwSGoYzUlG58vtmeYjiC-1087",
    "target": "GwSGoYzUlG58vtmeYjiC-1186",
    "source_type": "bilingual_action",
    "target_type": "shortcut_node"
  },
  "GwSGoYzUlG58vtmeYjiC-1119": {
    "id": "GwSGoYzUlG58vtmeYjiC-1119",
    "source": "GwSGoYzUlG58vtmeYjiC-1120",
    "target": "GwSGoYzUlG58vtmeYjiC-1133",
    "source_type": "correction_node",
    "target_type": "bilingual_action"
  },
  "2HodqpUpLX2VSRIkugpp-60": {
    "id": "2HodqpUpLX2VSRIkugpp-60",
    "source": "GwSGoYzUlG58vtmeYjiC-1126",
    "target": "2HodqpUpLX2VSRIkugpp-58",
    "source_type": "intent_flow",
    "target_type": "fixed_condition"
  },
  "GwSGoYzUlG58vtmeYjiC-1130": {
    "id": "GwSGoYzUlG58vtmeYjiC-1130",
    "source": "GwSGoYzUlG58vtmeYjiC-1131",
    "target": "GwSGoYzUlG58vtmeYjiC-1195",
    "source_type": "fixed_condition",
    "target_type": "fixed_condition"
  },
  "2HodqpUpLX2VSRIkugpp-54": {
    "id": "2HodqpUpLX2VSRIkugpp-54",
    "source": "GwSGoYzUlG58vtmeYjiC-1131",
    "target": "2HodqpUpLX2VSRIkugpp-51",
    "source_type": "fixed_condition",
    "target_type": "fixed_condition"
  },
  "GwSGoYzUlG58vtmeYjiC-1132": {
    "id": "GwSGoYzUlG58vtmeYjiC-1132",
    "source": "GwSGoYzUlG58vtmeYjiC-1133",
    "target": "GwSGoYzUlG58vtmeYjiC-1185",
    "source_type": "bilingual_action",
    "target_type": "shortcut_node"
  },
  "GwSGoYzUlG58vtmeYjiC-1158": {
    "id": "GwSGoYzUlG58vtmeYjiC-1158",
    "source": "GwSGoYzUlG58vtmeYjiC-1159",
    "target": "GwSGoYzUlG58vtmeYjiC-1184",
    "source_type": "english_action",
    "target_type": "shortcut_node"
  },
  "GwSGoYzUlG58vtmeYjiC-1187": {
    "id": "GwSGoYzUlG58vtmeYjiC-1187",
    "source": "GwSGoYzUlG58vtmeYjiC-1188",
    "target": "GwSGoYzUlG58vtmeYjiC-1087",
    "source_type": "fixed_condition",
    "target_type": "bilingual_action"
  },
  "GwSGoYzUlG58vtmeYjiC-1194": {
    "id": "GwSGoYzUlG58vtmeYjiC-1194",
    "source": "GwSGoYzUlG58vtmeYjiC-1195",
    "target": "GwSGoYzUlG58vtmeYjiC-1197",
    "source_type": "fixed_condition",
    "target_type": "bilingual_action"
  },
  "GwSGoYzUlG58vtmeYjiC-1196": {
    "id": "GwSGoYzUlG58vtmeYjiC-1196",
    "source": "GwSGoYzUlG58vtmeYjiC-1197",
    "target": "GwSGoYzUlG58vtmeYjiC-1224",
    "source_type": "bilingual_action",
    "target_type": "bilingual_action"
  },
  "2HodqpUpLX2VSRIkugpp-41": {
    "id": "2HodqpUpLX2VSRIkugpp-41",
    "source": "GwSGoYzUlG58vtmeYjiC-1224",
    "target": "2HodqpUpLX2VSRIkugpp-39",
    "source_type": "bilingual_action",
    "target_type": "fixed_condition"
  },
  "2HodqpUpLX2VSRIkugpp-43": {
    "id": "2HodqpUpLX2VSRIkugpp-43",
    "source": "GwSGoYzUlG58vtmeYjiC-1224",
    "target": "2HodqpUpLX2VSRIkugpp-40",
    "source_type": "bilingual_action",
    "target_type": "fixed_condition"
  },
  "GwSGoYzUlG58vtmeYjiC-1259": {
    "id": "GwSGoYzUlG58vtmeYjiC-1259",
    "source": "GwSGoYzUlG58vtmeYjiC-1260",
    "target": "GwSGoYzUlG58vtmeYjiC-1311",
    "source_type": "english_action",
    "target_type": "shortcut_node"
  },
  "GwSGoYzUlG58vtmeYjiC-1285": {
    "id": "GwSGoYzUlG58vtmeYjiC-1285",
    "source": "GwSGoYzUlG58vtmeYjiC-1286",
    "target": "GwSGoYzUlG58vtmeYjiC-1311",
    "source_type": "english_action",
    "target_type": "shortcut_node"
  },
  "GwSGoYzUlG58vtmeYjiC-1312": {
    "id": "GwSGoYzUlG58vtmeYjiC-1312",
    "source": "GwSGoYzUlG58vtmeYjiC-1313",
    "target": "GwSGoYzUlG58vtmeYjiC-1387",
    "source_type": "bilingual_action",
    "target_type": "shortcut_node"
  },
  "GwSGoYzUlG58vtmeYjiC-1347": {
    "id": "GwSGoYzUlG58vtmeYjiC-1347",
    "source": "GwSGoYzUlG58vtmeYjiC-1348",
    "target": "GwSGoYzUlG58vtmeYjiC-1399",
    "source_type": "correction_node",
    "target_type": "bilingual_action"
  },
  "2HodqpUpLX2VSRIkugpp-88": {
    "id": "2HodqpUpLX2VSRIkugpp-88",
    "source": "GwSGoYzUlG58vtmeYjiC-1354",
    "target": "2HodqpUpLX2VSRIkugpp-64",
    "source_type": "intent_flow",
    "target_type": "fixed_condition"
  },
  "GwSGoYzUlG58vtmeYjiC-1357": {
    "id": "GwSGoYzUlG58vtmeYjiC-1357",
    "source": "GwSGoYzUlG58vtmeYjiC-1359",
    "target": "GwSGoYzUlG58vtmeYjiC-1396",
    "source_type": "fixed_condition",
    "target_type": "fixed_condition"
  },
  "2HodqpUpLX2VSRIkugpp-82": {
    "id": "2HodqpUpLX2VSRIkugpp-82",
    "source": "GwSGoYzUlG58vtmeYjiC-1359",
    "target": "2HodqpUpLX2VSRIkugpp-81",
    "source_type": "fixed_condition",
    "target_type": "fixed_condition"
  },
  "GwSGoYzUlG58vtmeYjiC-1360": {
    "id": "GwSGoYzUlG58vtmeYjiC-1360",
    "source": "GwSGoYzUlG58vtmeYjiC-1361",
    "target": "GwSGoYzUlG58vtmeYjiC-1386",
    "source_type": "english_action",
    "target_type": "shortcut_node"
  },
  "GwSGoYzUlG58vtmeYjiC-1388": {
    "id": "GwSGoYzUlG58vtmeYjiC-1388",
    "source": "GwSGoYzUlG58vtmeYjiC-1389",
    "target": "GwSGoYzUlG58vtmeYjiC-1313",
    "source_type": "fixed_condition",
    "target_type": "bilingual_action"
  },
  "GwSGoYzUlG58vtmeYjiC-1395": {
    "id": "GwSGoYzUlG58vtmeYjiC-1395",
    "source": "GwSGoYzUlG58vtmeYjiC-1396",
    "target": "GwSGoYzUlG58vtmeYjiC-1488",
    "source_type": "fixed_condition",
    "target_type": "bilingual_action"
  },
  "2HodqpUpLX2VSRIkugpp-111": {
    "id": "2HodqpUpLX2VSRIkugpp-111",
    "source": "GwSGoYzUlG58vtmeYjiC-1399",
    "target": "2HodqpUpLX2VSRIkugpp-109",
    "source_type": "bilingual_action",
    "target_type": "fixed_condition"
  },
  "2HodqpUpLX2VSRIkugpp-113": {
    "id": "2HodqpUpLX2VSRIkugpp-113",
    "source": "GwSGoYzUlG58vtmeYjiC-1399",
    "target": "2HodqpUpLX2VSRIkugpp-110",
    "source_type": "bilingual_action",
    "target_type": "fixed_condition"
  },
  "GwSGoYzUlG58vtmeYjiC-1434": {
    "id": "GwSGoYzUlG58vtmeYjiC-1434",
    "source": "GwSGoYzUlG58vtmeYjiC-1435",
    "target": "GwSGoYzUlG58vtmeYjiC-1486",
    "source_type": "english_action",
    "target_type": "shortcut_node"
  },
  "GwSGoYzUlG58vtmeYjiC-1460": {
    "id": "GwSGoYzUlG58vtmeYjiC-1460",
    "source": "GwSGoYzUlG58vtmeYjiC-1461",
    "target": "GwSGoYzUlG58vtmeYjiC-1486",
    "source_type": "english_action",
    "target_type": "shortcut_node"
  },
  "GwSGoYzUlG58vtmeYjiC-1487": {
    "id": "GwSGoYzUlG58vtmeYjiC-1487",
    "source": "GwSGoYzUlG58vtmeYjiC-1488",
    "target": "GwSGoYzUlG58vtmeYjiC-1515",
    "source_type": "bilingual_action",
    "target_type": "bilingual_action"
  },
  "2HodqpUpLX2VSRIkugpp-115": {
    "id": "2HodqpUpLX2VSRIkugpp-115",
    "source": "GwSGoYzUlG58vtmeYjiC-1515",
    "target": "2HodqpUpLX2VSRIkugpp-107",
    "source_type": "bilingual_action",
    "target_type": "fixed_condition"
  },
  "2HodqpUpLX2VSRIkugpp-119": {
    "id": "2HodqpUpLX2VSRIkugpp-119",
    "source": "GwSGoYzUlG58vtmeYjiC-1515",
    "target": "2HodqpUpLX2VSRIkugpp-108",
    "source_type": "bilingual_action",
    "target_type": "fixed_condition"
  },
  "GwSGoYzUlG58vtmeYjiC-1550": {
    "id": "GwSGoYzUlG58vtmeYjiC-1550",
    "source": "GwSGoYzUlG58vtmeYjiC-1551",
    "target": "GwSGoYzUlG58vtmeYjiC-1602",
    "source_type": "english_action",
    "target_type": "shortcut_node"
  },
  "GwSGoYzUlG58vtmeYjiC-1576": {
    "id": "GwSGoYzUlG58vtmeYjiC-1576",
    "source": "GwSGoYzUlG58vtmeYjiC-1577",
    "target": "GwSGoYzUlG58vtmeYjiC-1602",
    "source_type": "english_action",
    "target_type": "shortcut_node"
  },
  "2HodqpUpLX2VSRIkugpp-2": {
    "id": "2HodqpUpLX2VSRIkugpp-2",
    "source": "GwSGoYzUlG58vtmeYjiC-1629",
    "target": "2HodqpUpLX2VSRIkugpp-1",
    "source_type": "fixed_condition",
    "target_type": "fixed_condition"
  },
  "GwSGoYzUlG58vtmeYjiC-1630": {
    "id": "GwSGoYzUlG58vtmeYjiC-1630",
    "source": "GwSGoYzUlG58vtmeYjiC-1603",
    "target": "GwSGoYzUlG58vtmeYjiC-166",
    "source_type": "bilingual_action",
    "target_type": "bilingual_action"
  },
  "GwSGoYzUlG58vtmeYjiC-1631": {
    "id": "GwSGoYzUlG58vtmeYjiC-1631",
    "source": "GwSGoYzUlG58vtmeYjiC-1354",
    "target": "GwSGoYzUlG58vtmeYjiC-1389",
    "source_type": "intent_flow",
    "target_type": "fixed_condition"
  },
  "GwSGoYzUlG58vtmeYjiC-1633": {
    "id": "GwSGoYzUlG58vtmeYjiC-1633",
    "source": "GwSGoYzUlG58vtmeYjiC-1126",
    "target": "GwSGoYzUlG58vtmeYjiC-1188",
    "source_type": "intent_flow",
    "target_type": "fixed_condition"
  },
  "GwSGoYzUlG58vtmeYjiC-1647": {
    "id": "GwSGoYzUlG58vtmeYjiC-1647",
    "source": "GwSGoYzUlG58vtmeYjiC-1648",
    "target": "GwSGoYzUlG58vtmeYjiC-1699",
    "source_type": "english_action",
    "target_type": "shortcut_node"
  },
  "GwSGoYzUlG58vtmeYjiC-1673": {
    "id": "GwSGoYzUlG58vtmeYjiC-1673",
    "source": "GwSGoYzUlG58vtmeYjiC-1674",
    "target": "GwSGoYzUlG58vtmeYjiC-1699",
    "source_type": "english_action",
    "target_type": "shortcut_node"
  },
  "GwSGoYzUlG58vtmeYjiC-1703": {
    "id": "GwSGoYzUlG58vtmeYjiC-1703",
    "source": "GwSGoYzUlG58vtmeYjiC-960",
    "target": "GwSGoYzUlG58vtmeYjiC-1022",
    "source_type": "intent_flow",
    "target_type": "fixed_condition"
  },
  "PnucuaZuXBeo7sRjAMGR-3": {
    "id": "PnucuaZuXBeo7sRjAMGR-3",
    "source": "PnucuaZuXBeo7sRjAMGR-2",
    "target": "GwSGoYzUlG58vtmeYjiC-3",
    "source_type": "fixed_condition",
    "target_type": "english_action"
  },
  "PnucuaZuXBeo7sRjAMGR-7": {
    "id": "PnucuaZuXBeo7sRjAMGR-7",
    "source": "PnucuaZuXBeo7sRjAMGR-5",
    "target": "GwSGoYzUlG58vtmeYjiC-652",
    "source_type": "fixed_condition",
    "target_type": "english_action"
  },
  "PnucuaZuXBeo7sRjAMGR-10": {
    "id": "PnucuaZuXBeo7sRjAMGR-10",
    "source": "PnucuaZuXBeo7sRjAMGR-8",
    "target": "GwSGoYzUlG58vtmeYjiC-301",
    "source_type": "fixed_condition",
    "target_type": "fixed_condition"
  },
  "PnucuaZuXBeo7sRjAMGR-16": {
    "id": "PnucuaZuXBeo7sRjAMGR-16",
    "source": "PnucuaZuXBeo7sRjAMGR-8",
    "target": "PnucuaZuXBeo7sRjAMGR-12",
    "source_type": "fixed_condition",
    "target_type": "fixed_condition"
  },
  "PnucuaZuXBeo7sRjAMGR-15": {
    "id": "PnucuaZuXBeo7sRjAMGR-15",
    "source": "PnucuaZuXBeo7sRjAMGR-12",
    "target": "PnucuaZuXBeo7sRjAMGR-14",
    "source_type": "fixed_condition",
    "target_type": "fixed_condition"
  },
  "PnucuaZuXBeo7sRjAMGR-17": {
    "id": "PnucuaZuXBeo7sRjAMGR-17",
    "source": "PnucuaZuXBeo7sRjAMGR-14",
    "target": "2HodqpUpLX2VSRIkugpp-5",
    "source_type": "fixed_condition",
    "target_type": "fixed_condition"
  },
  "2HodqpUpLX2VSRIkugpp-7": {
    "id": "2HodqpUpLX2VSRIkugpp-7",
    "source": "PnucuaZuXBeo7sRjAMGR-14",
    "target": "GwSGoYzUlG58vtmeYjiC-65",
    "source_type": "fixed_condition",
    "target_type": "fixed_condition"
  },
  "2HodqpUpLX2VSRIkugpp-3": {
    "id": "2HodqpUpLX2VSRIkugpp-3",
    "source": "2HodqpUpLX2VSRIkugpp-1",
    "target": "GwSGoYzUlG58vtmeYjiC-50",
    "source_type": "fixed_condition",
    "target_type": "fixed_condition"
  },
  "2HodqpUpLX2VSRIkugpp-4": {
    "id": "2HodqpUpLX2VSRIkugpp-4",
    "source": "2HodqpUpLX2VSRIkugpp-1",
    "target": "GwSGoYzUlG58vtmeYjiC-52",
    "source_type": "fixed_condition",
    "target_type": "fixed_condition"
  },
  "2HodqpUpLX2VSRIkugpp-6": {
    "id": "2HodqpUpLX2VSRIkugpp-6",
    "source": "2HodqpUpLX2VSRIkugpp-5",
    "target": "GwSGoYzUlG58vtmeYjiC-518",
    "source_type": "fixed_condition",
    "target_type": "bilingual_action"
  },
  "2HodqpUpLX2VSRIkugpp-10": {
    "id": "2HodqpUpLX2VSRIkugpp-10",
    "source": "2HodqpUpLX2VSRIkugpp-8",
    "target": "GwSGoYzUlG58vtmeYjiC-107",
    "source_type": "fixed_condition",
    "target_type": "english_action"
  },
  "2HodqpUpLX2VSRIkugpp-14": {
    "id": "2HodqpUpLX2VSRIkugpp-14",
    "source": "2HodqpUpLX2VSRIkugpp-11",
    "target": "GwSGoYzUlG58vtmeYjiC-746",
    "source_type": "fixed_condition",
    "target_type": "english_action"
  },
  "2HodqpUpLX2VSRIkugpp-13": {
    "id": "2HodqpUpLX2VSRIkugpp-13",
    "source": "2HodqpUpLX2VSRIkugpp-12",
    "target": "GwSGoYzUlG58vtmeYjiC-772",
    "source_type": "fixed_condition",
    "target_type": "english_action"
  },
  "2HodqpUpLX2VSRIkugpp-17": {
    "id": "2HodqpUpLX2VSRIkugpp-17",
    "source": "2HodqpUpLX2VSRIkugpp-19",
    "target": "2HodqpUpLX2VSRIkugpp-20",
    "source_type": "fixed_condition",
    "target_type": "fixed_condition"
  },
  "2HodqpUpLX2VSRIkugpp-18": {
    "id": "2HodqpUpLX2VSRIkugpp-18",
    "source": "2HodqpUpLX2VSRIkugpp-19",
    "target": "2HodqpUpLX2VSRIkugpp-21",
    "source_type": "fixed_condition",
    "target_type": "fixed_condition"
  },
  "2HodqpUpLX2VSRIkugpp-22": {
    "id": "2HodqpUpLX2VSRIkugpp-22",
    "source": "2HodqpUpLX2VSRIkugpp-20",
    "target": "GwSGoYzUlG58vtmeYjiC-892",
    "source_type": "fixed_condition",
    "target_type": "bilingual_action"
  },
  "2HodqpUpLX2VSRIkugpp-23": {
    "id": "2HodqpUpLX2VSRIkugpp-23",
    "source": "2HodqpUpLX2VSRIkugpp-21",
    "target": "GwSGoYzUlG58vtmeYjiC-855",
    "source_type": "fixed_condition",
    "target_type": "english_action"
  },
  "2HodqpUpLX2VSRIkugpp-24": {
    "id": "2HodqpUpLX2VSRIkugpp-24",
    "source": "2HodqpUpLX2VSRIkugpp-25",
    "target": "2HodqpUpLX2VSRIkugpp-26",
    "source_type": "fixed_condition",
    "target_type": "fixed_condition"
  },
  "2HodqpUpLX2VSRIkugpp-30": {
    "id": "2HodqpUpLX2VSRIkugpp-30",
    "source": "2HodqpUpLX2VSRIkugpp-26",
    "target": "2HodqpUpLX2VSRIkugpp-28",
    "source_type": "fixed_condition",
    "target_type": "fixed_condition"
  },
  "2HodqpUpLX2VSRIkugpp-31": {
    "id": "2HodqpUpLX2VSRIkugpp-31",
    "source": "2HodqpUpLX2VSRIkugpp-26",
    "target": "2HodqpUpLX2VSRIkugpp-19",
    "source_type": "fixed_condition",
    "target_type": "fixed_condition"
  },
  "2HodqpUpLX2VSRIkugpp-29": {
    "id": "2HodqpUpLX2VSRIkugpp-29",
    "source": "2HodqpUpLX2VSRIkugpp-28",
    "target": "GwSGoYzUlG58vtmeYjiC-841",
    "source_type": "fixed_condition",
    "target_type": "correction_node"
  },
  "2HodqpUpLX2VSRIkugpp-35": {
    "id": "2HodqpUpLX2VSRIkugpp-35",
    "source": "2HodqpUpLX2VSRIkugpp-32",
    "target": "GwSGoYzUlG58vtmeYjiC-1648",
    "source_type": "fixed_condition",
    "target_type": "english_action"
  },
  "2HodqpUpLX2VSRIkugpp-38": {
    "id": "2HodqpUpLX2VSRIkugpp-38",
    "source": "2HodqpUpLX2VSRIkugpp-33",
    "target": "GwSGoYzUlG58vtmeYjiC-1674",
    "source_type": "fixed_condition",
    "target_type": "english_action"
  },
  "2HodqpUpLX2VSRIkugpp-42": {
    "id": "2HodqpUpLX2VSRIkugpp-42",
    "source": "2HodqpUpLX2VSRIkugpp-39",
    "target": "GwSGoYzUlG58vtmeYjiC-1260",
    "source_type": "fixed_condition",
    "target_type": "english_action"
  },
  "2HodqpUpLX2VSRIkugpp-44": {
    "id": "2HodqpUpLX2VSRIkugpp-44",
    "source": "2HodqpUpLX2VSRIkugpp-40",
    "target": "GwSGoYzUlG58vtmeYjiC-1286",
    "source_type": "fixed_condition",
    "target_type": "english_action"
  },
  "2HodqpUpLX2VSRIkugpp-49": {
    "id": "2HodqpUpLX2VSRIkugpp-49",
    "source": "2HodqpUpLX2VSRIkugpp-45",
    "target": "GwSGoYzUlG58vtmeYjiC-310",
    "source_type": "fixed_condition",
    "target_type": "english_action"
  },
  "2HodqpUpLX2VSRIkugpp-50": {
    "id": "2HodqpUpLX2VSRIkugpp-50",
    "source": "2HodqpUpLX2VSRIkugpp-46",
    "target": "GwSGoYzUlG58vtmeYjiC-336",
    "source_type": "fixed_condition",
    "target_type": "english_action"
  },
  "2HodqpUpLX2VSRIkugpp-53": {
    "id": "2HodqpUpLX2VSRIkugpp-53",
    "source": "2HodqpUpLX2VSRIkugpp-51",
    "target": "GwSGoYzUlG58vtmeYjiC-1159",
    "source_type": "fixed_condition",
    "target_type": "english_action"
  },
  "2HodqpUpLX2VSRIkugpp-56": {
    "id": "2HodqpUpLX2VSRIkugpp-56",
    "source": "2HodqpUpLX2VSRIkugpp-55",
    "target": "GwSGoYzUlG58vtmeYjiC-1120",
    "source_type": "fixed_condition",
    "target_type": "correction_node"
  },
  "2HodqpUpLX2VSRIkugpp-57": {
    "id": "2HodqpUpLX2VSRIkugpp-57",
    "source": "2HodqpUpLX2VSRIkugpp-58",
    "target": "2HodqpUpLX2VSRIkugpp-59",
    "source_type": "fixed_condition",
    "target_type": "fixed_condition"
  },
  "2HodqpUpLX2VSRIkugpp-61": {
    "id": "2HodqpUpLX2VSRIkugpp-61",
    "source": "2HodqpUpLX2VSRIkugpp-59",
    "target": "GwSGoYzUlG58vtmeYjiC-1131",
    "source_type": "fixed_condition",
    "target_type": "fixed_condition"
  },
  "2HodqpUpLX2VSRIkugpp-62": {
    "id": "2HodqpUpLX2VSRIkugpp-62",
    "source": "2HodqpUpLX2VSRIkugpp-59",
    "target": "2HodqpUpLX2VSRIkugpp-55",
    "source_type": "fixed_condition",
    "target_type": "fixed_condition"
  },
  "2HodqpUpLX2VSRIkugpp-63": {
    "id": "2HodqpUpLX2VSRIkugpp-63",
    "source": "2HodqpUpLX2VSRIkugpp-64",
    "target": "2HodqpUpLX2VSRIkugpp-65",
    "source_type": "fixed_condition",
    "target_type": "fixed_condition"
  },
  "2HodqpUpLX2VSRIkugpp-86": {
    "id": "2HodqpUpLX2VSRIkugpp-86",
    "source": "2HodqpUpLX2VSRIkugpp-65",
    "target": "GwSGoYzUlG58vtmeYjiC-1359",
    "source_type": "fixed_condition",
    "target_type": "fixed_condition"
  },
  "2HodqpUpLX2VSRIkugpp-87": {
    "id": "2HodqpUpLX2VSRIkugpp-87",
    "source": "2HodqpUpLX2VSRIkugpp-65",
    "target": "2HodqpUpLX2VSRIkugpp-84",
    "source_type": "fixed_condition",
    "target_type": "fixed_condition"
  },
  "2HodqpUpLX2VSRIkugpp-66": {
    "id": "2HodqpUpLX2VSRIkugpp-66",
    "source": "2HodqpUpLX2VSRIkugpp-67",
    "target": "2HodqpUpLX2VSRIkugpp-68",
    "source_type": "fixed_condition",
    "target_type": "fixed_condition"
  },
  "2HodqpUpLX2VSRIkugpp-75": {
    "id": "2HodqpUpLX2VSRIkugpp-75",
    "source": "2HodqpUpLX2VSRIkugpp-68",
    "target": "GwSGoYzUlG58vtmeYjiC-965",
    "source_type": "fixed_condition",
    "target_type": "fixed_condition"
  },
  "2HodqpUpLX2VSRIkugpp-79": {
    "id": "2HodqpUpLX2VSRIkugpp-79",
    "source": "2HodqpUpLX2VSRIkugpp-68",
    "target": "2HodqpUpLX2VSRIkugpp-77",
    "source_type": "fixed_condition",
    "target_type": "fixed_condition"
  },
  "2HodqpUpLX2VSRIkugpp-74": {
    "id": "2HodqpUpLX2VSRIkugpp-74",
    "source": "2HodqpUpLX2VSRIkugpp-72",
    "target": "GwSGoYzUlG58vtmeYjiC-993",
    "source_type": "fixed_condition",
    "target_type": "english_action"
  },
  "2HodqpUpLX2VSRIkugpp-78": {
    "id": "2HodqpUpLX2VSRIkugpp-78",
    "source": "2HodqpUpLX2VSRIkugpp-77",
    "target": "GwSGoYzUlG58vtmeYjiC-953",
    "source_type": "fixed_condition",
    "target_type": "correction_node"
  },
  "2HodqpUpLX2VSRIkugpp-83": {
    "id": "2HodqpUpLX2VSRIkugpp-83",
    "source": "2HodqpUpLX2VSRIkugpp-81",
    "target": "GwSGoYzUlG58vtmeYjiC-1361",
    "source_type": "fixed_condition",
    "target_type": "english_action"
  },
  "2HodqpUpLX2VSRIkugpp-85": {
    "id": "2HodqpUpLX2VSRIkugpp-85",
    "source": "2HodqpUpLX2VSRIkugpp-84",
    "target": "GwSGoYzUlG58vtmeYjiC-1348",
    "source_type": "fixed_condition",
    "target_type": "correction_node"
  },
  "2HodqpUpLX2VSRIkugpp-92": {
    "id": "2HodqpUpLX2VSRIkugpp-92",
    "source": "2HodqpUpLX2VSRIkugpp-89",
    "target": "GwSGoYzUlG58vtmeYjiC-466",
    "source_type": "fixed_condition",
    "target_type": "english_action"
  },
  "2HodqpUpLX2VSRIkugpp-91": {
    "id": "2HodqpUpLX2VSRIkugpp-91",
    "source": "2HodqpUpLX2VSRIkugpp-90",
    "target": "GwSGoYzUlG58vtmeYjiC-492",
    "source_type": "fixed_condition",
    "target_type": "english_action"
  },
  "2HodqpUpLX2VSRIkugpp-100": {
    "id": "2HodqpUpLX2VSRIkugpp-100",
    "source": "2HodqpUpLX2VSRIkugpp-95",
    "target": "GwSGoYzUlG58vtmeYjiC-399",
    "source_type": "fixed_condition",
    "target_type": "english_action"
  },
  "2HodqpUpLX2VSRIkugpp-99": {
    "id": "2HodqpUpLX2VSRIkugpp-99",
    "source": "2HodqpUpLX2VSRIkugpp-96",
    "target": "GwSGoYzUlG58vtmeYjiC-425",
    "source_type": "fixed_condition",
    "target_type": "english_action"
  },
  "2HodqpUpLX2VSRIkugpp-104": {
    "id": "2HodqpUpLX2VSRIkugpp-104",
    "source": "2HodqpUpLX2VSRIkugpp-101",
    "target": "GwSGoYzUlG58vtmeYjiC-572",
    "source_type": "fixed_condition",
    "target_type": "english_action"
  },
  "2HodqpUpLX2VSRIkugpp-106": {
    "id": "2HodqpUpLX2VSRIkugpp-106",
    "source": "2HodqpUpLX2VSRIkugpp-102",
    "target": "GwSGoYzUlG58vtmeYjiC-598",
    "source_type": "fixed_condition",
    "target_type": "english_action"
  },
  "2HodqpUpLX2VSRIkugpp-117": {
    "id": "2HodqpUpLX2VSRIkugpp-117",
    "source": "2HodqpUpLX2VSRIkugpp-107",
    "target": "GwSGoYzUlG58vtmeYjiC-1551",
    "source_type": "fixed_condition",
    "target_type": "english_action"
  },
  "2HodqpUpLX2VSRIkugpp-118": {
    "id": "2HodqpUpLX2VSRIkugpp-118",
    "source": "2HodqpUpLX2VSRIkugpp-108",
    "target": "GwSGoYzUlG58vtmeYjiC-1577",
    "source_type": "fixed_condition",
    "target_type": "english_action"
  },
  "2HodqpUpLX2VSRIkugpp-112": {
    "id": "2HodqpUpLX2VSRIkugpp-112",
    "source": "2HodqpUpLX2VSRIkugpp-109",
    "target": "GwSGoYzUlG58vtmeYjiC-1435",
    "source_type": "fixed_condition",
    "target_type": "english_action"
  },
  "2HodqpUpLX2VSRIkugpp-114": {
    "id": "2HodqpUpLX2VSRIkugpp-114",
    "source": "2HodqpUpLX2VSRIkugpp-110",
    "target": "GwSGoYzUlG58vtmeYjiC-1461",
    "source_type": "fixed_condition",
    "target_type": "english_action"
  }
}