{
  "question_1": [
    {
      "phrase_wrong": "Around a year",
      "phrase_correct": "About a year",
      "question": "How long have you been working here?",
      "guide": "'Around' chỉ dùng để nói về mốc thời gian tương đối. Ví dụ: 'KHOẢNG 2 GIỜ CHIỀU' là 'AROUND 2 PM'. Để nói về một khoảng thời gian ta dùng 'ABOUT'."
    },
    {
      "phrase_wrong": "More to a year",
      "phrase_correct": "More than a year",
      "question": "How long have you been working here?",
      "guide": "Để nói 'nhiều hơn' ta dùng 'than' chứ không dùng 'to'. 'Than' là 'so với', dùng khi so sánh cái này với cái kia."
    },
    {
      "phrase_wrong": "I have been working at my company about a year",
      "phrase_correct": "I have been working at my company for about a year",
      "question": "How long have you been working here?",
      "guide": "Khi nói về việc đã làm gì trong bao lâu, ta cần dùng giới từ 'for' trước thời gian."
    }
  ]
}