[
  {
    "intents": [
      "intent_type_person_hard_working"
    ],
    "params": {
      "person_quality": [
        "hard-working person"
      ]
    },
    "pattern": {
      "regex": [
        "\\b(hard working|hard-working|diligent|painstaking|industrious|laborious)\\b",
        "\\b(working) (man|woman|person|one)\\b"
      ],
      "black_regex": [
      ]
    }
  },
  {
    "intents": [
      "intent_type_person_creative"
    ],
    "params": {
      "person_quality": [
        "creative person"
      ]
    },
    "pattern": {
      "regex": [
        "\\b(creative|creationist|imaginative|innovative)\\b"
      ],
      "black_regex": [
      ]
    }
  }
]
