{
   "cần thơ": "thành phố",
   "hà nội": "thành phố",
   "hải phòng": "thành phố",
   "hồ chí minh": "thành phố",
   "đà nẵng": "thành phố",
   "an giang": "tỉnh",
   "bà rịa vũng tàu": "tỉnh",
   "bình dương": "tỉnh",
   "bình phước": "tỉnh",
   "bình thuận": "tỉnh",
   "bình định": "tỉnh",
   "bạc liêu": "tỉnh",
   "bắc giang": "tỉnh",
   "bắc kạn": "tỉnh",
   "bắc ninh": "tỉnh",
   "bến tre": "tỉnh",
   "cao bằng": "tỉnh",
   "cà mau": "tỉnh",
   "gia lai": "tỉnh",
   "hòa bình": "tỉnh",
   "hà giang": "tỉnh",
   "hà nam": "tỉnh",
   "hà tĩnh": "tỉnh",
   "hưng yên": "tỉnh",
   "hải dương": "tỉnh",
   "hậu giang": "tỉnh",
   "khánh hòa": "tỉnh",
   "kiên giang": "tỉnh",
   "kon tum": "tỉnh",
   "lai châu": "tỉnh",
   "long an": "tỉnh",
   "lào cai": "tỉnh",
   "lâm đồng": "tỉnh",
   "lạng sơn": "tỉnh",
   "nam định": "tỉnh",
   "nghệ an": "tỉnh",
   "ninh bình": "tỉnh",
   "ninh thuận": "tỉnh",
   "phú thọ": "tỉnh",
   "phú yên": "tỉnh",
   "quảng bình": "tỉnh",
   "quảng nam": "tỉnh",
   "quảng ngãi": "tỉnh",
   "quảng ninh": "tỉnh",
   "quảng trị": "tỉnh",
   "sóc trăng": "tỉnh",
   "sơn la": "tỉnh",
   "thanh hóa": "tỉnh",
   "thái bình": "tỉnh",
   "thái nguyên": "tỉnh",
   "thừa thiên huế": "tỉnh",
   "tiền giang": "tỉnh",
   "trà vinh": "tỉnh",
   "tuyên quang": "tỉnh",
   "tây ninh": "tỉnh",
   "vĩnh long": "tỉnh",
   "vĩnh phúc": "tỉnh",
   "yên bái": "tỉnh",
   "điện biên": "tỉnh",
   "đắk lắk": "tỉnh",
   "đắk nông": "tỉnh",
   "đồng nai": "tỉnh",
   "đồng tháp": "tỉnh"
}