{
  "RegexJobAndWorkplace": {
    "job": {
      "lookup": [
        "lookup/job.md"
      ],
      "pattern": [
      ]
    },
    "workplace": {
      "lookup": [
        "lookup/workplace.md"
      ],
      "pattern": [
      ]
    }
  }
}