{
  "bilingual_action": {
    "one_2_one": [
      "end_node",
      "bilingual_action",
      "english_action",
      "update_local",
      "api_node",
      "shortcut_node",
      "destination_node",
      "correction"
    ],
    "not_connect_to": [
      "start_node"
    ],
    "is_open": true
  },
  "english_action": {
    "one_2_one": [
      "end_node",
      "bilingual_action",
      "english_action",
      "update_local",
      "api_node",
      "shortcut_node",
      "destination_node",
      "correction"
    ],
    "not_connect_to": [
      "start_node"
    ],
    "is_open": true
  },
  "condition_flow": {
    "one_2_one": [
      "bilingual_action",
      "english_action",
      "shortcut_node",
      "destination_node",
      "correction"
    ],
    "not_connect_to": [
      "start_node",
      "end_node",
      "update_local",
      "api_node"
    ],
    "is_open": true
  },
  "intent_flow": {
    "one_2_one": [
      "bilingual_action",
      "english_action",
      "shortcut_node",
      "destination_node",
      "correction"
    ],
    "not_connect_to": [
      "start_node",
      "end_node",
      "update_local",
      "api_node"
    ],
    "is_open": true
  },
  "update_local": {
    "one_2_one": [
      "bilingual_action",
      "english_action",
      "shortcut_node",
      "destination_node",
      "correction"
    ],
    "not_connect_to": [
      "start_node",
      "end_node",
      "update_local",
      "api_node"
    ],
    "is_open": true
  },
  "fixed_condition": {
    "one_2_one": [
      "bilingual_action",
      "english_action",
      "shortcut_node",
      "destination_node",
      "correction"
    ],
    "not_connect_to": [
      "start_node",
      "end_node",
      "update_local",
      "api_node"
    ],
    "is_open": true
  },
  "start_node": {
    "one_2_one": [
      "bilingual_action",
      "english_action",
      "update_local",
      "api_node",
      "shortcut_node",
      "destination_node"
    ],
    "not_connect_to": [
      "start_node",
      "end_node",
      "correction_node"
    ],
    "is_open": true
  },
  "end_node": {
    "one_2_one": [
    ],
    "not_connect_to": [
      "start_node",
      "end_node",
      "bilingual_action",
      "english_action",
      "update_local",
      "intent_flow",
      "condition_flow",
      "api_node",
      "shortcut_node",
      "destination_node",
      "correction_node"
    ],
    "is_open": false
  },
  "destination_node": {
    "one_2_one": [
    ],
    "not_connect_to": [
    ],
    "is_open": true
  },
  "shortcut_node": {
    "one_2_one": [
    ],
    "not_connect_to": [
      "start_node",
      "end_node",
      "bilingual_action",
      "english_action",
      "update_local",
      "intent_flow",
      "condition_flow",
      "api_node",
      "shortcut_node",
      "destination_node",
      "correction_node"
    ],
    "is_open": false
  },
  "correction_node": {
    "one_2_one": [
      "end_node",
      "bilingual_action",
      "english_action",
      "shortcut_node",
      "destination_node"
    ],
    "not_connect_to": [
      "start_node",
      "update_local",
      "api_node",
      "correction"
    ],
    "is_open": true
  },
  "api_node": {
    "one_2_one": [
      "end_node",
      "bilingual_action",
      "english_action",
      "shortcut_node",
      "destination_node"
    ],
    "not_connect_to": [
      "start_node",
      "update_local",
      "api_node",
      "correction"
    ],
    "is_open": true
  },
  "user_information": {
    "one_2_one": [
    ],
    "not_connect_to": [
      "start_node",
      "end_node",
      "bilingual_action",
      "english_action",
      "update_local",
      "intent_flow",
      "condition_flow",
      "api_node",
      "shortcut_node",
      "destination_node",
      "correction_node"
    ],
    "is_open": false
  },
  "notification_node": {
    "one_2_one": [
    ],
    "not_connect_to": [
      "start_node",
      "end_node",
      "bilingual_action",
      "english_action",
      "update_local",
      "intent_flow",
      "condition_flow",
      "api_node",
      "shortcut_node",
      "destination_node",
      "correction_node"
    ],
    "is_open": false
  }
}