{
   "ninh kiều": [
      "cần thơ"
   ],
   "ô môn": [
      "cần thơ"
   ],
   "bình thủy": [
      "cần thơ"
   ],
   "cái răng": [
      "cần thơ"
   ],
   "thốt nốt": [
      "cần thơ"
   ],
   "vĩnh thạnh": [
      "cần thơ",
      "bình định"
   ],
   "cờ đỏ": [
      "cần thơ"
   ],
   "phong điền": [
      "cần thơ",
      "thừa thiên huế"
   ],
   "thới lai": [
      "cần thơ"
   ],
   "ba đình": [
      "hà nội"
   ],
   "3 đình": [
      "hà nội"
   ],
   "hoàn kiếm": [
      "hà nội"
   ],
   "tây hồ": [
      "hà nội"
   ],
   "long biên": [
      "hà nội"
   ],
   "cầu giấy": [
      "hà nội"
   ],
   "đống đa": [
      "hà nội"
   ],
   "hai bà trưng": [
      "hà nội"
   ],
   "2 bà trưng": [
      "hà nội"
   ],
   "hoàng mai": [
      "hà nội",
      "nghệ an"
   ],
   "thanh xuân": [
      "hà nội"
   ],
   "sóc sơn": [
      "hà nội"
   ],
   "đông anh": [
      "hà nội"
   ],
   "gia lâm": [
      "hà nội"
   ],
   "nam từ liêm": [
      "hà nội"
   ],
   "thanh trì": [
      "hà nội"
   ],
   "bắc từ liêm": [
      "hà nội"
   ],
   "mê linh": [
      "hà nội"
   ],
   "hà đông": [
      "hà nội"
   ],
   "sơn tây": [
      "hà nội",
      "quảng ngãi"
   ],
   "ba vì": [
      "hà nội"
   ],
   "3 vì": [
      "hà nội"
   ],
   "phúc thọ": [
      "hà nội"
   ],
   "đan phượng": [
      "hà nội"
   ],
   "hoài đức": [
      "hà nội"
   ],
   "quốc oai": [
      "hà nội"
   ],
   "thạch thất": [
      "hà nội"
   ],
   "chương mỹ": [
      "hà nội"
   ],
   "thanh oai": [
      "hà nội"
   ],
   "thường tín": [
      "hà nội"
   ],
   "phú xuyên": [
      "hà nội"
   ],
   "ứng hòa": [
      "hà nội"
   ],
   "mỹ đức": [
      "hà nội"
   ],
   "hồng bàng": [
      "hải phòng"
   ],
   "ngô quyền": [
      "hải phòng"
   ],
   "lê chân": [
      "hải phòng"
   ],
   "hải an": [
      "hải phòng"
   ],
   "kiến an": [
      "hải phòng"
   ],
   "đồ sơn": [
      "hải phòng"
   ],
   "dương kinh": [
      "hải phòng"
   ],
   "thủy nguyên": [
      "hải phòng"
   ],
   "an dương": [
      "hải phòng"
   ],
   "an lão": [
      "hải phòng",
      "bình định"
   ],
   "kiến thụy": [
      "hải phòng"
   ],
   "tiên lãng": [
      "hải phòng"
   ],
   "vĩnh bảo": [
      "hải phòng"
   ],
   "cát hải": [
      "hải phòng"
   ],
   "bạch long vĩ": [
      "hải phòng"
   ],
   "quận 1": [
      "hồ chí minh"
   ],
   "quận nhất": [
      "hồ chí minh"
   ],
   "quận 12": [
      "hồ chí minh"
   ],
   "quận mười hai": [
      "hồ chí minh"
   ],
   "gò vấp": [
      "hồ chí minh"
   ],
   "bình thạnh": [
      "hồ chí minh"
   ],
   "tân bình": [
      "hồ chí minh"
   ],
   "tân phú": [
      "hồ chí minh",
      "đồng nai"
   ],
   "phú nhuận": [
      "hồ chí minh"
   ],
   "thủ đức": [
      "hồ chí minh"
   ],
   "quận 9": [
      "hồ chí minh"
   ],
   "quận 2": [
      "hồ chí minh"
   ],
   "quận hai": [
      "hồ chí minh"
   ],
   "quận chín": [
      "hồ chí minh"
   ],
   "quận 3": [
      "hồ chí minh"
   ],
   "quận ba": [
      "hồ chí minh"
   ],
   "quận 10": [
      "hồ chí minh"
   ],
   "quận mười": [
      "hồ chí minh"
   ],
   "quận 11": [
      "hồ chí minh"
   ],
   "quận mười một": [
      "hồ chí minh"
   ],
   "quận 4": [
      "hồ chí minh"
   ],
   "quận bốn": [
      "hồ chí minh"
   ],
   "quận tư": [
      "hồ chí minh"
   ],
   "quận 5": [
      "hồ chí minh"
   ],
   "quận năm": [
      "hồ chí minh"
   ],
   "quận lăm": [
      "hồ chí minh"
   ],
   "quận 6": [
      "hồ chí minh"
   ],
   "quận sáu": [
      "hồ chí minh"
   ],
   "quận 8": [
      "hồ chí minh"
   ],
   "quận tám": [
      "hồ chí minh"
   ],
   "bình tân": [
      "hồ chí minh",
      "vĩnh long"
   ],
   "quận 7": [
      "hồ chí minh"
   ],
   "quận bảy": [
      "hồ chí minh"
   ],
   "quận bẩy": [
      "hồ chí minh"
   ],
   "củ chi": [
      "hồ chí minh"
   ],
   "hóc môn": [
      "hồ chí minh"
   ],
   "bình chánh": [
      "hồ chí minh"
   ],
   "nhà bè": [
      "hồ chí minh"
   ],
   "cần giờ": [
      "hồ chí minh"
   ],
   "liên chiểu": [
      "đà nẵng"
   ],
   "thanh khê": [
      "đà nẵng"
   ],
   "hải châu": [
      "đà nẵng"
   ],
   "sơn trà": [
      "đà nẵng"
   ],
   "ngũ hành sơn": [
      "đà nẵng"
   ],
   "cẩm lệ": [
      "đà nẵng"
   ],
   "hòa vang": [
      "đà nẵng"
   ],
   "hoàng sa": [
      "đà nẵng"
   ],
   "long xuyên": [
      "an giang"
   ],
   "châu đốc": [
      "an giang"
   ],
   "an phú": [
      "an giang"
   ],
   "tân châu": [
      "an giang",
      "tây ninh"
   ],
   "phú tân": [
      "an giang",
      "cà mau"
   ],
   "châu phú": [
      "an giang"
   ],
   "tịnh biên": [
      "an giang"
   ],
   "tri tôn": [
      "an giang"
   ],
   "châu thành": [
      "an giang",
      "bến tre",
      "hậu giang",
      "kiên giang",
      "long an",
      "sóc trăng",
      "tiền giang",
      "trà vinh",
      "tây ninh",
      "đồng tháp"
   ],
   "chợ mới": [
      "an giang",
      "bắc kạn"
   ],
   "thoại sơn": [
      "an giang"
   ],
   "vũng tàu": [
      "bà rịa vũng tàu"
   ],
   "bà rịa": [
      "bà rịa vũng tàu"
   ],
   "châu đức": [
      "bà rịa vũng tàu"
   ],
   "xuyên mộc": [
      "bà rịa vũng tàu"
   ],
   "long điền": [
      "bà rịa vũng tàu"
   ],
   "đất đỏ": [
      "bà rịa vũng tàu"
   ],
   "phú mỹ": [
      "bà rịa vũng tàu"
   ],
   "côn đảo": [
      "bà rịa vũng tàu"
   ],
   "thủ dầu một": [
      "bình dương"
   ],
   "thủ dầu 1": [
      "bình dương"
   ],
   "bàu bàng": [
      "bình dương"
   ],
   "dầu tiếng": [
      "bình dương"
   ],
   "bến cát": [
      "bình dương"
   ],
   "phú giáo": [
      "bình dương"
   ],
   "tân uyên": [
      "bình dương",
      "lai châu"
   ],
   "dĩ an": [
      "bình dương"
   ],
   "thuận an": [
      "bình dương"
   ],
   "bắc tân uyên": [
      "bình dương"
   ],
   "phước long": [
      "bình phước",
      "bạc liêu"
   ],
   "đồng xoài": [
      "bình phước"
   ],
   "bình long": [
      "bình phước"
   ],
   "bù gia mập": [
      "bình phước"
   ],
   "lộc ninh": [
      "bình phước"
   ],
   "bù đốp": [
      "bình phước"
   ],
   "hớn quản": [
      "bình phước"
   ],
   "đồng phú": [
      "bình phước"
   ],
   "bù đăng": [
      "bình phước"
   ],
   "chơn thành": [
      "bình phước"
   ],
   "phú riềng": [
      "bình phước"
   ],
   "phan thiết": [
      "bình thuận"
   ],
   "la gi": [
      "bình thuận"
   ],
   "tuy phong": [
      "bình thuận"
   ],
   "bắc bình": [
      "bình thuận"
   ],
   "hàm thuận bắc": [
      "bình thuận"
   ],
   "hàm thuận nam": [
      "bình thuận"
   ],
   "tánh linh": [
      "bình thuận"
   ],
   "đức linh": [
      "bình thuận"
   ],
   "hàm tân": [
      "bình thuận"
   ],
   "phú quí": [
      "bình thuận"
   ],
   "quy nhơn": [
      "bình định"
   ],
   "hoài nhơn": [
      "bình định"
   ],
   "hoài ân": [
      "bình định"
   ],
   "phù mỹ": [
      "bình định"
   ],
   "tây sơn": [
      "bình định"
   ],
   "phù cát": [
      "bình định"
   ],
   "an nhơn": [
      "bình định"
   ],
   "tuy phước": [
      "bình định"
   ],
   "vân canh": [
      "bình định"
   ],
   "bạc liêu": [
      "bạc liêu"
   ],
   "hồng dân": [
      "bạc liêu"
   ],
   "vĩnh lợi": [
      "bạc liêu"
   ],
   "giá rai": [
      "bạc liêu"
   ],
   "đông hải": [
      "bạc liêu"
   ],
   "hòa bình": [
      "bạc liêu",
      "hòa bình"
   ],
   "bắc giang": [
      "bắc giang"
   ],
   "yên thế": [
      "bắc giang"
   ],
   "tân yên": [
      "bắc giang"
   ],
   "lạng giang": [
      "bắc giang"
   ],
   "lục nam": [
      "bắc giang"
   ],
   "lục ngạn": [
      "bắc giang"
   ],
   "sơn động": [
      "bắc giang"
   ],
   "yên dũng": [
      "bắc giang"
   ],
   "việt yên": [
      "bắc giang"
   ],
   "hiệp hòa": [
      "bắc giang"
   ],
   "bắc kạn": [
      "bắc kạn"
   ],
   "pác nặm": [
      "bắc kạn"
   ],
   "ba bể": [
      "bắc kạn"
   ],
   "ngân sơn": [
      "bắc kạn"
   ],
   "bạch thông": [
      "bắc kạn"
   ],
   "chợ đồn": [
      "bắc kạn"
   ],
   "na rì": [
      "bắc kạn"
   ],
   "bắc ninh": [
      "bắc ninh"
   ],
   "yên phong": [
      "bắc ninh"
   ],
   "quế võ": [
      "bắc ninh"
   ],
   "tiên du": [
      "bắc ninh"
   ],
   "từ sơn": [
      "bắc ninh"
   ],
   "thuận thành": [
      "bắc ninh"
   ],
   "gia bình": [
      "bắc ninh"
   ],
   "lương tài": [
      "bắc ninh"
   ],
   "bến tre": [
      "bến tre"
   ],
   "chợ lách": [
      "bến tre"
   ],
   "mỏ cày nam": [
      "bến tre"
   ],
   "giồng trôm": [
      "bến tre"
   ],
   "bình đại": [
      "bến tre"
   ],
   "ba tri": [
      "bến tre"
   ],
   "3 tri": [
      "bến tre"
   ],
   "thạnh phú": [
      "bến tre"
   ],
   "mỏ cày bắc": [
      "bến tre"
   ],
   "cao bằng": [
      "cao bằng"
   ],
   "bảo lâm": [
      "cao bằng",
      "lâm đồng"
   ],
   "bảo lạc": [
      "cao bằng"
   ],
   "hà quảng": [
      "cao bằng"
   ],
   "trùng khánh": [
      "cao bằng"
   ],
   "hạ lang": [
      "cao bằng"
   ],
   "quảng hòa": [
      "cao bằng"
   ],
   "hòa an": [
      "cao bằng"
   ],
   "nguyên bình": [
      "cao bằng"
   ],
   "thạch an": [
      "cao bằng"
   ],
   "cà mau": [
      "cà mau"
   ],
   "u minh": [
      "cà mau"
   ],
   "thới bình": [
      "cà mau"
   ],
   "trần văn thời": [
      "cà mau"
   ],
   "cái nước": [
      "cà mau"
   ],
   "đầm dơi": [
      "cà mau"
   ],
   "năm căn": [
      "cà mau"
   ],
   "5 căn": [
      "cà mau"
   ],
   "lăm căn": [
      "cà mau"
   ],
   "ngọc hiển": [
      "cà mau"
   ],
   "pleiku": [
      "gia lai"
   ],
   "an khê": [
      "gia lai"
   ],
   "ayun pa": [
      "gia lai"
   ],
   "kbang": [
      "gia lai"
   ],
   "đăk đoa": [
      "gia lai"
   ],
   "chư păh": [
      "gia lai"
   ],
   "ia grai": [
      "gia lai"
   ],
   "mang yang": [
      "gia lai"
   ],
   "kông chro": [
      "gia lai"
   ],
   "đức cơ": [
      "gia lai"
   ],
   "chư prông": [
      "gia lai"
   ],
   "chư sê": [
      "gia lai"
   ],
   "đăk pơ": [
      "gia lai"
   ],
   "ia pa": [
      "gia lai"
   ],
   "krông pa": [
      "gia lai"
   ],
   "phú thiện": [
      "gia lai"
   ],
   "chư pưh": [
      "gia lai"
   ],
   "đà bắc": [
      "hòa bình"
   ],
   "lương sơn": [
      "hòa bình"
   ],
   "kim bôi": [
      "hòa bình"
   ],
   "cao phong": [
      "hòa bình"
   ],
   "tân lạc": [
      "hòa bình"
   ],
   "mai châu": [
      "hòa bình"
   ],
   "lạc sơn": [
      "hòa bình"
   ],
   "yên thủy": [
      "hòa bình"
   ],
   "lạc thủy": [
      "hòa bình"
   ],
   "hà giang": [
      "hà giang"
   ],
   "đồng văn": [
      "hà giang"
   ],
   "mèo vạc": [
      "hà giang"
   ],
   "yên minh": [
      "hà giang"
   ],
   "quản bạ": [
      "hà giang"
   ],
   "vị xuyên": [
      "hà giang"
   ],
   "bắc mê": [
      "hà giang"
   ],
   "hoàng su phì": [
      "hà giang"
   ],
   "xín mần": [
      "hà giang"
   ],
   "bắc quang": [
      "hà giang"
   ],
   "quang bình": [
      "hà giang"
   ],
   "phủ lý": [
      "hà nam"
   ],
   "duy tiên": [
      "hà nam"
   ],
   "kim bảng": [
      "hà nam"
   ],
   "thanh liêm": [
      "hà nam"
   ],
   "bình lục": [
      "hà nam"
   ],
   "lý nhân": [
      "hà nam"
   ],
   "hà tĩnh": [
      "hà tĩnh"
   ],
   "hồng lĩnh": [
      "hà tĩnh"
   ],
   "hương sơn": [
      "hà tĩnh"
   ],
   "đức thọ": [
      "hà tĩnh"
   ],
   "vũ quang": [
      "hà tĩnh"
   ],
   "nghi xuân": [
      "hà tĩnh"
   ],
   "can lộc": [
      "hà tĩnh"
   ],
   "hương khê": [
      "hà tĩnh"
   ],
   "thạch hà": [
      "hà tĩnh"
   ],
   "cẩm xuyên": [
      "hà tĩnh"
   ],
   "kỳ anh": [
      "hà tĩnh"
   ],
   "lộc hà": [
      "hà tĩnh"
   ],
   "hưng yên": [
      "hưng yên"
   ],
   "văn lâm": [
      "hưng yên"
   ],
   "văn giang": [
      "hưng yên"
   ],
   "yên mỹ": [
      "hưng yên"
   ],
   "mỹ hào": [
      "hưng yên"
   ],
   "ân thi": [
      "hưng yên"
   ],
   "khoái châu": [
      "hưng yên"
   ],
   "kim động": [
      "hưng yên"
   ],
   "tiên lữ": [
      "hưng yên"
   ],
   "phù cừ": [
      "hưng yên"
   ],
   "hải dương": [
      "hải dương"
   ],
   "chí linh": [
      "hải dương"
   ],
   "nam sách": [
      "hải dương"
   ],
   "kinh môn": [
      "hải dương"
   ],
   "kim thành": [
      "hải dương"
   ],
   "thanh hà": [
      "hải dương"
   ],
   "cẩm giàng": [
      "hải dương"
   ],
   "bình giang": [
      "hải dương"
   ],
   "gia lộc": [
      "hải dương"
   ],
   "tứ kỳ": [
      "hải dương"
   ],
   "ninh giang": [
      "hải dương"
   ],
   "thanh miện": [
      "hải dương"
   ],
   "vị thanh": [
      "hậu giang"
   ],
   "ngã bảy": [
      "hậu giang"
   ],
   "ngã 7": [
      "hậu giang"
   ],
   "ngã bẩy": [
      "hậu giang"
   ],
   "châu thành a": [
      "hậu giang"
   ],
   "phụng hiệp": [
      "hậu giang"
   ],
   "vị thủy": [
      "hậu giang"
   ],
   "long mỹ": [
      "hậu giang"
   ],
   "nha trang": [
      "khánh hòa"
   ],
   "cam ranh": [
      "khánh hòa"
   ],
   "cam lâm": [
      "khánh hòa"
   ],
   "vạn ninh": [
      "khánh hòa"
   ],
   "ninh hòa": [
      "khánh hòa"
   ],
   "khánh vĩnh": [
      "khánh hòa"
   ],
   "diên khánh": [
      "khánh hòa"
   ],
   "khánh sơn": [
      "khánh hòa"
   ],
   "trường sa": [
      "khánh hòa"
   ],
   "rạch giá": [
      "kiên giang"
   ],
   "hà tiên": [
      "kiên giang"
   ],
   "kiên lương": [
      "kiên giang"
   ],
   "hòn đất": [
      "kiên giang"
   ],
   "tân hiệp": [
      "kiên giang"
   ],
   "giồng riềng": [
      "kiên giang"
   ],
   "gò quao": [
      "kiên giang"
   ],
   "an biên": [
      "kiên giang"
   ],
   "an minh": [
      "kiên giang"
   ],
   "vĩnh thuận": [
      "kiên giang"
   ],
   "phú quốc": [
      "kiên giang"
   ],
   "kiên hải": [
      "kiên giang"
   ],
   "u minh thượng": [
      "kiên giang"
   ],
   "giang thành": [
      "kiên giang"
   ],
   "kon tum": [
      "kon tum"
   ],
   "đắk glei": [
      "kon tum"
   ],
   "ngọc hồi": [
      "kon tum"
   ],
   "đắk tô": [
      "kon tum"
   ],
   "kon plông": [
      "kon tum"
   ],
   "kon rẫy": [
      "kon tum"
   ],
   "đắk hà": [
      "kon tum"
   ],
   "sa thầy": [
      "kon tum"
   ],
   "tu mơ rông": [
      "kon tum"
   ],
   "ia h' drai": [
      "kon tum"
   ],
   "lai châu": [
      "lai châu"
   ],
   "tam đường": [
      "lai châu"
   ],
   "mường tè": [
      "lai châu"
   ],
   "sìn hồ": [
      "lai châu"
   ],
   "phong thổ": [
      "lai châu"
   ],
   "than uyên": [
      "lai châu"
   ],
   "nậm nhùn": [
      "lai châu"
   ],
   "tân an": [
      "long an"
   ],
   "kiến tường": [
      "long an"
   ],
   "tân hưng": [
      "long an"
   ],
   "vĩnh hưng": [
      "long an"
   ],
   "mộc hóa": [
      "long an"
   ],
   "tân thạnh": [
      "long an"
   ],
   "thạnh hóa": [
      "long an"
   ],
   "đức huệ": [
      "long an"
   ],
   "đức hòa": [
      "long an"
   ],
   "bến lức": [
      "long an"
   ],
   "thủ thừa": [
      "long an"
   ],
   "tân trụ": [
      "long an"
   ],
   "cần đước": [
      "long an"
   ],
   "cần giuộc": [
      "long an"
   ],
   "lào cai": [
      "lào cai"
   ],
   "bát xát": [
      "lào cai"
   ],
   "mường khương": [
      "lào cai"
   ],
   "si ma cai": [
      "lào cai"
   ],
   "bắc hà": [
      "lào cai"
   ],
   "bảo thắng": [
      "lào cai"
   ],
   "bảo yên": [
      "lào cai"
   ],
   "sa pa": [
      "lào cai"
   ],
   "văn bàn": [
      "lào cai"
   ],
   "đà lạt": [
      "lâm đồng"
   ],
   "bảo lộc": [
      "lâm đồng"
   ],
   "đam rông": [
      "lâm đồng"
   ],
   "lạc dương": [
      "lâm đồng"
   ],
   "lâm hà": [
      "lâm đồng"
   ],
   "đơn dương": [
      "lâm đồng"
   ],
   "đức trọng": [
      "lâm đồng"
   ],
   "di linh": [
      "lâm đồng"
   ],
   "đạ huoai": [
      "lâm đồng"
   ],
   "đạ tẻh": [
      "lâm đồng"
   ],
   "cát tiên": [
      "lâm đồng"
   ],
   "lạng sơn": [
      "lạng sơn"
   ],
   "tràng định": [
      "lạng sơn"
   ],
   "bình gia": [
      "lạng sơn"
   ],
   "văn lãng": [
      "lạng sơn"
   ],
   "cao lộc": [
      "lạng sơn"
   ],
   "văn quan": [
      "lạng sơn"
   ],
   "bắc sơn": [
      "lạng sơn"
   ],
   "hữu lũng": [
      "lạng sơn"
   ],
   "chi lăng": [
      "lạng sơn"
   ],
   "lộc bình": [
      "lạng sơn"
   ],
   "đình lập": [
      "lạng sơn"
   ],
   "nam định": [
      "nam định"
   ],
   "mỹ lộc": [
      "nam định"
   ],
   "vụ bản": [
      "nam định"
   ],
   "ý yên": [
      "nam định"
   ],
   "nghĩa hưng": [
      "nam định"
   ],
   "nam trực": [
      "nam định"
   ],
   "trực ninh": [
      "nam định"
   ],
   "xuân trường": [
      "nam định"
   ],
   "giao thủy": [
      "nam định"
   ],
   "hải hậu": [
      "nam định"
   ],
   "vinh": [
      "nghệ an"
   ],
   "cửa lò": [
      "nghệ an"
   ],
   "thái hòa": [
      "nghệ an"
   ],
   "quế phong": [
      "nghệ an"
   ],
   "quỳ châu": [
      "nghệ an"
   ],
   "kỳ sơn": [
      "nghệ an"
   ],
   "tương dương": [
      "nghệ an"
   ],
   "nghĩa đàn": [
      "nghệ an"
   ],
   "quỳ hợp": [
      "nghệ an"
   ],
   "quỳnh lưu": [
      "nghệ an"
   ],
   "con cuông": [
      "nghệ an"
   ],
   "tân kỳ": [
      "nghệ an"
   ],
   "anh sơn": [
      "nghệ an"
   ],
   "diễn châu": [
      "nghệ an"
   ],
   "yên thành": [
      "nghệ an"
   ],
   "đô lương": [
      "nghệ an"
   ],
   "thanh chương": [
      "nghệ an"
   ],
   "nghi lộc": [
      "nghệ an"
   ],
   "nam đàn": [
      "nghệ an"
   ],
   "hưng nguyên": [
      "nghệ an"
   ],
   "ninh bình": [
      "ninh bình"
   ],
   "tam điệp": [
      "ninh bình"
   ],
   "nho quan": [
      "ninh bình"
   ],
   "gia viễn": [
      "ninh bình"
   ],
   "hoa lư": [
      "ninh bình"
   ],
   "yên khánh": [
      "ninh bình"
   ],
   "kim sơn": [
      "ninh bình"
   ],
   "yên mô": [
      "ninh bình"
   ],
   "phan rang tháp chàm": [
      "ninh thuận"
   ],
   "bác ái": [
      "ninh thuận"
   ],
   "ninh sơn": [
      "ninh thuận"
   ],
   "ninh hải": [
      "ninh thuận"
   ],
   "ninh phước": [
      "ninh thuận"
   ],
   "thuận bắc": [
      "ninh thuận"
   ],
   "thuận nam": [
      "ninh thuận"
   ],
   "việt trì": [
      "phú thọ"
   ],
   "phú thọ": [
      "phú thọ"
   ],
   "đoan hùng": [
      "phú thọ"
   ],
   "hạ hòa": [
      "phú thọ"
   ],
   "thanh ba": [
      "phú thọ"
   ],
   "thanh 3": [
      "phú thọ"
   ],
   "phù ninh": [
      "phú thọ"
   ],
   "yên lập": [
      "phú thọ"
   ],
   "cẩm khê": [
      "phú thọ"
   ],
   "tam nông": [
      "phú thọ",
      "đồng tháp"
   ],
   "lâm thao": [
      "phú thọ"
   ],
   "thanh sơn": [
      "phú thọ"
   ],
   "thanh thủy": [
      "phú thọ"
   ],
   "tân sơn": [
      "phú thọ"
   ],
   "tuy hòa": [
      "phú yên"
   ],
   "sông cầu": [
      "phú yên"
   ],
   "đồng xuân": [
      "phú yên"
   ],
   "tuy an": [
      "phú yên"
   ],
   "sơn hòa": [
      "phú yên"
   ],
   "sông hinh": [
      "phú yên"
   ],
   "tây hòa": [
      "phú yên"
   ],
   "phú hòa": [
      "phú yên"
   ],
   "đông hòa": [
      "phú yên"
   ],
   "đồng hới": [
      "quảng bình"
   ],
   "minh hóa": [
      "quảng bình"
   ],
   "tuyên hóa": [
      "quảng bình"
   ],
   "quảng trạch": [
      "quảng bình"
   ],
   "bố trạch": [
      "quảng bình"
   ],
   "quảng ninh": [
      "quảng bình"
   ],
   "lệ thủy": [
      "quảng bình"
   ],
   "ba đồn": [
      "quảng bình"
   ],
   "3 đồn": [
      "quảng bình"
   ],
   "tam kỳ": [
      "quảng nam"
   ],
   "hội an": [
      "quảng nam"
   ],
   "tây giang": [
      "quảng nam"
   ],
   "đông giang": [
      "quảng nam"
   ],
   "đại lộc": [
      "quảng nam"
   ],
   "điện bàn": [
      "quảng nam"
   ],
   "duy xuyên": [
      "quảng nam"
   ],
   "quế sơn": [
      "quảng nam"
   ],
   "nam giang": [
      "quảng nam"
   ],
   "phước sơn": [
      "quảng nam"
   ],
   "hiệp đức": [
      "quảng nam"
   ],
   "thăng bình": [
      "quảng nam"
   ],
   "tiên phước": [
      "quảng nam"
   ],
   "bắc trà my": [
      "quảng nam"
   ],
   "nam trà my": [
      "quảng nam"
   ],
   "núi thành": [
      "quảng nam"
   ],
   "phú ninh": [
      "quảng nam"
   ],
   "nông sơn": [
      "quảng nam"
   ],
   "quảng ngãi": [
      "quảng ngãi"
   ],
   "bình sơn": [
      "quảng ngãi"
   ],
   "trà bồng": [
      "quảng ngãi"
   ],
   "sơn tịnh": [
      "quảng ngãi"
   ],
   "tư nghĩa": [
      "quảng ngãi"
   ],
   "sơn hà": [
      "quảng ngãi"
   ],
   "minh long": [
      "quảng ngãi"
   ],
   "nghĩa hành": [
      "quảng ngãi"
   ],
   "mộ đức": [
      "quảng ngãi"
   ],
   "đức phổ": [
      "quảng ngãi"
   ],
   "ba tơ": [
      "quảng ngãi"
   ],
   "3 tơ": [
      "quảng ngãi"
   ],
   "lý sơn": [
      "quảng ngãi"
   ],
   "hạ long": [
      "quảng ninh"
   ],
   "móng cái": [
      "quảng ninh"
   ],
   "cẩm phả": [
      "quảng ninh"
   ],
   "uông bí": [
      "quảng ninh"
   ],
   "bình liêu": [
      "quảng ninh"
   ],
   "tiên yên": [
      "quảng ninh"
   ],
   "đầm hà": [
      "quảng ninh"
   ],
   "hải hà": [
      "quảng ninh"
   ],
   "ba chẽ": [
      "quảng ninh"
   ],
   "3 chẽ": [
      "quảng ninh"
   ],
   "vân đồn": [
      "quảng ninh"
   ],
   "đông triều": [
      "quảng ninh"
   ],
   "quảng yên": [
      "quảng ninh"
   ],
   "cô tô": [
      "quảng ninh"
   ],
   "đông hà": [
      "quảng trị"
   ],
   "quảng trị": [
      "quảng trị"
   ],
   "vĩnh linh": [
      "quảng trị"
   ],
   "hướng hóa": [
      "quảng trị"
   ],
   "gio linh": [
      "quảng trị"
   ],
   "đa krông": [
      "quảng trị"
   ],
   "cam lộ": [
      "quảng trị"
   ],
   "triệu phong": [
      "quảng trị"
   ],
   "hải lăng": [
      "quảng trị"
   ],
   "cồn cỏ": [
      "quảng trị"
   ],
   "sóc trăng": [
      "sóc trăng"
   ],
   "kế sách": [
      "sóc trăng"
   ],
   "mỹ tú": [
      "sóc trăng"
   ],
   "cù lao dung": [
      "sóc trăng"
   ],
   "long phú": [
      "sóc trăng"
   ],
   "mỹ xuyên": [
      "sóc trăng"
   ],
   "ngã năm": [
      "sóc trăng"
   ],
   "ngã 5": [
      "sóc trăng"
   ],
   "ngã lăm": [
      "sóc trăng"
   ],
   "thạnh trị": [
      "sóc trăng"
   ],
   "vĩnh châu": [
      "sóc trăng"
   ],
   "trần đề": [
      "sóc trăng"
   ],
   "sơn la": [
      "sơn la"
   ],
   "quỳnh nhai": [
      "sơn la"
   ],
   "thuận châu": [
      "sơn la"
   ],
   "mường la": [
      "sơn la"
   ],
   "bắc yên": [
      "sơn la"
   ],
   "phù yên": [
      "sơn la"
   ],
   "mộc châu": [
      "sơn la"
   ],
   "yên châu": [
      "sơn la"
   ],
   "mai sơn": [
      "sơn la"
   ],
   "sông mã": [
      "sơn la"
   ],
   "sốp cộp": [
      "sơn la"
   ],
   "vân hồ": [
      "sơn la"
   ],
   "thanh hóa": [
      "thanh hóa"
   ],
   "bỉm sơn": [
      "thanh hóa"
   ],
   "sầm sơn": [
      "thanh hóa"
   ],
   "mường lát": [
      "thanh hóa"
   ],
   "quan hóa": [
      "thanh hóa"
   ],
   "bá thước": [
      "thanh hóa"
   ],
   "quan sơn": [
      "thanh hóa"
   ],
   "lang chánh": [
      "thanh hóa"
   ],
   "ngọc lặc": [
      "thanh hóa"
   ],
   "cẩm thủy": [
      "thanh hóa"
   ],
   "thạch thành": [
      "thanh hóa"
   ],
   "hà trung": [
      "thanh hóa"
   ],
   "vĩnh lộc": [
      "thanh hóa"
   ],
   "yên định": [
      "thanh hóa"
   ],
   "thọ xuân": [
      "thanh hóa"
   ],
   "thường xuân": [
      "thanh hóa"
   ],
   "triệu sơn": [
      "thanh hóa"
   ],
   "thiệu hóa": [
      "thanh hóa"
   ],
   "hoằng hóa": [
      "thanh hóa"
   ],
   "hậu lộc": [
      "thanh hóa"
   ],
   "nga sơn": [
      "thanh hóa"
   ],
   "như xuân": [
      "thanh hóa"
   ],
   "như thanh": [
      "thanh hóa"
   ],
   "nông cống": [
      "thanh hóa"
   ],
   "đông sơn": [
      "thanh hóa"
   ],
   "quảng xương": [
      "thanh hóa"
   ],
   "nghi sơn": [
      "thanh hóa"
   ],
   "thái bình": [
      "thái bình"
   ],
   "quỳnh phụ": [
      "thái bình"
   ],
   "hưng hà": [
      "thái bình"
   ],
   "đông hưng": [
      "thái bình"
   ],
   "thái thụy": [
      "thái bình"
   ],
   "tiền hải": [
      "thái bình"
   ],
   "kiến xương": [
      "thái bình"
   ],
   "vũ thư": [
      "thái bình"
   ],
   "thái nguyên": [
      "thái nguyên"
   ],
   "sông công": [
      "thái nguyên"
   ],
   "định hóa": [
      "thái nguyên"
   ],
   "phú lương": [
      "thái nguyên"
   ],
   "đồng hỷ": [
      "thái nguyên"
   ],
   "võ nhai": [
      "thái nguyên"
   ],
   "đại từ": [
      "thái nguyên"
   ],
   "phổ yên": [
      "thái nguyên"
   ],
   "phú bình": [
      "thái nguyên"
   ],
   "huế": [
      "thừa thiên huế"
   ],
   "quảng điền": [
      "thừa thiên huế"
   ],
   "phú vang": [
      "thừa thiên huế"
   ],
   "hương thủy": [
      "thừa thiên huế"
   ],
   "hương trà": [
      "thừa thiên huế"
   ],
   "a lưới": [
      "thừa thiên huế"
   ],
   "phú lộc": [
      "thừa thiên huế"
   ],
   "nam đông": [
      "thừa thiên huế"
   ],
   "mỹ tho": [
      "tiền giang"
   ],
   "gò công": [
      "tiền giang"
   ],
   "cai lậy": [
      "tiền giang"
   ],
   "tân phước": [
      "tiền giang"
   ],
   "cái bè": [
      "tiền giang"
   ],
   "chợ gạo": [
      "tiền giang"
   ],
   "gò công tây": [
      "tiền giang"
   ],
   "gò công đông": [
      "tiền giang"
   ],
   "tân phú đông": [
      "tiền giang"
   ],
   "trà vinh": [
      "trà vinh"
   ],
   "càng long": [
      "trà vinh"
   ],
   "cầu kè": [
      "trà vinh"
   ],
   "tiểu cần": [
      "trà vinh"
   ],
   "cầu ngang": [
      "trà vinh"
   ],
   "trà cú": [
      "trà vinh"
   ],
   "duyên hải": [
      "trà vinh"
   ],
   "tuyên quang": [
      "tuyên quang"
   ],
   "lâm bình": [
      "tuyên quang"
   ],
   "na hang": [
      "tuyên quang"
   ],
   "chiêm hóa": [
      "tuyên quang"
   ],
   "hàm yên": [
      "tuyên quang"
   ],
   "yên sơn": [
      "tuyên quang"
   ],
   "sơn dương": [
      "tuyên quang"
   ],
   "tây ninh": [
      "tây ninh"
   ],
   "tân biên": [
      "tây ninh"
   ],
   "dương minh châu": [
      "tây ninh"
   ],
   "hòa thành": [
      "tây ninh"
   ],
   "gò dầu": [
      "tây ninh"
   ],
   "bến cầu": [
      "tây ninh"
   ],
   "trảng bàng": [
      "tây ninh"
   ],
   "vĩnh long": [
      "vĩnh long"
   ],
   "long hồ": [
      "vĩnh long"
   ],
   "mang thít": [
      "vĩnh long"
   ],
   "vũng liêm": [
      "vĩnh long"
   ],
   "tam bình": [
      "vĩnh long"
   ],
   "bình minh": [
      "vĩnh long"
   ],
   "trà ôn": [
      "vĩnh long"
   ],
   "vĩnh yên": [
      "vĩnh phúc"
   ],
   "phúc yên": [
      "vĩnh phúc"
   ],
   "lập thạch": [
      "vĩnh phúc"
   ],
   "tam dương": [
      "vĩnh phúc"
   ],
   "tam đảo": [
      "vĩnh phúc"
   ],
   "bình xuyên": [
      "vĩnh phúc"
   ],
   "yên lạc": [
      "vĩnh phúc"
   ],
   "vĩnh tường": [
      "vĩnh phúc"
   ],
   "sông lô": [
      "vĩnh phúc"
   ],
   "yên bái": [
      "yên bái"
   ],
   "nghĩa lộ": [
      "yên bái"
   ],
   "lục yên": [
      "yên bái"
   ],
   "văn yên": [
      "yên bái"
   ],
   "mù căng chải": [
      "yên bái"
   ],
   "trấn yên": [
      "yên bái"
   ],
   "trạm tấu": [
      "yên bái"
   ],
   "văn chấn": [
      "yên bái"
   ],
   "yên bình": [
      "yên bái"
   ],
   "điện biên phủ": [
      "điện biên"
   ],
   "mường lay": [
      "điện biên"
   ],
   "mường nhé": [
      "điện biên"
   ],
   "mường chà": [
      "điện biên"
   ],
   "tủa chùa": [
      "điện biên"
   ],
   "tuần giáo": [
      "điện biên"
   ],
   "điện biên": [
      "điện biên"
   ],
   "điện biên đông": [
      "điện biên"
   ],
   "mường ảng": [
      "điện biên"
   ],
   "nậm pồ": [
      "điện biên"
   ],
   "buôn ma thuột": [
      "đắk lắk"
   ],
   "buôn hồ": [
      "đắk lắk"
   ],
   "ea h'leo": [
      "đắk lắk"
   ],
   "ea súp": [
      "đắk lắk"
   ],
   "buôn đôn": [
      "đắk lắk"
   ],
   "cư m'gar": [
      "đắk lắk"
   ],
   "krông búk": [
      "đắk lắk"
   ],
   "krông năng": [
      "đắk lắk"
   ],
   "ea kar": [
      "đắk lắk"
   ],
   "m'đrắk": [
      "đắk lắk"
   ],
   "krông bông": [
      "đắk lắk"
   ],
   "krông pắc": [
      "đắk lắk"
   ],
   "krông bắc": [
      "đắk lắk"
   ],
   "krông a na": [
      "đắk lắk"
   ],
   "lắk": [
      "đắk lắk"
   ],
   "cư kuin": [
      "đắk lắk"
   ],
   "gia nghĩa": [
      "đắk nông"
   ],
   "đăk glong": [
      "đắk nông"
   ],
   "cư jút": [
      "đắk nông"
   ],
   "đắk mil": [
      "đắk nông"
   ],
   "krông nô": [
      "đắk nông"
   ],
   "đắk song": [
      "đắk nông"
   ],
   "đắk r'lấp": [
      "đắk nông"
   ],
   "tuy đức": [
      "đắk nông"
   ],
   "biên hòa": [
      "đồng nai"
   ],
   "long khánh": [
      "đồng nai"
   ],
   "vĩnh cửu": [
      "đồng nai"
   ],
   "định quán": [
      "đồng nai"
   ],
   "trảng bom": [
      "đồng nai"
   ],
   "thống nhất": [
      "đồng nai"
   ],
   "cẩm mỹ": [
      "đồng nai"
   ],
   "long thành": [
      "đồng nai"
   ],
   "xuân lộc": [
      "đồng nai"
   ],
   "nhơn trạch": [
      "đồng nai"
   ],
   "cao lãnh": [
      "đồng tháp"
   ],
   "sa đéc": [
      "đồng tháp"
   ],
   "hồng ngự": [
      "đồng tháp"
   ],
   "tân hồng": [
      "đồng tháp"
   ],
   "tháp mười": [
      "đồng tháp"
   ],
   "tháp 10": [
      "đồng tháp"
   ],
   "thanh bình": [
      "đồng tháp"
   ],
   "lấp vò": [
      "đồng tháp"
   ],
   "lai vung": [
      "đồng tháp"
   ]
}