{
   "ninh kiều": "ninh kiều",
   "ô môn": "ô môn",
   "bình thủy": "bình thủy",
   "cái răng": "cái răng",
   "thốt nốt": "thốt nốt",
   "vĩnh thạnh": "vĩnh thạnh",
   "cờ đỏ": "cờ đỏ",
   "phong điền": "phong điền",
   "thới lai": "thới lai",
   "ba đình": "ba đình",
   "3 đình": "ba đình",
   "hoàn kiếm": "hoàn kiếm",
   "tây hồ": "tây hồ",
   "long biên": "long biên",
   "cầu giấy": "cầu giấy",
   "đống đa": "đống đa",
   "hai bà trưng": "hai bà trưng",
   "2 bà trưng": "hai bà trưng",
   "hoàng mai": "hoàng mai",
   "thanh xuân": "thanh xuân",
   "sóc sơn": "sóc sơn",
   "đông anh": "đông anh",
   "gia lâm": "gia lâm",
   "nam từ liêm": "nam từ liêm",
   "thanh trì": "thanh trì",
   "bắc từ liêm": "bắc từ liêm",
   "mê linh": "mê linh",
   "hà đông": "hà đông",
   "sơn tây": "sơn tây",
   "ba vì": "ba vì",
   "3 vì": "ba vì",
   "phúc thọ": "phúc thọ",
   "đan phượng": "đan phượng",
   "hoài đức": "hoài đức",
   "quốc oai": "quốc oai",
   "thạch thất": "thạch thất",
   "chương mỹ": "chương mỹ",
   "thanh oai": "thanh oai",
   "thường tín": "thường tín",
   "phú xuyên": "phú xuyên",
   "ứng hòa": "ứng hòa",
   "mỹ đức": "mỹ đức",
   "hồng bàng": "hồng bàng",
   "ngô quyền": "ngô quyền",
   "lê chân": "lê chân",
   "hải an": "hải an",
   "kiến an": "kiến an",
   "đồ sơn": "đồ sơn",
   "dương kinh": "dương kinh",
   "thủy nguyên": "thủy nguyên",
   "an dương": "an dương",
   "an lão": "an lão",
   "kiến thụy": "kiến thụy",
   "tiên lãng": "tiên lãng",
   "vĩnh bảo": "vĩnh bảo",
   "cát hải": "cát hải",
   "bạch long vĩ": "bạch long vĩ",
   "quận 1": "quận 1",
   "quận nhất": "quận 1",
   "quận 12": "quận 12",
   "quận mười hai": "quận 12",
   "gò vấp": "gò vấp",
   "bình thạnh": "bình thạnh",
   "tân bình": "tân bình",
   "tân phú": "tân phú",
   "phú nhuận": "phú nhuận",
   "thủ đức": "thủ đức",
   "quận 9": "thủ đức",
   "quận 2": "thủ đức",
   "quận hai": "thủ đức",
   "quận chín": "thủ đức",
   "quận 3": "quận 3",
   "quận ba": "quận 3",
   "quận 10": "quận 10",
   "quận mười": "quận 10",
   "quận 11": "quận 11",
   "quận mười một": "quận 11",
   "quận 4": "quận 4",
   "quận bốn": "quận 4",
   "quận tư": "quận 4",
   "quận 5": "quận 5",
   "quận năm": "quận 5",
   "quận lăm": "quận 5",
   "quận 6": "quận 6",
   "quận sáu": "quận 6",
   "quận 8": "quận 8",
   "quận tám": "quận 8",
   "bình tân": "bình tân",
   "quận 7": "quận 7",
   "quận bảy": "quận 7",
   "quận bẩy": "quận 7",
   "củ chi": "củ chi",
   "hóc môn": "hóc môn",
   "bình chánh": "bình chánh",
   "nhà bè": "nhà bè",
   "cần giờ": "cần giờ",
   "liên chiểu": "liên chiểu",
   "thanh khê": "thanh khê",
   "hải châu": "hải châu",
   "sơn trà": "sơn trà",
   "ngũ hành sơn": "ngũ hành sơn",
   "cẩm lệ": "cẩm lệ",
   "hòa vang": "hòa vang",
   "hoàng sa": "hoàng sa",
   "long xuyên": "long xuyên",
   "châu đốc": "châu đốc",
   "an phú": "an phú",
   "tân châu": "tân châu",
   "phú tân": "phú tân",
   "châu phú": "châu phú",
   "tịnh biên": "tịnh biên",
   "tri tôn": "tri tôn",
   "châu thành": "châu thành",
   "chợ mới": "chợ mới",
   "thoại sơn": "thoại sơn",
   "vũng tàu": "vũng tàu",
   "bà rịa": "bà rịa",
   "châu đức": "châu đức",
   "xuyên mộc": "xuyên mộc",
   "long điền": "long điền",
   "đất đỏ": "đất đỏ",
   "phú mỹ": "phú mỹ",
   "côn đảo": "côn đảo",
   "thủ dầu một": "thủ dầu một",
   "thủ dầu 1": "thủ dầu một",
   "bàu bàng": "bàu bàng",
   "dầu tiếng": "dầu tiếng",
   "bến cát": "bến cát",
   "phú giáo": "phú giáo",
   "tân uyên": "tân uyên",
   "dĩ an": "dĩ an",
   "thuận an": "thuận an",
   "bắc tân uyên": "bắc tân uyên",
   "phước long": "phước long",
   "đồng xoài": "đồng xoài",
   "bình long": "bình long",
   "bù gia mập": "bù gia mập",
   "lộc ninh": "lộc ninh",
   "bù đốp": "bù đốp",
   "hớn quản": "hớn quản",
   "đồng phú": "đồng phú",
   "bù đăng": "bù đăng",
   "chơn thành": "chơn thành",
   "phú riềng": "phú riềng",
   "phan thiết": "phan thiết",
   "la gi": "la gi",
   "tuy phong": "tuy phong",
   "bắc bình": "bắc bình",
   "hàm thuận bắc": "hàm thuận bắc",
   "hàm thuận nam": "hàm thuận nam",
   "tánh linh": "tánh linh",
   "đức linh": "đức linh",
   "hàm tân": "hàm tân",
   "phú quí": "phú quí",
   "quy nhơn": "quy nhơn",
   "hoài nhơn": "hoài nhơn",
   "hoài ân": "hoài ân",
   "phù mỹ": "phù mỹ",
   "tây sơn": "tây sơn",
   "phù cát": "phù cát",
   "an nhơn": "an nhơn",
   "tuy phước": "tuy phước",
   "vân canh": "vân canh",
   "bạc liêu": "bạc liêu",
   "hồng dân": "hồng dân",
   "vĩnh lợi": "vĩnh lợi",
   "giá rai": "giá rai",
   "đông hải": "đông hải",
   "hòa bình": "hòa bình",
   "bắc giang": "bắc giang",
   "yên thế": "yên thế",
   "tân yên": "tân yên",
   "lạng giang": "lạng giang",
   "lục nam": "lục nam",
   "lục ngạn": "lục ngạn",
   "sơn động": "sơn động",
   "yên dũng": "yên dũng",
   "việt yên": "việt yên",
   "hiệp hòa": "hiệp hòa",
   "bắc kạn": "bắc kạn",
   "pác nặm": "pác nặm",
   "ba bể": "ba bể",
   "ngân sơn": "ngân sơn",
   "bạch thông": "bạch thông",
   "chợ đồn": "chợ đồn",
   "na rì": "na rì",
   "bắc ninh": "bắc ninh",
   "yên phong": "yên phong",
   "quế võ": "quế võ",
   "tiên du": "tiên du",
   "từ sơn": "từ sơn",
   "thuận thành": "thuận thành",
   "gia bình": "gia bình",
   "lương tài": "lương tài",
   "bến tre": "bến tre",
   "chợ lách": "chợ lách",
   "mỏ cày nam": "mỏ cày nam",
   "giồng trôm": "giồng trôm",
   "bình đại": "bình đại",
   "ba tri": "ba tri",
   "3 tri": "ba tri",
   "thạnh phú": "thạnh phú",
   "mỏ cày bắc": "mỏ cày bắc",
   "cao bằng": "cao bằng",
   "bảo lâm": "bảo lâm",
   "bảo lạc": "bảo lạc",
   "hà quảng": "hà quảng",
   "trùng khánh": "trùng khánh",
   "hạ lang": "hạ lang",
   "quảng hòa": "quảng hòa",
   "hòa an": "hòa an",
   "nguyên bình": "nguyên bình",
   "thạch an": "thạch an",
   "cà mau": "cà mau",
   "u minh": "u minh",
   "thới bình": "thới bình",
   "trần văn thời": "trần văn thời",
   "cái nước": "cái nước",
   "đầm dơi": "đầm dơi",
   "năm căn": "năm căn",
   "5 căn": "năm căn",
   "lăm căn": "năm căn",
   "ngọc hiển": "ngọc hiển",
   "pleiku": "pleiku",
   "an khê": "an khê",
   "ayun pa": "ayun pa",
   "kbang": "kbang",
   "đăk đoa": "đăk đoa",
   "chư păh": "chư păh",
   "ia grai": "ia grai",
   "mang yang": "mang yang",
   "kông chro": "kông chro",
   "đức cơ": "đức cơ",
   "chư prông": "chư prông",
   "chư sê": "chư sê",
   "đăk pơ": "đăk pơ",
   "ia pa": "ia pa",
   "krông pa": "krông pa",
   "phú thiện": "phú thiện",
   "chư pưh": "chư pưh",
   "đà bắc": "đà bắc",
   "lương sơn": "lương sơn",
   "kim bôi": "kim bôi",
   "cao phong": "cao phong",
   "tân lạc": "tân lạc",
   "mai châu": "mai châu",
   "lạc sơn": "lạc sơn",
   "yên thủy": "yên thủy",
   "lạc thủy": "lạc thủy",
   "hà giang": "hà giang",
   "đồng văn": "đồng văn",
   "mèo vạc": "mèo vạc",
   "yên minh": "yên minh",
   "quản bạ": "quản bạ",
   "vị xuyên": "vị xuyên",
   "bắc mê": "bắc mê",
   "hoàng su phì": "hoàng su phì",
   "xín mần": "xín mần",
   "bắc quang": "bắc quang",
   "quang bình": "quang bình",
   "phủ lý": "phủ lý",
   "duy tiên": "duy tiên",
   "kim bảng": "kim bảng",
   "thanh liêm": "thanh liêm",
   "bình lục": "bình lục",
   "lý nhân": "lý nhân",
   "hà tĩnh": "hà tĩnh",
   "hồng lĩnh": "hồng lĩnh",
   "hương sơn": "hương sơn",
   "đức thọ": "đức thọ",
   "vũ quang": "vũ quang",
   "nghi xuân": "nghi xuân",
   "can lộc": "can lộc",
   "hương khê": "hương khê",
   "thạch hà": "thạch hà",
   "cẩm xuyên": "cẩm xuyên",
   "kỳ anh": "kỳ anh",
   "lộc hà": "lộc hà",
   "hưng yên": "hưng yên",
   "văn lâm": "văn lâm",
   "văn giang": "văn giang",
   "yên mỹ": "yên mỹ",
   "mỹ hào": "mỹ hào",
   "ân thi": "ân thi",
   "khoái châu": "khoái châu",
   "kim động": "kim động",
   "tiên lữ": "tiên lữ",
   "phù cừ": "phù cừ",
   "hải dương": "hải dương",
   "chí linh": "chí linh",
   "nam sách": "nam sách",
   "kinh môn": "kinh môn",
   "kim thành": "kim thành",
   "thanh hà": "thanh hà",
   "cẩm giàng": "cẩm giàng",
   "bình giang": "bình giang",
   "gia lộc": "gia lộc",
   "tứ kỳ": "tứ kỳ",
   "ninh giang": "ninh giang",
   "thanh miện": "thanh miện",
   "vị thanh": "vị thanh",
   "ngã bảy": "ngã bảy",
   "ngã 7": "ngã bảy",
   "ngã bẩy": "ngã bảy",
   "châu thành a": "châu thành a",
   "phụng hiệp": "phụng hiệp",
   "vị thủy": "vị thủy",
   "long mỹ": "long mỹ",
   "nha trang": "nha trang",
   "cam ranh": "cam ranh",
   "cam lâm": "cam lâm",
   "vạn ninh": "vạn ninh",
   "ninh hòa": "ninh hòa",
   "khánh vĩnh": "khánh vĩnh",
   "diên khánh": "diên khánh",
   "khánh sơn": "khánh sơn",
   "trường sa": "trường sa",
   "rạch giá": "rạch giá",
   "hà tiên": "hà tiên",
   "kiên lương": "kiên lương",
   "hòn đất": "hòn đất",
   "tân hiệp": "tân hiệp",
   "giồng riềng": "giồng riềng",
   "gò quao": "gò quao",
   "an biên": "an biên",
   "an minh": "an minh",
   "vĩnh thuận": "vĩnh thuận",
   "phú quốc": "phú quốc",
   "kiên hải": "kiên hải",
   "u minh thượng": "u minh thượng",
   "giang thành": "giang thành",
   "kon tum": "kon tum",
   "đắk glei": "đắk glei",
   "ngọc hồi": "ngọc hồi",
   "đắk tô": "đắk tô",
   "kon plông": "kon plông",
   "kon rẫy": "kon rẫy",
   "đắk hà": "đắk hà",
   "sa thầy": "sa thầy",
   "tu mơ rông": "tu mơ rông",
   "ia h' drai": "ia h' drai",
   "lai châu": "lai châu",
   "tam đường": "tam đường",
   "mường tè": "mường tè",
   "sìn hồ": "sìn hồ",
   "phong thổ": "phong thổ",
   "than uyên": "than uyên",
   "nậm nhùn": "nậm nhùn",
   "tân an": "tân an",
   "kiến tường": "kiến tường",
   "tân hưng": "tân hưng",
   "vĩnh hưng": "vĩnh hưng",
   "mộc hóa": "mộc hóa",
   "tân thạnh": "tân thạnh",
   "thạnh hóa": "thạnh hóa",
   "đức huệ": "đức huệ",
   "đức hòa": "đức hòa",
   "bến lức": "bến lức",
   "thủ thừa": "thủ thừa",
   "tân trụ": "tân trụ",
   "cần đước": "cần đước",
   "cần giuộc": "cần giuộc",
   "lào cai": "lào cai",
   "bát xát": "bát xát",
   "mường khương": "mường khương",
   "si ma cai": "si ma cai",
   "bắc hà": "bắc hà",
   "bảo thắng": "bảo thắng",
   "bảo yên": "bảo yên",
   "sa pa": "sa pa",
   "văn bàn": "văn bàn",
   "đà lạt": "đà lạt",
   "bảo lộc": "bảo lộc",
   "đam rông": "đam rông",
   "lạc dương": "lạc dương",
   "lâm hà": "lâm hà",
   "đơn dương": "đơn dương",
   "đức trọng": "đức trọng",
   "di linh": "di linh",
   "đạ huoai": "đạ huoai",
   "đạ tẻh": "đạ tẻh",
   "cát tiên": "cát tiên",
   "lạng sơn": "lạng sơn",
   "tràng định": "tràng định",
   "bình gia": "bình gia",
   "văn lãng": "văn lãng",
   "cao lộc": "cao lộc",
   "văn quan": "văn quan",
   "bắc sơn": "bắc sơn",
   "hữu lũng": "hữu lũng",
   "chi lăng": "chi lăng",
   "lộc bình": "lộc bình",
   "đình lập": "đình lập",
   "nam định": "nam định",
   "mỹ lộc": "mỹ lộc",
   "vụ bản": "vụ bản",
   "ý yên": "ý yên",
   "nghĩa hưng": "nghĩa hưng",
   "nam trực": "nam trực",
   "trực ninh": "trực ninh",
   "xuân trường": "xuân trường",
   "giao thủy": "giao thủy",
   "hải hậu": "hải hậu",
   "vinh": "vinh",
   "cửa lò": "cửa lò",
   "thái hòa": "thái hòa",
   "quế phong": "quế phong",
   "quỳ châu": "quỳ châu",
   "kỳ sơn": "kỳ sơn",
   "tương dương": "tương dương",
   "nghĩa đàn": "nghĩa đàn",
   "quỳ hợp": "quỳ hợp",
   "quỳnh lưu": "quỳnh lưu",
   "con cuông": "con cuông",
   "tân kỳ": "tân kỳ",
   "anh sơn": "anh sơn",
   "diễn châu": "diễn châu",
   "yên thành": "yên thành",
   "đô lương": "đô lương",
   "thanh chương": "thanh chương",
   "nghi lộc": "nghi lộc",
   "nam đàn": "nam đàn",
   "hưng nguyên": "hưng nguyên",
   "ninh bình": "ninh bình",
   "tam điệp": "tam điệp",
   "nho quan": "nho quan",
   "gia viễn": "gia viễn",
   "hoa lư": "hoa lư",
   "yên khánh": "yên khánh",
   "kim sơn": "kim sơn",
   "yên mô": "yên mô",
   "phan rang tháp chàm": "phan rang tháp chàm",
   "bác ái": "bác ái",
   "ninh sơn": "ninh sơn",
   "ninh hải": "ninh hải",
   "ninh phước": "ninh phước",
   "thuận bắc": "thuận bắc",
   "thuận nam": "thuận nam",
   "việt trì": "việt trì",
   "phú thọ": "phú thọ",
   "đoan hùng": "đoan hùng",
   "hạ hòa": "hạ hòa",
   "thanh ba": "thanh ba",
   "thanh 3": "thanh ba",
   "phù ninh": "phù ninh",
   "yên lập": "yên lập",
   "cẩm khê": "cẩm khê",
   "tam nông": "tam nông",
   "lâm thao": "lâm thao",
   "thanh sơn": "thanh sơn",
   "thanh thủy": "thanh thủy",
   "tân sơn": "tân sơn",
   "tuy hòa": "tuy hòa",
   "sông cầu": "sông cầu",
   "đồng xuân": "đồng xuân",
   "tuy an": "tuy an",
   "sơn hòa": "sơn hòa",
   "sông hinh": "sông hinh",
   "tây hòa": "tây hòa",
   "phú hòa": "phú hòa",
   "đông hòa": "đông hòa",
   "đồng hới": "đồng hới",
   "minh hóa": "minh hóa",
   "tuyên hóa": "tuyên hóa",
   "quảng trạch": "quảng trạch",
   "bố trạch": "bố trạch",
   "quảng ninh": "quảng ninh",
   "lệ thủy": "lệ thủy",
   "ba đồn": "ba đồn",
   "3 đồn": "ba đồn",
   "tam kỳ": "tam kỳ",
   "hội an": "hội an",
   "tây giang": "tây giang",
   "đông giang": "đông giang",
   "đại lộc": "đại lộc",
   "điện bàn": "điện bàn",
   "duy xuyên": "duy xuyên",
   "quế sơn": "quế sơn",
   "nam giang": "nam giang",
   "phước sơn": "phước sơn",
   "hiệp đức": "hiệp đức",
   "thăng bình": "thăng bình",
   "tiên phước": "tiên phước",
   "bắc trà my": "bắc trà my",
   "nam trà my": "nam trà my",
   "núi thành": "núi thành",
   "phú ninh": "phú ninh",
   "nông sơn": "nông sơn",
   "quảng ngãi": "quảng ngãi",
   "bình sơn": "bình sơn",
   "trà bồng": "trà bồng",
   "sơn tịnh": "sơn tịnh",
   "tư nghĩa": "tư nghĩa",
   "sơn hà": "sơn hà",
   "minh long": "minh long",
   "nghĩa hành": "nghĩa hành",
   "mộ đức": "mộ đức",
   "đức phổ": "đức phổ",
   "ba tơ": "ba tơ",
   "3 tơ": "ba tơ",
   "lý sơn": "lý sơn",
   "hạ long": "hạ long",
   "móng cái": "móng cái",
   "cẩm phả": "cẩm phả",
   "uông bí": "uông bí",
   "bình liêu": "bình liêu",
   "tiên yên": "tiên yên",
   "đầm hà": "đầm hà",
   "hải hà": "hải hà",
   "ba chẽ": "ba chẽ",
   "3 chẽ": "ba chẽ",
   "vân đồn": "vân đồn",
   "đông triều": "đông triều",
   "quảng yên": "quảng yên",
   "cô tô": "cô tô",
   "đông hà": "đông hà",
   "quảng trị": "quảng trị",
   "vĩnh linh": "vĩnh linh",
   "hướng hóa": "hướng hóa",
   "gio linh": "gio linh",
   "đa krông": "đa krông",
   "cam lộ": "cam lộ",
   "triệu phong": "triệu phong",
   "hải lăng": "hải lăng",
   "cồn cỏ": "cồn cỏ",
   "sóc trăng": "sóc trăng",
   "kế sách": "kế sách",
   "mỹ tú": "mỹ tú",
   "cù lao dung": "cù lao dung",
   "long phú": "long phú",
   "mỹ xuyên": "mỹ xuyên",
   "ngã năm": "ngã năm",
   "ngã 5": "ngã năm",
   "ngã lăm": "ngã năm",
   "thạnh trị": "thạnh trị",
   "vĩnh châu": "vĩnh châu",
   "trần đề": "trần đề",
   "sơn la": "sơn la",
   "quỳnh nhai": "quỳnh nhai",
   "thuận châu": "thuận châu",
   "mường la": "mường la",
   "bắc yên": "bắc yên",
   "phù yên": "phù yên",
   "mộc châu": "mộc châu",
   "yên châu": "yên châu",
   "mai sơn": "mai sơn",
   "sông mã": "sông mã",
   "sốp cộp": "sốp cộp",
   "vân hồ": "vân hồ",
   "thanh hóa": "thanh hóa",
   "bỉm sơn": "bỉm sơn",
   "sầm sơn": "sầm sơn",
   "mường lát": "mường lát",
   "quan hóa": "quan hóa",
   "bá thước": "bá thước",
   "quan sơn": "quan sơn",
   "lang chánh": "lang chánh",
   "ngọc lặc": "ngọc lặc",
   "cẩm thủy": "cẩm thủy",
   "thạch thành": "thạch thành",
   "hà trung": "hà trung",
   "vĩnh lộc": "vĩnh lộc",
   "yên định": "yên định",
   "thọ xuân": "thọ xuân",
   "thường xuân": "thường xuân",
   "triệu sơn": "triệu sơn",
   "thiệu hóa": "thiệu hóa",
   "hoằng hóa": "hoằng hóa",
   "hậu lộc": "hậu lộc",
   "nga sơn": "nga sơn",
   "như xuân": "như xuân",
   "như thanh": "như thanh",
   "nông cống": "nông cống",
   "đông sơn": "đông sơn",
   "quảng xương": "quảng xương",
   "nghi sơn": "nghi sơn",
   "thái bình": "thái bình",
   "quỳnh phụ": "quỳnh phụ",
   "hưng hà": "hưng hà",
   "đông hưng": "đông hưng",
   "thái thụy": "thái thụy",
   "tiền hải": "tiền hải",
   "kiến xương": "kiến xương",
   "vũ thư": "vũ thư",
   "thái nguyên": "thái nguyên",
   "sông công": "sông công",
   "định hóa": "định hóa",
   "phú lương": "phú lương",
   "đồng hỷ": "đồng hỷ",
   "võ nhai": "võ nhai",
   "đại từ": "đại từ",
   "phổ yên": "phổ yên",
   "phú bình": "phú bình",
   "huế": "huế",
   "quảng điền": "quảng điền",
   "phú vang": "phú vang",
   "hương thủy": "hương thủy",
   "hương trà": "hương trà",
   "a lưới": "a lưới",
   "phú lộc": "phú lộc",
   "nam đông": "nam đông",
   "mỹ tho": "mỹ tho",
   "gò công": "gò công",
   "cai lậy": "cai lậy",
   "tân phước": "tân phước",
   "cái bè": "cái bè",
   "chợ gạo": "chợ gạo",
   "gò công tây": "gò công tây",
   "gò công đông": "gò công đông",
   "tân phú đông": "tân phú đông",
   "trà vinh": "trà vinh",
   "càng long": "càng long",
   "cầu kè": "cầu kè",
   "tiểu cần": "tiểu cần",
   "cầu ngang": "cầu ngang",
   "trà cú": "trà cú",
   "duyên hải": "duyên hải",
   "tuyên quang": "tuyên quang",
   "lâm bình": "lâm bình",
   "na hang": "na hang",
   "chiêm hóa": "chiêm hóa",
   "hàm yên": "hàm yên",
   "yên sơn": "yên sơn",
   "sơn dương": "sơn dương",
   "tây ninh": "tây ninh",
   "tân biên": "tân biên",
   "dương minh châu": "dương minh châu",
   "hòa thành": "hòa thành",
   "gò dầu": "gò dầu",
   "bến cầu": "bến cầu",
   "trảng bàng": "trảng bàng",
   "vĩnh long": "vĩnh long",
   "long hồ": "long hồ",
   "mang thít": "mang thít",
   "vũng liêm": "vũng liêm",
   "tam bình": "tam bình",
   "bình minh": "bình minh",
   "trà ôn": "trà ôn",
   "vĩnh yên": "vĩnh yên",
   "phúc yên": "phúc yên",
   "lập thạch": "lập thạch",
   "tam dương": "tam dương",
   "tam đảo": "tam đảo",
   "bình xuyên": "bình xuyên",
   "yên lạc": "yên lạc",
   "vĩnh tường": "vĩnh tường",
   "sông lô": "sông lô",
   "yên bái": "yên bái",
   "nghĩa lộ": "nghĩa lộ",
   "lục yên": "lục yên",
   "văn yên": "văn yên",
   "mù căng chải": "mù căng chải",
   "trấn yên": "trấn yên",
   "trạm tấu": "trạm tấu",
   "văn chấn": "văn chấn",
   "yên bình": "yên bình",
   "điện biên phủ": "điện biên phủ",
   "mường lay": "mường lay",
   "mường nhé": "mường nhé",
   "mường chà": "mường chà",
   "tủa chùa": "tủa chùa",
   "tuần giáo": "tuần giáo",
   "điện biên": "điện biên",
   "điện biên đông": "điện biên đông",
   "mường ảng": "mường ảng",
   "nậm pồ": "nậm pồ",
   "buôn ma thuột": "buôn ma thuột",
   "buôn hồ": "buôn hồ",
   "ea h'leo": "ea h'leo",
   "ea súp": "ea súp",
   "buôn đôn": "buôn đôn",
   "cư m'gar": "cư m'gar",
   "krông búk": "krông búk",
   "krông năng": "krông năng",
   "ea kar": "ea kar",
   "m'đrắk": "m'đrắk",
   "krông bông": "krông bông",
   "krông pắc": "krông pắc",
   "krông bắc": "krông pắc",
   "krông a na": "krông a na",
   "lắk": "lắk",
   "cư kuin": "cư kuin",
   "gia nghĩa": "gia nghĩa",
   "đăk glong": "đăk glong",
   "cư jút": "cư jút",
   "đắk mil": "đắk mil",
   "krông nô": "krông nô",
   "đắk song": "đắk song",
   "đắk r'lấp": "đắk r'lấp",
   "tuy đức": "tuy đức",
   "biên hòa": "biên hòa",
   "long khánh": "long khánh",
   "vĩnh cửu": "vĩnh cửu",
   "định quán": "định quán",
   "trảng bom": "trảng bom",
   "thống nhất": "thống nhất",
   "cẩm mỹ": "cẩm mỹ",
   "long thành": "long thành",
   "xuân lộc": "xuân lộc",
   "nhơn trạch": "nhơn trạch",
   "cao lãnh": "cao lãnh",
   "sa đéc": "sa đéc",
   "hồng ngự": "hồng ngự",
   "tân hồng": "tân hồng",
   "tháp mười": "tháp mười",
   "tháp 10": "tháp mười",
   "thanh bình": "thanh bình",
   "lấp vò": "lấp vò",
   "lai vung": "lai vung"
}