{
  "signal": {
    "lunar_date": {
      "patterns": [
        "\\b(tết|âm|tháng giêng|tháng chạp)\\b"
      ],
      "replace": {
        "tết": "",
        "tháng giêng": "tháng 1",
        "tháng chạp": "tháng 12",
        "âm": ""
      }
    },
    "next_month": {
      "patterns": [
        "\\b(tháng (sau|tới|kế|tiếp))\\b"
      ]
    },
    "prev_month": {
      "patterns": [
        "\\b(tháng (trước|rồi|vừa rồi|vừa qua))\\b"
      ]
    },
    "next_day": {
      "patterns": [
        "\\bngày (mai|kia|mốt|kìa)\\b",
        "\\bhôm nay\\b",
        "\\bmai\\b"
      ],
      "values": {
        "hôm nay": 0,
        "ngày mai": 1,
        "ngày kia": 2,
        "ngày mốt": 2,
        "ngày kìa": 3,
        "mai": 1
      }
    },
    "prev_day": {
      "patterns": [
        "\\b(hôm|bữa) (qua|kia|mốt|kìa)\\b"
      ],
      "values": {
        "hôm qua": -1,
        "hôm kia": -2,
        "hôm mốt": -2,
        "hôm kìa": -3,
        "bữa qua": -1,
        "bữa kia": -2,
        "bữa mốt": -2,
        "bữa kìa": -3
      }
    },
    "range_day": {
      "patterns": [
        "\\b(([1-9]|[12][0-9]|3[01])|(hai( mươi | )(mốt|một|hai|ba|bốn|năm|lăm|sáu|bảy|bẩy|tư|tám|chín)|hai mươi|ba mươi|ba( mươi | )(mốt|một)|mười (một|hai|ba|bốn|năm|lăm|sáu|bảy|bẩy|tư|tám|chín)|(một|hai|ba|bốn|năm|sáu|bảy|bẩy|tư|tám|chín|mười))) (ngày|hôm|bữa) trước\\b",
        "\\b(([1-9]|[12][0-9]|3[01])|(hai( mươi | )(mốt|một|hai|ba|bốn|năm|lăm|sáu|bảy|bẩy|tư|tám|chín)|hai mươi|ba mươi|ba( mươi | )(mốt|một)|mười (một|hai|ba|bốn|năm|lăm|sáu|bảy|bẩy|tư|tám|chín)|(một|hai|ba|bốn|năm|sáu|bảy|bẩy|tư|tám|chín|mười))) (hôm|ngày|bữa) (nữa|sau|tới|kế|tiếp)\\b"
      ]
    },
    "weekday": {
      "patterns": [
        "\\bthứ (hai|ba|tư|bốn|năm|sáu|bảy|bẩy)(| tuần (sau|tới|kế|tiếp|trước|rồi|vừa rồi|vừa qua))\\b",
        "\\bthứ [2-7](| tuần (sau|tới|kế|tiếp|trước|rồi|vừa rồi|vừa qua))\\b",
        "\\bchủ nhật(| tuần (sau|tới|kế|tiếp|trước|rồi|vừa rồi|vừa qua))\\b"
      ],
      "values": {
        "thứ 2": 0,
        "thứ 3": 1,
        "thứ 4": 2,
        "thứ 5": 3,
        "thứ 6": 4,
        "thứ 7": 5,
        "thứ hai": 0,
        "thứ ba": 1,
        "thứ tư": 2,
        "thứ bốn": 2,
        "thứ năm": 3,
        "thứ sáu": 4,
        "thứ bảy": 5,
        "thứ bẩy": 5,
        "chủ nhật": 6
      }
    },
    "next_week": {
      "patterns": [
        "\\btuần (sau|tới|kế|tiếp)\\b"
      ]
    },
    "last_week": {
      "patterns": [
        "\\btuần (trước|rồi|vừa rồi|vừa qua)\\b"
      ]
    },
    "speech_time": {
      "patterns": [
        "\\b.*\\b"
      ],
      "replace": {
        "giờ": "h",
        "đúng": "",
        "hơn": "",
        "kém": "",
        "giờ rưỡi": "h 30",
        "rưỡi": "h 30",
        "h0": "h"
      }
    },
    "session": {
      "patterns": [
        "\\bchiều tối\\b",
        "\\bđầu (|buổi )(sớm|sáng|trưa|chiều|tối|đêm)\\b",
        "\\bcuối (|buổi )(trưa|chiều|tối|đêm)\\b",
        "\\b(chiều|tối|đêm) muộn\\b",
        "\\b(sớm|muộn|chậm) nhất\\b",
        "\\b(chuyến|xe) (cuối|đầu)\\b",
        "\\b(sáng sớm|giữa trưa|đêm muộn|giữa chiều)\\b",
        "\\b(sớm|sáng|trưa|chiều|tối|đêm)\\b"
      ],
      "values": {
        "tối muộn": {
          "hour": 23,
          "minute": 0
        },
        "đêm muộn": {
          "hour": 23,
          "minute": 0
        },
        "muộn nhất": {
          "hour": 23,
          "minute": 0
        },
        "chậm nhất": {
          "hour": 23,
          "minute": 0
        },
        "chuyến cuối": {
          "hour": 23,
          "minute": 0
        },
        "sớm nhất": {
          "hour": 0,
          "minute": 0
        },
        "chuyến đầu": {
          "hour": 0,
          "minute": 0
        },
        "sáng": {
          "hour": 8,
          "minute": 0
        },
        "trưa": {
          "hour": 11,
          "minute": 0
        },
        "chiều tối": {
          "hour": 18,
          "minute": 0
        },
        "chiều": {
          "hour": 14,
          "minute": 0
        },
        "tối": {
          "hour": 20,
          "minute": 0
        },
        "đêm": {
          "hour": 23,
          "minute": 0
        }
      }
    }
  }
}