{
  "question_1": [
    {
      "phrase_wrong": "About a year",
      "phrase_correct": "I have been working here for about a year.",
      "question": "How long have you been working here?"
    },
    {
      "phrase_wrong": "More than a year",
      "phrase_correct": "I have been working here for more than a year.",
      "question": "How long have you been working here?"
    },
    {
      "phrase_wrong": "Less than a year",
      "phrase_correct": "I have been working here for less than a year.",
      "question": "How long have you been working here?"
    },
    {
      "phrase_wrong": "",
      "phrase_correct": "I have been working here for ...",
      "question": "How long have you been working here?"
    }
  ]
}