{
  "entity": [
    {
      "name": "date",
      "regex": [
        {
          "pattern": [
            "\\b(ngày|mùng|mồng) ([0-9]{1}|[0-9]{2})/([0-9]{1}|[0-9]{2})/[0-9]{4}\\b",
            "\\b(ngày|mùng|mồng) ([0-9]{1}|[0-9]{2})/([0-9]{1}|[0-9]{2})\\b",
	        "\\b([0-9]{1}|[0-9]{2})/([0-9]{1}|[0-9]{2})/[0-9]{4}\\b",
            "\\b([0-9]{1}|[0-9]{2})/([0-9]{1}|[0-9]{2})\\b"
          ],
          "type": "format_date"
        },
        {
          "pattern": [
            "\\bngày (mai|kia|mốt|kìa)\\b",
            "\\b(hôm|bữa) (qua|kia|mốt|kìa)\\b",
            "\\bhôm nay\\b"
          ],
          "type": "speech_day"
        },
        {
          "pattern": [
            "\\b(([1-9]|[12][0-9]|3[01])|(hai( mươi | )(mốt|một|hai|ba|bốn|năm|lăm|sáu|bảy|bẩy|tư|tám|chín)|hai mươi|ba mươi|ba( mươi | )(mốt|một)|mười (một|hai|ba|bốn|năm|lăm|sáu|bảy|bẩy|tư|tám|chín)|(một|hai|ba|bốn|năm|sáu|bảy|bẩy|tư|tám|chín|mười))) (ngày|hôm) trước\\b",
            "\\b(([1-9]|[12][0-9]|3[01])|(hai( mươi | )(mốt|một|hai|ba|bốn|năm|lăm|sáu|bảy|bẩy|tư|tám|chín)|hai mươi|ba mươi|ba( mươi | )(mốt|một)|mười (một|hai|ba|bốn|năm|lăm|sáu|bảy|bẩy|tư|tám|chín)|(một|hai|ba|bốn|năm|sáu|bảy|bẩy|tư|tám|chín|mười))) (hôm|ngày) (nữa|sau|tới|kế|tiếp|trước|rồi|vừa rồi|vừa qua)\\b"
          ],
          "type": "speech_day"
        },
        {
          "pattern": [
            "\\bthứ (hai|ba|tư|bốn|năm|sáu|bảy|bẩy) tuần (sau|tới|kế|tiếp|trước|rồi|vừa rồi|vừa qua)\\b",
            "\\bthứ [2-7] tuần (sau|tới|kế|tiếp|trước|rồi|vừa rồi|vừa qua)\\b",
            "\\bchủ nhật tuần (sau|tới|kế|tiếp|trước|rồi|vừa rồi|vừa qua)\\b"
          ],
          "type": "weekday"
        },
        {
          "pattern": [
            "\\bthứ (hai|ba|tư|bốn|năm|sáu|bảy|bẩy)\\b",
            "\\bthứ [2-7]\\b",
            "\\bchủ nhật\\b"
          ],
          "type": "weekday"
        },
        {
          "pattern": [
            "\\b([1-9]|[12][0-9]|3[01]) tháng (sau|tới|kế|tiếp|trước|rồi|vừa rồi|vừa qua)\\b",
            "\\b([1-9]|[12][0-9]|3[01]) tháng (giêng|chạp)\\b",
            "\\b([1-9]|[12][0-9]|3[01]) tháng (mười một|mười hai|một|hai|ba|bốn|năm|sáu|bảy|tám|chín|mười)\\b",
            "\\b([1-9]|[12][0-9]|3[01]) tháng ([1-9]|1[0-2])\\b",
            "\\b(mùng|mồng|ngày) ([1-9]|[12][0-9]|3[01]) (tết|âm|dương|lịch âm|lịch dương)\\b",
            "\\b([1-9]|[12][0-9]|3[01]) (tết|âm|dương|lịch âm|lịch dương)\\b",
            "\\b(mùng|mồng|ngày) ([1-9]|[12][0-9]|3[01])\\b",
            "\\b([1-9]|[12][0-9]|3[01]) (tháng ([1-9]|1[0-2]|giêng|chạp|mười một|mười hai|một|hai|ba|bốn|năm|sáu|bảy|tám|chín|mười) |)(tết|âm|dương|lịch âm|lịch dương)\\b",
            "\\b(hai( mươi | )(mốt|một|hai|ba|bốn|năm|lăm|sáu|bảy|bẩy|tư|tám|chín)|hai mươi|ba mươi|ba( mươi | )(mốt|một)|mười (một|hai|ba|bốn|năm|lăm|sáu|bảy|bẩy|tư|tám|chín)|(một|hai|ba|bốn|năm|sáu|bảy|bẩy|tư|tám|chín|mười)) tháng (sau|tới|kế|tiếp|trước|rồi|vừa rồi|vừa qua)\\b",
            "\\b(hai( mươi | )(mốt|một|hai|ba|bốn|năm|lăm|sáu|bảy|bẩy|tư|tám|chín)|hai mươi|ba mươi|ba( mươi | )(mốt|một)|mười (một|hai|ba|bốn|năm|lăm|sáu|bảy|bẩy|tư|tám|chín)|(một|hai|ba|bốn|năm|sáu|bảy|bẩy|tư|tám|chín|mười)) tháng (giêng|chạp)\\b",
            "\\b(hai( mươi | )(mốt|một|hai|ba|bốn|năm|lăm|sáu|bảy|bẩy|tư|tám|chín)|hai mươi|ba mươi|ba( mươi | )(mốt|một)|mười (một|hai|ba|bốn|năm|lăm|sáu|bảy|bẩy|tư|tám|chín)|(một|hai|ba|bốn|năm|sáu|bảy|bẩy|tư|tám|chín|mười)) tháng (mười một|mười hai|một|hai|ba|bốn|năm|sáu|bảy|tám|chín|mười)\\b",
            "\\b(hai( mươi | )(mốt|một|hai|ba|bốn|năm|lăm|sáu|bảy|bẩy|tư|tám|chín)|hai mươi|ba mươi|ba( mươi | )(mốt|một)|mười (một|hai|ba|bốn|năm|lăm|sáu|bảy|bẩy|tư|tám|chín)|(một|hai|ba|bốn|năm|sáu|bảy|bẩy|tư|tám|chín|mười)) tháng ([1-9]|1[0-2])\\b",
            "\\b(mùng|mồng|ngày) (hai( mươi | )(mốt|một|hai|ba|bốn|năm|lăm|sáu|bảy|bẩy|tư|tám|chín)|hai mươi|ba mươi|ba( mươi | )(mốt|một)|mười (một|hai|ba|bốn|năm|lăm|sáu|bảy|bẩy|tư|tám|chín)|(một|hai|ba|bốn|năm|sáu|bảy|bẩy|tư|tám|chín|mười)) (tháng ([1-9]|1[0-2]|giêng|chạp|mười một|mười hai|một|hai|ba|bốn|năm|sáu|bảy|tám|chín|mười) |)(tết|âm|dương|lịch âm|lịch dương)\\b",
            "\\b(hai( mươi | )(mốt|một|hai|ba|bốn|năm|lăm|sáu|bảy|bẩy|tư|tám|chín)|hai mươi|ba mươi|ba( mươi | )(mốt|một)|mười (một|hai|ba|bốn|năm|lăm|sáu|bảy|bẩy|tư|tám|chín)|(một|hai|ba|bốn|năm|sáu|bảy|bẩy|tư|tám|chín|mười)) (tháng ([1-9]|1[0-2]|giêng|chạp|mười một|mười hai|một|hai|ba|bốn|năm|sáu|bảy|tám|chín|mười) |)(tết|âm|dương|lịch âm|lịch dương)\\b",
            "\\b(mùng|mồng|ngày) (hai( mươi | )(mốt|một|hai|ba|bốn|năm|lăm|sáu|bảy|bẩy|tư|tám|chín)|hai mươi|ba mươi|ba( mươi | )(mốt|một)|mười (một|hai|ba|bốn|năm|lăm|sáu|bảy|bẩy|tư|tám|chín)|(một|hai|ba|bốn|năm|sáu|bảy|bẩy|tư|tám|chín|mười))\\b"
          ],
          "type": "speech_date"
        },
        {
          "pattern": [
            "\\bmai\\b"
          ],
          "type": "speech_day"
        }
      ]
    },
    {
      "name": "time",
      "regex": [
        {
          "pattern": [
            "\\b([0-9]|1[0-9]|2[0-4])( giờ |h )(đúng|hơn|kém|rưỡi)\\b",
            "\\b([0-9]|1[0-9]|2[0-4])( giờ |h)([0-9]|[12345][0-9]|60)\\b",
            "\\b([0-9]|1[0-9]|2[0-4])( giờ|h)\\b",
            "\\bmười (một|hai|ba|bốn|năm|lăm|sáu|bảy|bẩy|tư|tám|chín)( giờ| h) (đúng|hơn|kém|rưỡi)\\b",
            "\\b(hai|hai mươi) (mốt|một|hai|ba|bốn|năm|lăm|sáu|bảy|bẩy|tư|tám|chín)( giờ | h)([0-9]|[12345][0-9]|60)\\b",
            "\\bmười (một|hai|ba|bốn|năm|lăm|sáu|bảy|bẩy|tư|tám|chín)( giờ| h)\\b",
            "\\b(hai|hai mươi) (mốt|một|hai|ba|bốn|tư)( giờ| h)\\b",
            "\\b(một|hai|ba|bốn|năm|sáu|bảy|bẩy|tư|tám|chín|mười)( giờ| h) (đúng|hơn|kém|rưỡi)\\b",
            "\\b(một|hai|ba|bốn|năm|sáu|bảy|bẩy|tư|tám|chín|mười)( giờ | h)([0-9]|[12345][0-9]|60)\\b",
            "\\b(một|hai|ba|bốn|năm|sáu|bảy|bẩy|tư|tám|chín|mười)( giờ| h)\\b",
            "\\b((một|hai|ba|bốn|năm|sáu|bảy|bẩy|tư|tám|chín|mười)|([0-9]|1[0-9]|2[0-4])) rưỡi\\b"
          ],
          "type": "speech_time"
        }
      ]
    },
    {
      "name": "session",
      "regex": [
        {
          "pattern": [
            "\\bchiều tối\\b",
            "\\bđầu (|buổi )(sớm|sáng|trưa|chiều|tối|đêm)\\b",
            "\\bcuối (|buổi )(trưa|chiều|tối|đêm)\\b",
            "\\b(chiều|tối|đêm) muộn\\b",
            "\\b(sớm|muộn|chậm) nhất\\b",
            "\\b(chuyến|xe) (cuối|đầu)\\b",
            "\\b(sáng sớm|giữa trưa|đêm muộn|giữa chiều)\\b",
            "\\b(sớm|sáng|trưa|chiều|tối|đêm)\\b"
          ],
          "type": "speech_session"
        }
      ]
    },
    {
      "name": "number",
      "regex": [
        {
          "pattern": [
            "\\b([0-9]{2}|[0-9]{1})\\b",
            "\\b(hai|ba|bốn|năm|sáu|bảy|bẩy|tư|tám|chín)( mươi | )(mốt|một|hai|ba|bốn|năm|lăm|sáu|bảy|bẩy|tư|tám|chín)\\b",
            "\\b(hai|ba|bốn|năm|sáu|bảy|bẩy|tám|chín) mươi\\b",
            "\\bmười (một|hai|ba|bốn|năm|lăm|sáu|bảy|bẩy|tư|tám|chín)\\b",
            "\\b(một|hai|ba|bốn|năm|sáu|bảy|bẩy|tư|tám|chín|mười)\\b"
          ],
          "type": "speech_number"
        }
      ]
    }
  ]
}
