{
  "bilingual_action": {
    "id": "text",
    "desc": "text",
    "params": {
      "text_en": "list-of-text:1",
      "text_vi": "list-of-text:1",
      "tts_en": "list-of-text:1",
      "tts_vi": "list-of-text:1"
    },
    "type_node": "bilingual_action"
  },
  "english_action": {
    "id": "text",
    "desc": "text",
    "params": {
      "text_en": "list-of-text:1",
      "text_vi": "list-of-text:1",
      "tts_en": "list-of-text:1",
      "tts_vi": "list-of-text:1"
    },
    "type_node": "english_action"
  },
  "condition_flow": {
    "id": "text",
    "desc": "text",
    "params": {
      "check": "list-of-text:0,1,n",
      "update": "list-of-text:0,1,n",
      "priority": "list-of-text:0,1"
    },
    "type_node": "condition_flow"
  },
  "intent_flow": {
    "id": "text",
    "desc": "text",
    "params": "list_of_text:1,n",
    "type_node": "intent_flow"
  },
  "update_local": {
    "id": "text",
    "desc": "text",
    "params": "list_of_text:1,n",
    "type_node": "update_local"
  },
  "fixed_condition": {
    "id": "text",
    "desc": "text",
    "type_node": "fixed_condition"
  },
  "start_node": {
    "id": "text",
    "desc": "text",
    "type_node": "start_node"
  },
  "end_node": {
    "id": "text",
    "desc": "text",
    "type_node": "end_node"
  },
  "destination_node": {
    "id": "text",
    "desc": "text",
    "type_node": "destination_node",
    "connection_id": "text"
  },
  "shortcut_node": {
    "id": "text",
    "desc": "text",
    "type_node": "shortcut_node",
    "connection_id": "text"
  },
  "correction_node": {
    "id": "text",
    "desc": "text",
    "type_node": "correction_node"
  },
  "api_node": {
    "id": "text",
    "desc": "text",
    "type_node": "api_node"
  },
  "user_information": {
    "id": "text",
    "desc": "text",
    "params": "dict-of-text",
    "type_node": "user_information"
  },
  "notification_node": {
    "id": "text",
    "desc": "text",
    "type_node": "notification_node"
  }
}