{
  "authen": {
    "host": "127.0.0.1",
    "port": 12121,
    "secretKey": "replace with your secretkey"
  },
  "chat": {
    "host": "127.0.0.1",
    "port": 14141,
    "secretKey": "replace with your secretkey"
  },
  "notify": {
    "host": "127.0.0.1",
    "port": 18181,
    "secretKey": "replace with your secretkey"
  }
}
