437894 684641
547296 879932
836009 307638
159440 530229
969315 140223
687308 218937
754150 780811
971035 609518
280494 95481
483519 801053
720741 119995
954790 884168
879488 199321
573323 113973
142795 298709
868731 618878
469414 419663
212172 514477
916395 790092
563951 129336
406111 971043
225853 969676
600743 849669
362264 456136
35185 430966
930772 218812
712436 67097
201065 850416
953368 580490
718983 562682
670797 971186
143134 618335
764825 632172
4706 451117
439563 98080
743920 553830
424158 5461
920122 123226
551736 257798
14046 419356
921685 914302
475949 123444
657023 291506
593298 426094
186781 697874
970558 739004
445338 395914
885230 526964
870058 132088
164890 198640
799011 233590
499787 900793
490099 652833
636965 525786
373839 512177
595870 998428
620069 958881
927723 922302
488813 664952
942748 65177
792112 480201
970232 867355
605286 922430
33190 719243
521625 303230
477099 578227
299669 566460
442452 574854
735811 789426
473356 356482
690616 195008
59045 844564
184472 558277
213320 653854
627009 596357
738996 6750
163405 997593
21532 670320
136502 203294
503441 883267
771957 687046
966679 415047
449014 775496
247500 567536
103865 183348
751687 964172
477997 379960
648016 745401
957608 559787
908835 688362
497012 933174
813521 961431
381621 52580
258722 954134
320093 343473
205858 986172
160618 738883
768195 241154
129716 803580
477685 542326
183087 341389
532114 647830
616836 137780
556935 762043
31547 172985
918324 491028
878864 863874
853500 29514
99789 38171
657830 794808
298389 44883
858135 564084
377136 748337
640130 998186
855711 398374
198993 940612
877053 143971
408074 255832
230331 953023
175967 802776
787143 466274
670662 2147
681520 179326
880706 883355
601685 183211
841611 813332
376880 146122
519337 948245
201559 769427
843896 680937
628531 734596
598931 185015
959214 899903
713272 617653
105696 189614
857261 342296
654429 824155
128480 788643
693907 69074
497816 892637
984159 21867
597475 964685
50257 126757
644302 242563
665830 34952
407216 778637
422914 643198
673833 994961
674889 640576
568577 98590
508276 771361
126171 616619
287882 724671
905137 330819
443363 80137
630131 142781
175117 167590
54034 515781
604299 593717
652051 772012
344256 779691
866385 707469
128516 83152
699480 825795
915435 731133
305090 325280
550071 670004
264122 366287
478607 776713
236058 294674
318683 998585
244369 607188
89634 799499
113402 270898
748362 577573
436576 924209
40026 845349
824329 12192
261738 613753
986446 402956
846534 474631
110776 791918
597423 94871
539153 239777
687955 656731
890063 172781
626982 464787
233121 933531
485502 173269
122807 808505
709758 796859
829813 728368
655943 623816
185881 383205
264189 867504
806620 397729
185498 223865
957293 789814
278037 884533
733308 54109
311561 280559
138741 960477
544401 772369
813578 999295
179163 83616
216773 675469
88359 767565
722360 821103
756058 911476
178335 260605
523677 650596
630783 324020
687022 846277
601645 626808
674814 630251
384395 434461
174384 953642
692965 625935
970541 384418
911031 804206
890439 675600
110253 25404
448051 221844
968269 477770
299819 785941
331566 635485
56789 456970
364702 496647
556699 777563
86571 44587
638097 190271
10367 546608
481676 51284
23880 626171
28450 836608
797225 830448
228905 603138
122259 369427
474118 888452
584299 676193
668604 2703
26803 69683
683854 597680
76523 428878
519543 502328
343050 93391
456669 410068
987871 881312
534142 721422
442262 178036
379693 15095
565599 154270
875332 78504
554529 452270
537858 4465
775288 405167
989051 496548
912712 720163
946740 240646
53383 502170
14980 991297
474873 969868
871743 685043
115358 266005
410814 565187
955527 609722
