252905 550753
104871 498698
569861 213653
548980 68268
689229 613201
674070 567208
865047 974172
591104 554929
995415 763605
376861 859646
274373 799115
164453 736031
313439 45698
968014 404286
962728 493242
149747 165285
572865 808473
533402 722485
721870 771204
568760 322402
397458 46454
785014 133001
422473 203961
671239 578621
385585 464407
64195 414240
293650 374725
467905 58657
540068 249326
110623 902606
744421 609201
162743 583305
574891 676126
972986 647455
240272 965569
287701 239837
700126 934652
89032 895176
679986 345013
894011 848754
562792 601360
876761 70671
476128 813333
699404 177531
778762 546207
695712 101383
428124 181284
178704 94174
550484 77205
473542 5273
853201 314222
581576 425117
767950 214338
998898 533068
442258 487350
865071 124955
655164 567526
194990 394315
389168 472100
719621 318329
131099 612984
684764 999852
946035 691659
656930 250741
402525 991674
965908 438096
261681 942876
280395 260740
538016 360218
59053 663915
37250 654891
163106 155906
244072 39320
175878 564353
964400 153829
33284 854914
40971 219578
172341 421296
572103 521191
559364 299212
324166 326464
964819 410653
816602 433670
457365 858386
901038 503383
920543 413093
505906 540815
300507 101010
502994 548520
226712 766801
468545 57057
973110 274749
562730 554688
825648 30643
33506 564928
867576 30077
408210 267433
845124 922773
569007 965705
70149 251846
149790 413111
316866 616913
80014 905776
383900 910126
304081 870079
820077 698019
135525 555048
152126 102710
198389 843691
150336 771775
639760 467107
679634 521967
496268 597839
95204 217002
730740 609156
743607 515152
593708 365625
92267 227503
412191 415993
607720 427262
381003 16141
182316 926965
75100 404944
412913 709841
369811 958565
175289 795515
822229 511849
269195 248641
481318 30823
174933 615501
15456 236932
559321 246547
550814 64873
245440 192182
551011 905659
337260 368736
653665 549835
939195 929819
35586 658135
732687 488144
815931 483486
695110 128816
866349 391732
531792 105291
19715 792246
731888 855733
485100 249061
928647 578832
50398 746834
228397 889565
315778 745559
228561 586878
81209 610713
765019 270298
344339 798584
382296 3751
190346 992230
932741 263960
908447 294187
795866 997196
963002 472797
419412 794191
107002 710183
215584 990972
947104 353322
714161 654941
642752 80468
818571 381315
901114 759184
80930 872485
389594 780307
488198 294361
156149 263955
422107 528111
143220 978828
692090 915896
979972 786071
422947 223886
356638 155083
729339 483858
413017 776296
982869 766171
719029 274050
482136 715626
399468 806993
44491 920675
570566 5872
724632 539906
111938 195088
771058 921200
29488 197208
360994 782261
608256 939151
559022 16349
451466 553416
753241 999932
887578 589280
156095 421889
654819 611223
222391 280747
687913 63916
127335 15088
282069 912321
588910 888948
709339 24864
876602 919232
861159 443845
148095 16365
437521 853714
17410 255811
507645 134193
193575 122633
634556 751108
359598 383846
827197 363654
846344 301424
191523 547662
174424 392412
629199 57354
386888 124787
231802 467192
857711 202876
930806 208583
743716 152400
667410 594971
462289 482726
954379 155286
712138 532753
803637 43198
861221 269138
305026 306707
847104 178900
701955 45819
771408 104727
637154 323917
118643 17797
268243 521904
356035 20642
63979 104518
548643 606732
748374 484925
217172 82020
743823 573539
151408 696569
878077 220805
669902 318207
443541 168519
537527 294592
813034 903887
764888 217795
812542 116299
864935 736033
285629 898192
