129222 460099
360015 858601
8371 844389
954213 576521
847615 24187
668496 852256
470510 544691
838735 48745
684483 595094
902219 917304
231725 374268
48319 512892
25898 990900
755964 225352
666967 236030
170151 596212
989993 174639
609734 237356
987996 963238
276302 133149
317492 183994
871652 831629
806082 864616
291635 2754
189122 941636
414692 40372
379662 594958
659155 919605
292613 308327
530348 779087
443097 784816
616724 963010
327278 635348
596267 173266
662828 641094
436519 327628
450445 544869
103461 44352
41163 885521
904775 730457
476093 838523
742139 991631
457500 523343
602621 492226
22516 506483
404520 322965
507715 999897
219823 763361
833511 129380
142939 527754
750246 517436
834291 811816
130663 180312
777021 846548
541656 8588
28570 515673
44702 58010
695854 573556
906624 548748
87928 551300
737078 933615
701068 399503
537414 39438
270614 739216
904986 61632
641906 734265
386233 405714
526290 158470
7834 732485
600389 724930
478086 456860
284501 293668
281462 114753
969771 677736
28406 604599
565922 580521
953568 129590
907789 914908
113405 687382
801800 39912
415620 31369
885157 564003
684720 531290
306787 627252
812953 223143
476547 849959
153771 214093
816785 823593
628944 311073
369750 479820
380902 5141
373653 197990
35997 449378
440420 996980
494426 534988
702664 913528
228698 729488
991127 967368
329350 972062
166880 217111
808806 43654
899418 799051
502108 670997
648104 709100
157590 349471
184893 387449
409677 702401
444958 601965
525712 854141
594106 57654
278095 702697
173162 449201
295309 895448
109432 725871
947873 508968
714240 914750
300915 557044
894411 926356
225326 469233
69589 301661
490228 715281
805397 344826
712435 777218
496335 481467
593573 466515
801060 966317
281817 228323
483626 49347
566122 632578
413517 994174
765094 517311
319424 478822
933758 277960
829547 747098
317129 264935
762686 710245
445071 649517
212154 587565
456875 39637
985602 941551
274521 711433
913661 650640
110356 207128
866843 804665
339551 579563
610474 569043
756669 338048
502360 694330
196425 618400
259432 721599
512255 94747
399137 295730
520024 649288
636320 598001
175987 21385
810214 481858
895217 889820
578107 361209
612511 502354
107871 592569
749589 52119
758569 352206
244777 256783
671278 976024
421525 258237
395095 419478
506785 542891
289 104382
590934 603554
770318 392409
479047 278813
308009 615796
531081 315762
180799 823529
29560 297895
485217 495415
51545 626943
380728 972449
418141 101480
639027 286279
292369 534122
840498 195890
138390 422721
295095 502896
576044 585892
910144 918485
210041 713201
811556 522158
160120 695096
945516 638500
588822 630440
184276 457395
197273 423526
741895 956373
378747 780752
422990 241845
254067 179743
391526 522437
410053 308866
724332 98296
792323 183677
753128 250330
123831 626194
626670 481563
835762 70529
865657 940492
295190 852576
719378 882097
890728 178010
854961 495779
35049 354464
919394 535346
850821 983534
614445 643964
391492 966808
883609 806760
348071 817050
974831 568759
484872 705651
950943 119754
20201 420110
439488 78114
859718 870650
864808 575570
14957 293675
438555 127510
294097 127094
242967 680427
992068 320228
891453 552155
742722 924605
602831 55538
175339 585048
542973 745028
