182292 310166
358893 424809
720072 531116
850621 370233
9959 769463
696966 765625
626576 648122
155257 935822
36529 807070
155002 851600
570716 215887
635900 425278
403135 13629
908146 761491
976835 773827
905766 775131
333229 491972
525674 905361
999727 406014
943849 557982
972643 465991
387904 404322
377077 344649
154298 959882
688736 165955
14919 188096
994247 327660
617791 732244
37582 140724
731016 703312
17211 340618
668293 250825
900883 87579
823709 981673
325659 586834
574311 380197
636851 427597
565360 765377
980199 439609
13880 651723
5549 25054
232638 365012
967603 194182
55703 865587
501545 316966
197733 471509
317294 759859
378672 157033
2934 75266
521129 946326
672710 655911
196161 94280
33690 87482
852545 255641
81537 25319
522271 884978
431540 624094
583351 369216
355890 116030
919438 93968
745928 339183
626305 709593
900128 585499
318129 91303
447372 699028
632903 473219
535758 963201
430220 551850
5519 517394
506437 244645
554643 673423
836898 678390
190601 806528
11208 45613
487397 575520
555645 307706
470713 473758
53311 654584
480146 875459
833823 792556
366328 232415
846311 133955
801621 218255
560785 346161
476319 600432
429699 735901
50465 366111
401156 821184
950595 446025
208911 257396
168462 900124
191258 343428
612080 602603
374157 702136
700109 988544
502162 94767
458380 845326
526373 289105
462410 798039
261727 658121
735581 158951
198764 549557
894527 829847
621618 867891
92302 423445
465211 815857
207019 298087
260167 745416
72831 304448
834048 564548
168111 142518
985077 149929
463940 546494
255003 451923
648062 183300
286912 493304
913943 2165
859521 190616
339888 345626
401617 935207
67928 411294
705437 732950
280401 865154
539625 60805
65210 165421
610053 378159
485632 178090
921192 341300
415611 974907
944717 721012
725356 523058
260316 537604
126657 925915
277175 853574
559378 495050
281836 251770
143574 675234
490538 74291
240594 94948
740271 526644
392368 591872
457980 534955
142589 955271
947788 670152
10812 912193
783214 957835
582544 55433
881161 497470
162870 30672
957678 476067
380002 556164
614121 630129
466635 589346
99104 808102
887427 132965
39202 72224
227504 349744
639142 265043
735671 375963
481100 881844
252918 224399
128862 982488
918860 364114
879860 815431
865371 940994
606606 66389
781618 4323
743352 251278
124250 844600
108875 391650
925632 169835
291792 23455
669750 82478
236813 472890
4187 609455
691387 844145
131310 193021
732177 754559
760632 793909
534910 577739
752507 344229
677713 582377
728839 307030
119002 876839
988905 639778
617433 913454
655817 240088
732381 386016
785685 440572
760090 172940
290189 954863
886743 403340
792398 400987
998617 941049
480961 403980
669349 837598
855927 300484
537920 362562
666199 833399
532894 394018
618902 61833
803219 603667
136418 306345
844009 586212
303902 869343
461763 878971
746767 904787
226755 121879
779650 527737
175210 275285
773678 739635
648819 120782
313426 278123
966825 104408
293703 250390
179811 228010
449162 570398
690116 518407
925558 286167
638859 509629
75679 895992
625780 970868
877305 563073
541404 966000
337473 660792
349766 98158
529584 63412
840261 977364
871435 544178
191245 484877
744142 234702
696048 487024
505507 184736
221109 421541
744253 475706
161502 91913
622958 414100
763158 268167
742610 800312
758417 577894
734509 494478
489306 291577
982943 611431
238636 915027
213490 973846
379222 269822
549507 438569
521052 892625
709100 531240
41874 632004