443077 938766
976211 756709
143855 395042
63272 560631
369997 603462
328033 911924
735797 279081
617675 748811
43103 640227
732791 757767
914568 265290
30988 449677
894662 133895
313133 749437
364209 691827
785954 376319
399838 613499
843921 308925
617978 395678
833173 812286
40573 733828
532459 409597
528671 833825
828483 634372
486432 149810
141301 847016
823594 599632
206773 353747
288589 697656
921507 780661
730158 937474
585384 608813
546964 691526
294518 886505
412566 642904
112787 737357
797711 741787
350153 753139
32854 410806
235693 724274
197125 741757
508243 133569
790812 304745
773882 766369
850541 507635
666749 186109
919903 341783
556004 690867
564778 826277
14976 154751
740676 175966
313506 787094
446377 231654
638894 953011
850982 69690
312806 416096
180620 49861
428994 27699
922266 784431
307296 431960
483414 865296
851035 51311
682729 132106
437640 106261
433239 81181
467500 489084
673101 895218
952247 169380
984040 727698
253335 403444
390603 842783
206898 860468
923370 826481
646030 185354
553275 536838
300387 644156
137159 875479
305926 262771
950856 848205
534709 360369
513967 379537
492484 210027
51277 687274
466356 845303
729266 118473
636818 464742
331676 838269
334622 723506
566385 354390
955244 667748
888349 310478
509055 888559
174809 451085
137273 567121
425076 766350
22518 31479
572164 998677
155184 40768
283211 516289
722763 785495
787368 214694
133976 103917
835657 747018
773994 530435
842119 398680
711583 990649
890532 186461
273484 681303
663891 12694
266637 456566
291931 698521
259778 416081
603367 175158
15882 689061
148764 508387
780760 766737
425820 556996
930571 503812
808562 586177
796601 614587
158075 491539
887508 736313
767207 745309
985100 803493
546729 815563
558794 787558
741594 955757
575594 601802
243416 681941
798838 352661
162725 668332
345406 365160
24966 925459
577128 853369
120254 443690
36950 518010
531987 934070
847972 863684
433038 960155
406505 13713
554200 931256
220060 501841
847167 31561
632801 449038
905297 226451
811469 898360
897405 651846
363661 5705
810398 583458
62158 588021
867645 11813
336550 751331
268180 427903
847275 243769
718520 134838
899841 302059
900503 583167
937801 458724
752593 193135
744194 799481
721158 86214
221649 62203
412433 379858
868405 284045
6890 819463
957368 134332
134922 637295
70304 624437
890441 8257
546717 43673
125598 248561
166993 452551
39791 691207
123866 874177
812938 41078
579429 953998
999603 981027
652345 621799
98081 744352
525625 391620
77158 53913
509257 178304
98866 749555
162446 213239
914017 374923
169136 968266
879824 114501
39225 218214
232494 993162
242953 232708
252739 928925
563675 545267
155281 593016
377983 224863
261004 6882
126802 402262
675911 198669
436320 336129
829320 920222
152978 654998
212013 165482
529008 823894
412637 190345
528557 803272
385879 583193
725831 226329
465529 780839
706882 252400
168840 529111
807732 406930
973120 875635
266746 31988
804840 363799
796219 365620
304881 823273
963077 982255
569287 677847
274167 586905
721080 638455
130861 369541
908169 213762
381466 97344
662369 748559
832922 848965
943764 631503
558950 550558
885494 264518
686105 676651
760474 197432
834007 13438
722711 211467
466489 130928
755204 940385
33407 140382
428619 721627
111413 153633
152142 757188
466896 855262
345213 907991
751614 723423
83873 112699
614993 321557
385718 5981
846664 623316
875191 50585
70165 388396
362383 670324
165512 116515
44846 728259
340230 348434
314866 137973
666689 873297
941362 913366
409046 182769
533852 351642
189360 638466
897775 872163
61834 968639
959085 782958
532143 476724
972091 419077
871332 855302
648297 336588
955251 592242
683477 629258
956670 168876
940960 791807
167923 100093
424074 113156
896047 18868
233331 339859
435862 328467
543066 735076
577987 605805
678908 489369
197477 197266
74833 210417
616367 252744
770855 149080
796673 516592
580305 335479
915133 607098
71474 945046
475758 812576
351147 512174
299851 729324
746644 534243
551338 416491
992513 122063
730648 417908
