25

4
Cassi Rainer Mace
Pet Cash Buller
Berni Aldric Malin
Susanne Wendell Housen
1 2 4 3
2 1 4 3
3 4 1 2
3 4 2 1
2 4 3 1

5
Cati Durant Finnegan
Amara Stephen Wahlstrom
Heda Sheff Haynor
Ellie Chen Jardena
Jeanine Morly Leonardo
1 3 5 4 2
5 3 1 2 4
4 1 5 3 2

6
Rori Domenico Easter
Golda Jarret Heshum
Callida Yvon Sarge
Jobina Addie Humbert
Tresa Pierce Jeanelle
Rosanna Corbin Mashe
4 5 1 2 6 3
6 1 4 2 5 3
3 4 2 1 6 5
4 5 2 3 6 1
4 6 2 1 3 5
2 3 6 4 5 1
2 6 5 4 1 3

5
Ardelle Barris Avron
Norrie Moritz Hettie
Samantha Kort Wendt
Paloma Perren Kilk
Daffie Orin Erlinna
1 3 4 2 5
3 1 5 2 4
5 4 2 1 3
2 1 3 5 4
4 2 3 5 1

8
Ebba Gaspard Missi
Viviene Findley Verras
Ted Correy Joub
Carri Tadeas Bennett
Fredrika Elliot Stander
Gerhardine Brandyn Karli
Dorry Eric Nilla
Amara Andris LaRue
2 1 6 3 7 4 8 5
4 7 1 2 3 6 5 8
5 2 7 6 3 1 4 8
1 3 6 8 5 4 7 2
5 2 4 3 6 8 7 1

5
Darline Rustie Wileen
Marquita Timmie Truitt
Bobbette Ernesto Trembly
Elise Vasily Mundford
Jenifer Bryce Gorton
3 1 2 4 5
4 1 5 2 3
1 5 3 2 4
2 5 1 3 4
4 1 2 5 3
1 2 3 5 4

6
Nevsa Christian Laureen
Leyla Erhard Silda
Carlynne Howie Faubert
Mellie Welch Favrot
Charmain Artair Beore
Ava Rem Dorrie
6 1 3 4 5 2

3
Antonia Lawrence Petes
Verine Domingo Jonas
Anna-Maria Brandyn Rogerson
2 1 3
2 3 1
3 2 1
1 3 2
2 3 1
1 3 2
1 3 2
2 3 1
2 3 1
2 3 1

1
Melania Humfried Gonagle
1
1
1
1

1
Gwenora Dorey Gilroy
1

4
Heidi Burtie Julian
Aubrie Val Jennilee
Tiffanie Boy Siddra
Maribelle Virge William
4 2 1 3
4 3 1 2
4 3 2 1
1 2 4 3
3 2 4 1
3 1 2 4
1 3 2 4

7
Tresa Vincenty Domonic
Kimberlee Esdras Wolfson
Paloma Shawn Walton
Kaitlin Siward McDermott
Shara Damian Winikka
Honoria Freedman Lundt
Reyna Balduin Hesler
3 2 1 5 4 6 7
1 5 2 3 7 4 6
5 3 7 6 1 2 4
2 4 6 5 1 7 3

5
Didi Parrnell Victoria
Odille Lothario Orfinger
Marie-Jeanne Willy Lucky
Felisha Shane Adall
Eveleen Whittaker Derinna
1 2 3 5 4

10
Cherice Guntar Lisandra
Flor Lem Barthelemy
Emylee Chandler Thorsten
Keeley Sloane Sharon
Pamela Weber Robbins
Mommy Alfy Bowie
Anica Payton Taam
Charlene Jethro Shakti
Hannah Meredith Cristine
Anya George Boyse
9 8 7 6 3 10 1 5 4 2
7 1 5 3 8 9 4 10 6 2
1 3 2 9 6 8 10 7 5 4
4 5 10 1 8 7 9 2 3 6
10 7 2 1 9 4 8 3 5 6

6
Brittaney Lanny Neomah
Lucille Cross Jaworski
Madel Denney Peggie
Margarita Benito Borg
Charyl Weidar Tsuda
Lilla Keen Milore
4 3 5 6 2 1
4 5 6 3 1 2

2
Joelle Winn Padget
Melinde Bradan Senskell
1 2
2 1
1 2
1 2

3
Reiko Thurstan Kennan
Harrie Lane Adena
Dita Abran Wengert
2 1 3
1 2 3
3 1 2
1 2 3
2 3 1
3 2 1

10
Shandeigh Banky Rheta
Glenine Harris Huston
Leila Del Edme
Abra Osbert Barri
Junina Laughton Oeflein
Tobe Ezri Quinta
Morgan Micheal Treiber
Mozelle Griffin Cummins
Guinevere Ruddy Tamas
Lexi Norris Kern
2 6 9 10 3 5 8 7 1 4
6 1 2 8 9 5 3 7 10 4
1 10 6 7 9 5 3 8 2 4
7 10 9 8 6 5 4 2 3 1
2 7 10 8 5 1 3 4 6 9
8 9 3 1 5 6 7 2 4 10
10 4 2 3 9 5 8 6 7 1
8 2 7 9 1 5 10 4 6 3

3
Liz Cornelius Small
Latisha Orran Tsan
Carey Barde Malory
3 2 1
1 3 2
2 1 3
3 2 1
2 1 3

6
Jobyna Tye Ambrosi
Allix Kevon Buatti
Leonanie Shurwood Canica
Dee Cleveland Stefanac
Renee Normand Sisson
Blondell Roldan Chretien
2 4 3 5 1 6
6 3 5 1 4 2
5 1 3 6 2 4

4
Joete Thane Marelda
Yolane Derrik Perrin
Filide Farley Leal
Gabriell Rickert Justis
3 4 2 1
4 2 1 3
3 4 1 2
3 2 1 4
3 1 2 4
3 4 1 2
3 1 2 4
2 4 1 3
2 3 4 1
3 2 1 4

7
Albina Donaugh Elburt
Siobhan Isaac Shanda
Licha Hamel Lowis
Ammamaria Cassius Rand
Berte Irwinn Vanny
Laetitia Mayer Jed
Candace Roderich Guise
6 4 1 2 3 5 7
3 5 1 7 2 6 4
6 3 4 7 1 2 5
7 6 2 1 3 4 5
1 6 4 5 3 7 2
2 6 1 7 3 4 5
3 6 2 4 5 1 7
1 6 5 4 2 7 3
4 3 5 1 6 7 2
2 5 1 4 3 6 7

1
Marcie Sayres Stafford
1
1
1

3
Eryn Alonso Jessey
Briana Brandtr Hauge
Becki Tristan Wareing
2 1 3
3 1 2

3
Marysa Brock Brandt
Terese Gerardo Acus
Tabbie Cassie Prince
2 3 1
1 3 2
1 3 2
