3155 9421
5297 39167
5453 2126
7721 63327
17460 92831
22914 88478
23612 28197
23791 49890
24496 11563
28928 27122
38548 41385
40364 37959
41425 6264
42893 73061
49450 38459
56604 73628
56680 80999
57347 4811
59343 65970
65263 83564
65812 33911
67797 54449
74788 103545
75651 130168
81028 103274
82624 82893
84486 73893
85783 72120
87789 126819
88953 104310
94869 9841
98757 83273
106282 91309
111910 107360
112748 115044
113858 64754
116461 117480
116565 95021
121594 128276
122160 118406
122554 129242
126653 67995
129094 148933
129695 119611
131289 100586
135761 138943
145065 165442
150428 153221
150538 116694
152095 125568
165143 175155
169496 207254
170476 172803
171628 153637
173865 194343
174282 217106
177110 233408
179509 176995
183252 175108
184268 199052
185293 183266
193001 214946
197034 243804
204794 122677
214974 280807
215881 282160
217199 204631
221027 272783
222184 223898
224925 210314
229512 212395
234154 299830
235054 208198
236876 245291
242991 237309
243986 330364
250558 253133
251255 236222
256991 278483
258823 246589
262737 237823
269729 274503
271812 250911
273865 290919
282541 278916
283361 282081
283878 302945
288837 231312
290277 287445
291963 259284
294025 283933
295258 292583
297954 229417
307335 254122
310492 294520
313472 252583
320890 330382
323505 328458
325276 320639
330412 343102
334476 256628
339234 332643
339600 338603
342444 358753
344357 370808
345208 352583
345983 337242
346775 360218
348099 282516
353346 350481
359423 309710
360798 377603
364521 349315
364595 321493
365585 360417
376191 376025
379353 376323
380818 440461
381114 414903
383756 373731
406965 463251
408342 346093
409069 384804
409304 371039
410015 459442
410117 397817
412798 376893
416206 390017
420079 386598
427036 350970
427926 427151
436827 406802
439123 458013
439501 467082
440576 483165
440577 502716
440615 449218
449673 412916
451066 469816
457209 510107
458177 464828
461312 444039
473680 472997
479118 480279
479511 452260
480822 470842
490692 500786
493861 433212
494316 478285
498098 533696
500713 469014
502523 534537
512400 511495
531755 613300
534762 523409
536314 535805
538914 569923
540935 547101
544593 542634
548377 585807
553627 575768
554828 567673
560933 567256
563545 555744
568432 515380
569055 504114
575091 565093
575647 600145
578132 582275
581624 566810
583494 610132
583680 656567
584301 537429
585381 662456
586377 596274
587971 630966
588850 608716
589256 557865
589491 602548
592282 592753
593843 598551
598964 632400
599268 634284
599374 575912
599980 605275
605734 595286
605919 553380
611587 594234
613142 613164
613495 577819
615835 645844
617596 629089
618361 653875
619587 574975
626461 623128
627093 630810
627121 597920
633404 616341
634206 653969
634469 555517
637489 621649
651280 650491
655409 702083
663152 617129
663567 738784
665730 665610
667734 653522
671733 657893
677014 720270
678429 672483
685543 660183
689518 704459
691743 759356
692342 712961
698678 682700
698788 785997
711354 770713
714716 723228
716592 675825
725146 716416
725345 765386
726840 715101
727965 676428
730347 735115
733568 699386
737562 704414
739694 739394
739892 671748
740976 752420
741088 755814
743583 658576
745933 747014
750989 770818
752012 666994
754746 727482
758332 769884
765937 720646
766335 776871
770605 783829
772359 819560
774708 763254
776687 847214
779646 831930
784115 824928
788204 798566
790864 817994
795170 768862
803505 807173
807810 806061
808572 825416
811374 822694
812888 781751
814957 845516
818643 820997
818890 854491
830068 822651
834615 813510
835841 833835
840526 835433
840838 837827
842341 925735
845870 860818
847786 883519
848842 836977
849440 932635
849804 847531
852354 866424
854145 854345
855664 851606
856649 886146
858640 873849
860564 929939
865753 879564
866788 878560
866848 857170
869243 853686
871369 888429
871590 790539
874677 834765
875220 878382
885656 959602
886686 940102
887784 902683
887808 879269
892653 948337
894578 899194
897777 899134
898754 879061
909173 822545
952326 897164
