-48 -40 -72 808
-8 -24 -40 -72 -8 -40 752
-8 -24 -72 -56 800
24 -24 -40 -40 -56 768
-16 -56 -16 -48 -40 -16 752
-72 -24 -16 856
-72 -24 -24 848
-64 -8 -40 -24 824
-16 -64 896
-24 -56 -72 -8 -72 -24 -80 600
-8 -80 -48 -8 8 -48 8 -8 -48 656
-72 -80 -16 -56 -24 704
-80 -64 -56 -72 688
-8 -16 32 -72 40 -48 -8 -72 632
-32 -72 -40 -8 -80 -72 640
-8 -48 -32 -8 -56 -40 -8 -72 656
-40 8 -56 -64 -24 760
-8 -64 -24 -40 824
-32 -56 888
-32 -64 -72 -80 712
-24 16 -32 -64 824
