<svg id="menu" xmlns="http://www.w3.org/2000/svg" width="48" height="48" viewBox="0 0 48 48">
  <g id="Line_1" data-name="Line 1" transform="translate(0 -96)">
    <rect id="Rettangolo_32" data-name="Rettangolo 32" width="18" height="2" transform="translate(15 114)" fill="#fff"/>
  </g>
  <g id="Line_2" data-name="Line 2" transform="translate(0 -96)">
    <rect id="Rettangolo_33" data-name="Rettangolo 33" width="18" height="2" transform="translate(15 119)" fill="#fff"/>
  </g>
  <g id="Line_3" data-name="Line 3" transform="translate(0 -96)">
    <rect id="Rettangolo_34" data-name="Rettangolo 34" width="18" height="2" transform="translate(15 124)" fill="#fff"/>
  </g>
  <rect id="Rettangolo_35" data-name="Rettangolo 35" width="48" height="48" fill="#fff" opacity="0"/>
</svg>
