<svg id="li" xmlns="http://www.w3.org/2000/svg" xmlns:xlink="http://www.w3.org/1999/xlink" width="48" height="48" viewBox="0 0 48 48">
  <defs>
    <clipPath id="clip-path">
      <rect id="Rettangolo_283" data-name="Rettangolo 283" width="48" height="48" fill="none"/>
    </clipPath>
  </defs>
  <g id="Raggruppa_202" data-name="Raggruppa 202" clip-path="url(#clip-path)">
    <g id="Raggruppa_201" data-name="Raggruppa 201">
      <g id="Raggruppa_200" data-name="Raggruppa 200" clip-path="url(#clip-path)">
        <g id="Raggruppa_199" data-name="Raggruppa 199" opacity="0">
          <g id="Raggruppa_198" data-name="Raggruppa 198">
            <g id="Raggruppa_197" data-name="Raggruppa 197" clip-path="url(#clip-path)">
              <rect id="Rettangolo_280" data-name="Rettangolo 280" width="48" height="48" fill="#3d5560"/>
            </g>
          </g>
        </g>
        <path id="Tracciato_84" data-name="Tracciato 84" d="M31.185,15H16.815A1.806,1.806,0,0,0,15,16.8V31.2A1.806,1.806,0,0,0,16.815,33h14.37A1.807,1.807,0,0,0,33,31.2V16.8A1.808,1.808,0,0,0,31.185,15M20.776,29.243H18.354v-7.7h2.422ZM19.55,20.6a1.2,1.2,0,1,1,1.305-1.2,1.2,1.2,0,0,1-1.305,1.2m10.068,8.645H27.2V24.975c0-.991-.35-1.669-1.226-1.669a1.33,1.33,0,0,0-1.243.9,1.7,1.7,0,0,0-.08.6v4.44H22.225V24c0-.96-.032-1.763-.063-2.456h2.1l.112,1.071h.049A2.8,2.8,0,0,1,26.83,21.37c1.593,0,2.788,1.055,2.788,3.322Z" fill="#3d5560"/>
      </g>
    </g>
  </g>
</svg>
