<svg id="save" xmlns="http://www.w3.org/2000/svg" xmlns:xlink="http://www.w3.org/1999/xlink" width="48" height="48" viewBox="0 0 48 48">
  <defs>
    <clipPath id="clip-path">
      <rect id="Rettangolo_178" data-name="Rettangolo 178" width="48" height="48" fill="#e1f4ff"/>
    </clipPath>
  </defs>
  <g id="Raggruppa_111" data-name="Raggruppa 111" clip-path="url(#clip-path)">
    <g id="Raggruppa_110" data-name="Raggruppa 110">
      <g id="Raggruppa_109" data-name="Raggruppa 109" clip-path="url(#clip-path)">
        <g id="Raggruppa_108" data-name="Raggruppa 108" opacity="0">
          <g id="Raggruppa_107" data-name="Raggruppa 107">
            <g id="Raggruppa_106" data-name="Raggruppa 106" clip-path="url(#clip-path)">
              <rect id="Rettangolo_175" data-name="Rettangolo 175" width="48" height="48" fill="#e1f4ff"/>
            </g>
          </g>
        </g>
      </g>
    </g>
    <path id="Tracciato_67" data-name="Tracciato 67" d="M28.414,15H15V33H33V19.586ZM21,25h6v6H21Zm10,6H29V23H19v8H17V17H27.586L31,20.414Z" fill="#e1f4ff"/>
  </g>
</svg>
