<svg xmlns="http://www.w3.org/2000/svg" width="584" height="8" viewBox="0 0 584 8">
  <g id="Rettangolo_800" data-name="Rettangolo 800" fill="#fff" stroke="#707070" stroke-width="1">
    <rect width="584" height="8" stroke="none"/>
    <rect x="0.5" y="0.5" width="583" height="7" fill="none"/>
  </g>
</svg>
