<svg xmlns="http://www.w3.org/2000/svg" width="201.625" height="203.265" viewBox="0 0 201.625 203.265">
  <g id="Logo_payoff" transform="translate(0.297)">
    <g id="Raggruppa_324" data-name="Raggruppa 324" transform="translate(-318.626 -218.065)">
      <path id="Unione_1" data-name="Unione 1" d="M21165.842,16651.936a10.979,10.979,0,0,1-2.033-2.369,12.56,12.56,0,0,1-1.373-3.213,24.036,24.036,0,0,1-.539-5.973v-19.043h4.836v19.09c0,3.166.363,5.359,1.084,6.6a7.728,7.728,0,0,0,3.3,2.973,11.419,11.419,0,0,0,5.221,1.121,10.543,10.543,0,0,0,6.98-2.242,6.881,6.881,0,0,0,2.049-2.84,17.507,17.507,0,0,0,.625-5.609v-19.09h4.84v19.09a22.853,22.853,0,0,1-.564,5.85,12.729,12.729,0,0,1-1.4,3.289,10.317,10.317,0,0,1-2.033,2.348q-4,3.442-10.451,3.441Q21169.815,16655.355,21165.842,16651.936Zm-100.379.357v-6.117q3.9,4.939,9.025,4.943a5.679,5.679,0,0,0,3.768-1.26,3.939,3.939,0,0,0,1.506-3.154q0-3.073-4.43-5.828l-3.656-2.221a16.76,16.76,0,0,1-4.9-4.135,7.889,7.889,0,0,1-1.457-4.687,8.288,8.288,0,0,1,2.758-6.451,10.309,10.309,0,0,1,7.164-2.477,13.566,13.566,0,0,1,7.727,2.363v5.465a11.134,11.134,0,0,0-7.824-3.494,6.461,6.461,0,0,0-3.873,1.088,3.315,3.315,0,0,0-1.516,2.8,4.29,4.29,0,0,0,1.115,2.828,13.946,13.946,0,0,0,3.6,2.77l3.672,2.178q6.158,3.668,6.154,9.355a8.577,8.577,0,0,1-2.705,6.57,9.9,9.9,0,0,1-7.041,2.529A14.813,14.813,0,0,1,21065.463,16652.293Zm195.275,2.68-4.482-9.971-7.4-16.465-6.943,16.465-4.2,9.971h-4.953l14.447-33.826h3.385l15.082,33.826Zm-55.842,0v-33.635h4.814v29.252h15.146v4.383Zm-61.785,0V16628.8l-10.338,13h-.891l-10.461-13v26.174h-4.814v-33.635h4.559l11.176,13.813,11.105-13.812h4.5v33.635Zm-46.08,0v-33.635h4.814v33.635Z" transform="translate(-20746.486 -16297.894)" fill="#3d4660" stroke="rgba(0,0,0,0)" stroke-miterlimit="10" stroke-width="1"/>
      <g id="Raggruppa_322" data-name="Raggruppa 322">
        <path id="Tracciato_145" data-name="Tracciato 145" d="M325.358,368.02a11.53,11.53,0,0,1,5.548,1.441v3.386A10.858,10.858,0,0,0,325.471,371a3.929,3.929,0,0,0-2.251.557,1.724,1.724,0,0,0-.811,1.489q0,1.116,1.51,2.061.423.282,3.26,1.581a9.349,9.349,0,0,1,3.5,2.54,5.352,5.352,0,0,1,1.074,3.359,5.128,5.128,0,0,1-1.829,4.1,7.037,7.037,0,0,1-4.735,1.56,11.216,11.216,0,0,1-3.253-.416,14.108,14.108,0,0,1-3.056-1.433v-3.755q3.162,2.625,5.957,2.625a3.84,3.84,0,0,0,2.257-.606,1.878,1.878,0,0,0,.862-1.61,2.541,2.541,0,0,0-1.5-2.229q-1.243-.678-3.2-1.624a9.43,9.43,0,0,1-3.479-2.47,5.027,5.027,0,0,1-1.15-3.274,4.8,4.8,0,0,1,1.849-3.959A7.6,7.6,0,0,1,325.358,368.02Z" fill="#8da0b0"/>
        <path id="Tracciato_146" data-name="Tracciato 146" d="M349.526,368.02a11.852,11.852,0,0,1,5.512,1.264,9.96,9.96,0,0,1,.042,17.657,12.465,12.465,0,0,1-11.151-.021,9.76,9.76,0,0,1-5.3-8.78,9.911,9.911,0,0,1,1.4-5.1,9.71,9.71,0,0,1,3.854-3.705A11.75,11.75,0,0,1,349.526,368.02Zm-6.959,10.12a7.007,7.007,0,0,0,.89,3.529,6.181,6.181,0,0,0,2.476,2.428,7.416,7.416,0,0,0,3.593.862,6.851,6.851,0,0,0,4.989-1.907,6.558,6.558,0,0,0,1.955-4.912,7.117,7.117,0,0,0-.882-3.535,6.1,6.1,0,0,0-2.485-2.435,7.953,7.953,0,0,0-7.212.007,6.026,6.026,0,0,0-2.463,2.428A7.194,7.194,0,0,0,342.567,378.14Z" fill="#8da0b0"/>
        <path id="Tracciato_147" data-name="Tracciato 147" d="M372.112,368.274v16.74h9.57v2.979H368.3V368.274Z" fill="#8da0b0"/>
        <path id="Tracciato_148" data-name="Tracciato 148" d="M391.72,368.274V379.75a6.243,6.243,0,0,0,.53,2.808,4.137,4.137,0,0,0,1.728,1.723,5.6,5.6,0,0,0,2.8.678,6.324,6.324,0,0,0,2.972-.643,4.051,4.051,0,0,0,1.785-1.75,6.87,6.87,0,0,0,.564-3.07V368.274H405.9V379.99a7.79,7.79,0,0,1-2.385,6.118,9.764,9.764,0,0,1-6.747,2.139,10.8,10.8,0,0,1-4.75-.974,6.916,6.916,0,0,1-3.069-2.816,8.53,8.53,0,0,1-1.059-4.327V368.274Z" fill="#8da0b0"/>
        <path id="Tracciato_149" data-name="Tracciato 149" d="M430.806,368.274v2.978h-7v16.741h-3.81V371.252h-7v-2.978Z" fill="#8da0b0"/>
        <path id="Tracciato_150" data-name="Tracciato 150" d="M441.932,368.274v19.719h-3.81V368.274Z" fill="#8da0b0"/>
        <path id="Tracciato_151" data-name="Tracciato 151" d="M460.806,368.02a11.852,11.852,0,0,1,5.512,1.264,9.716,9.716,0,0,1,3.9,3.641,9.956,9.956,0,0,1-3.86,14.016,12.462,12.462,0,0,1-11.15-.021,9.758,9.758,0,0,1-5.3-8.78,9.921,9.921,0,0,1,1.4-5.1,9.71,9.71,0,0,1,3.854-3.705A11.75,11.75,0,0,1,460.806,368.02Zm-6.959,10.12a7.007,7.007,0,0,0,.89,3.529,6.187,6.187,0,0,0,2.476,2.428,7.416,7.416,0,0,0,3.593.862,6.853,6.853,0,0,0,4.99-1.907,6.562,6.562,0,0,0,1.955-4.912,7.107,7.107,0,0,0-.883-3.535,6.1,6.1,0,0,0-2.485-2.435,7.953,7.953,0,0,0-7.212.007,6.018,6.018,0,0,0-2.462,2.428A7.184,7.184,0,0,0,453.847,378.14Z" fill="#8da0b0"/>
        <path id="Tracciato_152" data-name="Tracciato 152" d="M482.926,368.274l11.716,13.763V368.274h3.726v19.719h-3.275l-11.785-13.988v13.988h-3.726V368.274Z" fill="#8da0b0"/>
        <path id="Tracciato_153" data-name="Tracciato 153" d="M512.754,368.02a11.529,11.529,0,0,1,5.547,1.441v3.386A10.855,10.855,0,0,0,512.867,371a3.929,3.929,0,0,0-2.251.557,1.725,1.725,0,0,0-.812,1.489q0,1.116,1.51,2.061.423.282,3.261,1.581a9.35,9.35,0,0,1,3.5,2.54,5.351,5.351,0,0,1,1.073,3.359,5.127,5.127,0,0,1-1.828,4.1,7.04,7.04,0,0,1-4.735,1.56,11.217,11.217,0,0,1-3.253-.416,14.113,14.113,0,0,1-3.057-1.433v-3.755q3.162,2.625,5.957,2.625a3.841,3.841,0,0,0,2.258-.606,1.88,1.88,0,0,0,.861-1.61,2.541,2.541,0,0,0-1.5-2.229q-1.242-.678-3.2-1.624a9.426,9.426,0,0,1-3.48-2.47,5.032,5.032,0,0,1-1.15-3.274,4.8,4.8,0,0,1,1.85-3.959A7.6,7.6,0,0,1,512.754,368.02Z" fill="#8da0b0"/>
      </g>
      <g id="Raggruppa_323" data-name="Raggruppa 323">
        <path id="Tracciato_154" data-name="Tracciato 154" d="M322.051,412.993l.118-.083.711.894a7.277,7.277,0,0,0-1.561,1.326,5.124,5.124,0,0,0-.956,1.693,2.814,2.814,0,0,1,1.3-.335,2.183,2.183,0,0,1,1.635.688,2.336,2.336,0,0,1,.665,1.689,2.37,2.37,0,0,1-.723,1.747,2.409,2.409,0,0,1-1.76.718,2.376,2.376,0,0,1-1.874-.815,3.119,3.119,0,0,1-.715-2.133,5.567,5.567,0,0,1,.368-1.968,6.632,6.632,0,0,1,1.059-1.836A8.387,8.387,0,0,1,322.051,412.993Zm-1.941,5.048a3.627,3.627,0,0,0-.048.618,1.642,1.642,0,0,0,.4,1.141,1.331,1.331,0,0,0,1.033.448,1.236,1.236,0,0,0,.932-.383,1.336,1.336,0,0,0,.368-.965,1.257,1.257,0,0,0-.391-.962,1.447,1.447,0,0,0-1.032-.368,1.693,1.693,0,0,0-.6.1A3.45,3.45,0,0,0,320.11,418.041Z" fill="#3d4660"/>
        <path id="Tracciato_155" data-name="Tracciato 155" d="M339.1,417.188h2.76v3.483a7.531,7.531,0,0,1-3.013.659,4.465,4.465,0,0,1-3.262-1.192,3.938,3.938,0,0,1-1.221-2.938,4.087,4.087,0,0,1,1.265-3.066,4.377,4.377,0,0,1,3.171-1.224,5.674,5.674,0,0,1,1.318.15,10.773,10.773,0,0,1,1.577.55v1.2a5.785,5.785,0,0,0-2.918-.852,3.092,3.092,0,0,0-2.271.918,3.253,3.253,0,0,0,0,4.542,3.287,3.287,0,0,0,2.377.888,5.532,5.532,0,0,0,1.688-.323l.112-.036v-1.712H339.1Z" fill="#3d4660"/>
        <path id="Tracciato_156" data-name="Tracciato 156" d="M346.623,421.236v-8.22h2.059a2.979,2.979,0,0,1,1.98.617,2.075,2.075,0,0,1,.732,1.672,2.055,2.055,0,0,1-1.388,2.024,3.641,3.641,0,0,1,.771.706,14.493,14.493,0,0,1,1.059,1.559q.43.7.688,1.053l.436.589h-1.4l-.358-.542a1.216,1.216,0,0,0-.071-.1l-.229-.324-.364-.6-.394-.641a6.5,6.5,0,0,0-.668-.806,2.519,2.519,0,0,0-.548-.431,1.847,1.847,0,0,0-.821-.132H347.8v3.577Zm1.53-7.22H347.8v2.6h.448a3.34,3.34,0,0,0,1.226-.152,1.157,1.157,0,0,0,.518-.462,1.337,1.337,0,0,0,.185-.7,1.249,1.249,0,0,0-.206-.7,1.093,1.093,0,0,0-.579-.444A4.149,4.149,0,0,0,348.153,414.016Z" fill="#3d4660"/>
        <path id="Tracciato_157" data-name="Tracciato 157" d="M359.5,412.969h.827l3.685,8.267h-1.2l-1.1-2.436h-3.506l-1.028,2.436h-1.209Zm1.729,4.783-1.326-2.977-1.231,2.977Z" fill="#3d4660"/>
        <path id="Tracciato_158" data-name="Tracciato 158" d="M367.94,421.224v-8.208h2.772a5.852,5.852,0,0,1,2.653.5,3.8,3.8,0,0,1,1.554,1.48,4.126,4.126,0,0,1,.576,2.129,4.056,4.056,0,0,1-2.618,3.791,4.159,4.159,0,0,1-.854.244,11.492,11.492,0,0,1-1.482.061Zm2.648-7.161h-1.471v6.113h1.506a6.048,6.048,0,0,0,1.371-.12,3.228,3.228,0,0,0,.815-.3,2.8,2.8,0,0,0,.6-.457,3.043,3.043,0,0,0,.871-2.23,2.856,2.856,0,0,0-1.65-2.671,3.138,3.138,0,0,0-.809-.265A8.25,8.25,0,0,0,370.588,414.063Z" fill="#3d4660"/>
        <path id="Tracciato_159" data-name="Tracciato 159" d="M379.991,413.016h1.177v8.22h-1.177Z" fill="#3d4660"/>
        <path id="Tracciato_160" data-name="Tracciato 160" d="M392.377,421.224v-8.208h2.771a5.849,5.849,0,0,1,2.653.5,3.794,3.794,0,0,1,1.554,1.48,4.116,4.116,0,0,1,.576,2.129,4.053,4.053,0,0,1-2.618,3.791,4.15,4.15,0,0,1-.853.244,11.5,11.5,0,0,1-1.483.061Zm2.647-7.161h-1.471v6.113h1.506a6.048,6.048,0,0,0,1.371-.12,3.236,3.236,0,0,0,.816-.3,2.8,2.8,0,0,0,.6-.457,3.043,3.043,0,0,0,.871-2.23,2.815,2.815,0,0,0-.894-2.159,2.854,2.854,0,0,0-.756-.512,3.132,3.132,0,0,0-.808-.265A8.267,8.267,0,0,0,395.024,414.063Z" fill="#3d4660"/>
        <path id="Tracciato_161" data-name="Tracciato 161" d="M404.427,413.016H405.6v8.22h-1.177Z" fill="#3d4660"/>
        <path id="Tracciato_162" data-name="Tracciato 162" d="M416.813,413.016H421.2v1.047H417.99v2.3H421.2v1.048H417.99v3.83h-1.177Z" fill="#3d4660"/>
        <path id="Tracciato_163" data-name="Tracciato 163" d="M429.5,412.9a4.42,4.42,0,0,1,3.172,1.206,4,4,0,0,1,1.267,3.024,3.937,3.937,0,0,1-1.278,3.01,4.547,4.547,0,0,1-3.226,1.192,4.286,4.286,0,0,1-3.1-1.192,3.971,3.971,0,0,1-1.238-2.985,4.064,4.064,0,0,1,1.247-3.049A4.349,4.349,0,0,1,429.5,412.9Zm.046,1.118a3.187,3.187,0,0,0-2.318.883,3.009,3.009,0,0,0-.908,2.254,2.951,2.951,0,0,0,.911,2.212,3.38,3.38,0,0,0,4.576-.018,3.01,3.01,0,0,0,.92-2.242,2.94,2.94,0,0,0-.92-2.2A3.122,3.122,0,0,0,429.548,414.016Z" fill="#3d4660"/>
        <path id="Tracciato_164" data-name="Tracciato 164" d="M438.436,421.236v-8.22h2.06a2.975,2.975,0,0,1,1.979.617,2.076,2.076,0,0,1,.733,1.672,2.058,2.058,0,0,1-1.388,2.024,3.637,3.637,0,0,1,.77.706,14.343,14.343,0,0,1,1.059,1.559q.431.7.689,1.053l.435.589h-1.4l-.359-.542a1.136,1.136,0,0,0-.07-.1l-.23-.324-.364-.6-.393-.641a6.583,6.583,0,0,0-.668-.806,2.519,2.519,0,0,0-.548-.431,1.85,1.85,0,0,0-.821-.132h-.307v3.577Zm1.53-7.22h-.353v2.6h.447a3.347,3.347,0,0,0,1.227-.152A1.16,1.16,0,0,0,441.8,416a1.338,1.338,0,0,0,.186-.7,1.257,1.257,0,0,0-.206-.7,1.1,1.1,0,0,0-.579-.444A4.152,4.152,0,0,0,439.966,414.016Z" fill="#3d4660"/>
        <path id="Tracciato_165" data-name="Tracciato 165" d="M455.229,413.016h1.1v8.22h-1.183v-6.4l-2.527,3.177H452.4l-2.557-3.177v6.4h-1.176v-8.22h1.114l2.731,3.376Z" fill="#3d4660"/>
        <path id="Tracciato_166" data-name="Tracciato 166" d="M463.737,412.969h.827l3.686,8.267h-1.2l-1.1-2.436h-3.507l-1.027,2.436h-1.209Zm1.729,4.783-1.326-2.977-1.23,2.977Z" fill="#3d4660"/>
        <path id="Tracciato_167" data-name="Tracciato 167" d="M471.74,413h7.084l-5.251,7.185h5.251v1.047H471.4l5.258-7.185H471.74Z" fill="#3d4660"/>
        <path id="Tracciato_168" data-name="Tracciato 168" d="M482.972,413.016h1.177v8.22h-1.177Z" fill="#3d4660"/>
        <path id="Tracciato_169" data-name="Tracciato 169" d="M493.019,412.9a4.422,4.422,0,0,1,3.173,1.206,4,4,0,0,1,1.267,3.024,3.935,3.935,0,0,1-1.279,3.01,4.543,4.543,0,0,1-3.225,1.192,4.282,4.282,0,0,1-3.1-1.192,3.971,3.971,0,0,1-1.238-2.985,4.064,4.064,0,0,1,1.247-3.049A4.349,4.349,0,0,1,493.019,412.9Zm.047,1.118a3.186,3.186,0,0,0-2.318.883,3.006,3.006,0,0,0-.909,2.254,2.948,2.948,0,0,0,.912,2.212,3.38,3.38,0,0,0,4.576-.018,3.01,3.01,0,0,0,.92-2.242,2.94,2.94,0,0,0-.92-2.2A3.123,3.123,0,0,0,493.066,414.016Z" fill="#3d4660"/>
        <path id="Tracciato_170" data-name="Tracciato 170" d="M508.45,413.016h1.118v8.22h-1.013L503.06,414.9v6.331h-1.106v-8.22h.953l5.543,6.384Z" fill="#3d4660"/>
        <path id="Tracciato_171" data-name="Tracciato 171" d="M514.339,413.016H519v1.047h-3.484v2.507h3.365v1.054h-3.365v2.552h3.6v1.048h-4.772Z" fill="#3d4660"/>
      </g>
      <line id="Linea_47" data-name="Linea 47" x2="200.146" transform="translate(318.795 400.852)" fill="none" stroke="#01c0d2" stroke-miterlimit="10" stroke-width="0.879"/>
      <path id="Tracciato_172" data-name="Tracciato 172" d="M457.935,297.991,422.3,218.065h-5.558l-34.135,79.926h7.546l29.181-69.2,31.121,69.2Z" fill="#3d4660"/>
      <circle id="Ellisse_39" data-name="Ellisse 39" cx="9.54" cy="9.54" r="9.54" transform="translate(410.761 278.912)" fill="#01c0d2"/>
    </g>
  </g>
</svg>
