<svg id="logo_alt" data-name="logo alt" xmlns="http://www.w3.org/2000/svg" width="220" height="48" viewBox="0 0 220 48">
  <rect id="Rettangolo_44" data-name="Rettangolo 44" width="220" height="48" fill="#3d5560" opacity="0"/>
  <g id="Raggruppa_22" data-name="Raggruppa 22" transform="translate(-0.227 -93)">
    <path id="Tracciato_34" data-name="Tracciato 34" d="M103.195,131a11.929,11.929,0,0,1-5.253-1.066,7.444,7.444,0,0,1-3.382-3.286,12.941,12.941,0,0,1-1.332-5.578q-.036-1.59-.036-3.052t.036-3.052a12.369,12.369,0,0,1,1.385-5.542,7.947,7.947,0,0,1,3.454-3.322,12.566,12.566,0,0,1,10.292,0,8.06,8.06,0,0,1,3.473,3.322,11.917,11.917,0,0,1,1.367,5.542q.072,1.59.072,3.052t-.072,3.052a12.464,12.464,0,0,1-1.313,5.578,7.553,7.553,0,0,1-3.4,3.286A12.028,12.028,0,0,1,103.195,131Zm0-3.07a6.281,6.281,0,0,0,4.517-1.661q1.745-1.66,1.889-5.38.072-1.625.072-2.907t-.072-2.871a9,9,0,0,0-.918-4.044,5.339,5.339,0,0,0-2.249-2.275,6.972,6.972,0,0,0-3.239-.722,6.812,6.812,0,0,0-3.166.722,5.339,5.339,0,0,0-2.249,2.275,9.288,9.288,0,0,0-.954,4.044q-.036,1.59-.036,2.871t.036,2.907q.144,3.72,1.907,5.38A6.247,6.247,0,0,0,103.195,127.93Z" fill="#d8dce3"/>
    <path id="Tracciato_35" data-name="Tracciato 35" d="M207.151,131a11.923,11.923,0,0,1-5.253-1.066,7.446,7.446,0,0,1-3.383-3.286,12.927,12.927,0,0,1-1.331-5.578q-.038-1.59-.036-3.052t.036-3.052a12.355,12.355,0,0,1,1.385-5.542,7.947,7.947,0,0,1,3.454-3.322,12.564,12.564,0,0,1,10.291,0,8.05,8.05,0,0,1,3.473,3.322,11.9,11.9,0,0,1,1.368,5.542q.07,1.59.072,3.052t-.072,3.052a12.464,12.464,0,0,1-1.314,5.578,7.556,7.556,0,0,1-3.4,3.286A12.028,12.028,0,0,1,207.151,131Zm0-3.07a6.28,6.28,0,0,0,4.516-1.661q1.744-1.66,1.889-5.38.072-1.625.072-2.907t-.072-2.871a8.982,8.982,0,0,0-.918-4.044,5.339,5.339,0,0,0-2.249-2.275,6.971,6.971,0,0,0-3.238-.722,6.814,6.814,0,0,0-3.167.722,5.345,5.345,0,0,0-2.249,2.275,9.288,9.288,0,0,0-.953,4.044q-.037,1.59-.036,2.871t.036,2.907q.144,3.72,1.907,5.38A6.246,6.246,0,0,0,207.151,127.93Z" fill="#d8dce3"/>
    <path id="Tracciato_36" data-name="Tracciato 36" d="M79.266,131a11.055,11.055,0,0,1-5.487-1.228,8.015,8.015,0,0,1-3.292-3.43,12.227,12.227,0,0,1-1.224-5.129q-.036-1.479-.036-3.177t.036-3.249a12.227,12.227,0,0,1,1.224-5.129,8.021,8.021,0,0,1,3.292-3.43A11.066,11.066,0,0,1,79.266,105a12.6,12.6,0,0,1,4.354.687,9.1,9.1,0,0,1,3.113,1.841,8.106,8.106,0,0,1,1.89,2.582,7.992,7.992,0,0,1,.719,2.942.611.611,0,0,1-.2.543.793.793,0,0,1-.557.217h-1.98a.883.883,0,0,1-.558-.181,1.107,1.107,0,0,1-.341-.65,5.724,5.724,0,0,0-2.285-3.864,7.773,7.773,0,0,0-4.193-1.047,6.277,6.277,0,0,0-4.57,1.643q-1.692,1.644-1.835,5.253-.108,2.962,0,6.068.144,3.611,1.835,5.253a6.277,6.277,0,0,0,4.57,1.643,7.773,7.773,0,0,0,4.193-1.047,5.724,5.724,0,0,0,2.285-3.864,1.113,1.113,0,0,1,.341-.65.889.889,0,0,1,.558-.181h1.98a.793.793,0,0,1,.557.217.611.611,0,0,1,.2.543,7.992,7.992,0,0,1-.719,2.942,8.084,8.084,0,0,1-1.89,2.582,9.067,9.067,0,0,1-3.113,1.841A12.605,12.605,0,0,1,79.266,131Z" fill="#d8dce3"/>
    <path id="Tracciato_37" data-name="Tracciato 37" d="M127.664,131a11.216,11.216,0,0,1-5.379-1.192,8.139,8.139,0,0,1-3.384-3.358,11.829,11.829,0,0,1-1.313-5.092q-.036-1.588-.036-3.376t.036-3.412a11.577,11.577,0,0,1,1.313-5.056,8.175,8.175,0,0,1,3.4-3.322A11.242,11.242,0,0,1,127.664,105a12.289,12.289,0,0,1,4.426.723,9.666,9.666,0,0,1,3.076,1.823,7.936,7.936,0,0,1,1.8,2.293,5.306,5.306,0,0,1,.63,2.1.582.582,0,0,1-.18.523.814.814,0,0,1-.575.2h-2.124a.772.772,0,0,1-.522-.145,1.347,1.347,0,0,1-.3-.505,6.067,6.067,0,0,0-1.061-1.842,5.657,5.657,0,0,0-1.98-1.5,7.36,7.36,0,0,0-3.184-.6,6.65,6.65,0,0,0-4.588,1.552q-1.746,1.554-1.89,5.128-.108,3.214,0,6.427.144,3.612,1.908,5.182a6.661,6.661,0,0,0,4.606,1.571,7.874,7.874,0,0,0,3.4-.7,5.293,5.293,0,0,0,2.357-2.185,7.361,7.361,0,0,0,.864-3.755v-1.517h-5.4a.8.8,0,0,1-.593-.234.851.851,0,0,1-.234-.632v-1.156a.854.854,0,0,1,.234-.632.8.8,0,0,1,.593-.235h8.133a.791.791,0,0,1,.611.235.9.9,0,0,1,.216.632v3.466a10.6,10.6,0,0,1-1.205,5.165,8.3,8.3,0,0,1-3.509,3.412A11.689,11.689,0,0,1,127.664,131Z" fill="#d8dce3"/>
    <path id="Tracciato_38" data-name="Tracciato 38" d="M143.856,130.639a.788.788,0,0,1-.611-.235.847.847,0,0,1-.216-.6v-23.58a.9.9,0,0,1,.216-.632.791.791,0,0,1,.611-.235h1.656a.931.931,0,0,1,.648.2.945.945,0,0,1,.252.307l11.946,18.416V106.228a.9.9,0,0,1,.216-.632.791.791,0,0,1,.611-.235h1.728a.808.808,0,0,1,.863.867v23.544a.87.87,0,0,1-.234.614.772.772,0,0,1-.593.253h-1.728a.763.763,0,0,1-.593-.217c-.132-.145-.222-.24-.27-.289L146.447,111.9v17.91a.806.806,0,0,1-.234.6.846.846,0,0,1-.63.235Z" fill="#d8dce3"/>
    <path id="Tracciato_39" data-name="Tracciato 39" d="M168.829,130.639a.787.787,0,0,1-.612-.235.847.847,0,0,1-.216-.6V106.192a.847.847,0,0,1,.216-.6.79.79,0,0,1,.612-.235h1.907a.8.8,0,0,1,.828.831v23.616a.813.813,0,0,1-.234.6.8.8,0,0,1-.594.235Z" fill="#d8dce3"/>
    <path id="Tracciato_40" data-name="Tracciato 40" d="M184.158,130.639a.8.8,0,0,1-.594-.235.809.809,0,0,1-.234-.6V108.575h-6.909a.8.8,0,0,1-.594-.235.81.81,0,0,1-.234-.6v-1.516a.862.862,0,0,1,.234-.632.806.806,0,0,1,.594-.235h17.344a.808.808,0,0,1,.864.867v1.516a.806.806,0,0,1-.234.6.848.848,0,0,1-.63.235h-6.872v21.233a.806.806,0,0,1-.235.6.844.844,0,0,1-.629.235Z" fill="#d8dce3"/>
  </g>
  <path id="Tracciato_41" data-name="Tracciato 41" d="M17.433,138a18.178,18.178,0,0,1-8.857-1.937,12.771,12.771,0,0,1-5.316-5.409,18.916,18.916,0,0,1-1.975-8.087q-.057-2.333-.058-5.01t.058-5.124a18.916,18.916,0,0,1,1.975-8.087,12.782,12.782,0,0,1,5.316-5.409A18.189,18.189,0,0,1,17.433,97c2.672,0,19.536.361,21.55,1.083a14.741,14.741,0,0,1,5.024,2.9,12.792,12.792,0,0,1,3.051,4.071,12.374,12.374,0,0,1,1.161,4.64.949.949,0,0,1-.319.855,1.294,1.294,0,0,1-.9.342H43.805a1.445,1.445,0,0,1-.9-.285,1.736,1.736,0,0,1-.552-1.024q-.989-4.443-3.688-6.094c-1.8-1.1-18.579-1.651-21.289-1.651A10.273,10.273,0,0,0,10,104.432q-2.732,2.592-2.962,8.284-.175,4.671,0,9.568.231,5.694,2.962,8.284a10.273,10.273,0,0,0,7.377,2.591c2.71,0,19.488-.55,21.289-1.651s3.029-3.132,3.688-6.094a1.743,1.743,0,0,1,.552-1.024,1.457,1.457,0,0,1,.9-.285H47a1.294,1.294,0,0,1,.9.342.949.949,0,0,1,.319.855,12.374,12.374,0,0,1-1.161,4.64,12.77,12.77,0,0,1-3.051,4.071,14.709,14.709,0,0,1-5.024,2.9C36.969,137.639,20.1,138,17.433,138Z" transform="translate(-0.227 -93)" fill="#3fa9f5"/>
</svg>
