<svg id="open_alt" data-name="open alt" xmlns="http://www.w3.org/2000/svg" width="48" height="48" viewBox="0 0 48 48">
  <path id="Path_7" data-name="Path 7" d="M18,214H30l-6.045,6Z" transform="translate(0 -192)" fill="#01C0D2"/>
  <rect id="Rettangolo_38" data-name="Rettangolo 38" width="48" height="48" fill="#3d5560" opacity="0"/>
</svg>
