
<svg width="11px" height="26px" viewBox="0 0 11 26" version="1.1" xmlns="http://www.w3.org/2000/svg" xmlns:xlink="http://www.w3.org/1999/xlink">
    <g id="Page-1" stroke="none" stroke-width="1" fill="none" fill-rule="evenodd" fill-opacity="0.800000012">
        <g id="IMDb-concept" transform="translate(-1279.000000, -251.000000)" fill="#FFFFFF">
            <g id="Now-playing" transform="translate(0.000000, 79.000000)">
                <g id="Next" transform="translate(1265.000000, 1.000000)">
                    <polygon id="Shape" points="14 171 14 197 25 184"></polygon>
                </g>
            </g>
        </g>
    </g>
</svg>