{
  "page": 1,
  "total_results": 1828,
  "total_pages": 92,
  "results": [
    {
      "vote_count": 3814,
      "id": 156022,
      "video": false,
      "vote_average": 7.1,
      "title": "The Equalizer (El protector)",
      "popularity": 46.19,
      "poster_path": "\/6KTHOnHzYPZmVsjv0GmzrbKWTMy.jpg",
      "original_language": "en",
      "original_title": "The Equalizer",
      "genre_ids": [
        53,
        28,
        80
      ],
      "backdrop_path": "\/ms9oACSGJRjofNPA6HVtcgE5DiU.jpg",
      "adult": false,
      "overview": "Robert McCall, un antiguo agente de la CIA que lleva ahora una vida tranquila, abandona su retiro para ayudar a Teri, una joven prostituta que está siendo explotada por la mafia rusa. A pesar de que aseguró no volver a ser violento, contemplar tanta crueldad despertará en Robert un implacable y renovado deseo de justicia... Versión cinematográfica de la serie de televisión de los 80, 'El justiciero'.",
      "release_date": "2014-09-24"
    },
    {
      "vote_count": 7839,
      "id": 245891,
      "video": false,
      "vote_average": 7,
      "title": "John Wick",
      "popularity": 43.285,
      "poster_path": "\/sl3QSDb7rB6dS4wzJoTJbhCVvVF.jpg",
      "original_language": "en",
      "original_title": "John Wick",
      "genre_ids": [
        28,
        53
      ],
      "backdrop_path": "\/umC04Cozevu8nn3JTDJ1pc7PVTn.jpg",
      "adult": false,
      "overview": "En Nueva York, John Wick, un asesino a sueldo retirado, vuelve otra vez a la acción para vengarse de los gángsters que le quitaron todo.",
      "release_date": "2014-10-22"
    },
    {
      "vote_count": 8072,
      "id": 210577,
      "video": false,
      "vote_average": 7.9,
      "title": "Perdida",
      "popularity": 34.717,
      "poster_path": "\/Akq3SczzAdsQ9ec2IjZi6JLGw0H.jpg",
      "original_language": "en",
      "original_title": "Gone Girl",
      "genre_ids": [
        9648,
        53,
        18
      ],
      "backdrop_path": "\/8ZNGBfGoN3uI5Akj5vEUDMxvmGO.jpg",
      "adult": false,
      "overview": "El día de su quinto aniversario de boda, Nick Dunne informa que su esposa Amy ha desaparecido misteriosamente. Pero pronto la presión policial y mediática hace que el retrato de felicidad doméstica que ofrece Nick empiece a tambalearse. Además, su extraña conducta lo convierte en sospechoso, y todo el mundo comienza a preguntase si Nick mató a su esposa... Adaptación del best-seller \"Perdida\", de Gillian Flynn.",
      "release_date": "2014-10-01"
    },
    {
      "vote_count": 6164,
      "id": 244786,
      "video": false,
      "vote_average": 8.4,
      "title": "Whiplash",
      "popularity": 31.914,
      "poster_path": "\/6uSPcdGNA2A6vJmCagXkvnutegs.jpg",
      "original_language": "en",
      "original_title": "Whiplash",
      "genre_ids": [
        18
      ],
      "backdrop_path": "\/6bbZ6XyvgfjhQwbplnUh1LSj1ky.jpg",
      "adult": false,
      "overview": "El objetivo de Andrew Neiman, un joven y ambicioso baterista de jazz, es triunfar en el elitista Conservatorio de Música de la Costa Este en el que estudia. Marcado por el fracaso de la carrera literaria de su padre, Andrew alberga sueños de grandeza. Terence Fletcher, un profesor conocido tanto por su talento como por sus rigurosos métodos de enseñanza, dirige el mejor conjunto de jazz del Conservatorio. Cuando Fletcher elige a Andrew y para formar parte del conjunto musical que dirige, cambia para siempre la vida del joven. La pasión de Andrew por alcanzar la perfección se convierte en obsesión, al tiempo que su despiadado profesor lo lleva al límite de su capacidad y de su salud mental.",
      "release_date": "2014-10-10"
    },
    {
      "vote_count": 5375,
      "id": 228150,
      "video": false,
      "vote_average": 7.4,
      "title": "Corazones de acero",
      "popularity": 27.916,
      "poster_path": "\/6YOgeD5aw3OuB5j2iJRNrULQ11W.jpg",
      "original_language": "en",
      "original_title": "Fury",
      "genre_ids": [
        10752,
        18,
        28
      ],
      "backdrop_path": "\/pKawqrtCBMmxarft7o1LbEynys7.jpg",
      "adult": false,
      "overview": "Abril de 1945. Al mando del veterano sargento Wardaddy, una brigada de cinco soldados americanos a bordo de un tanque -el Fury- ha de luchar contra un ejército nazi al borde de la desesperación, pues los alemanes saben que su derrota estaba ya cantada por aquel entonces.",
      "release_date": "2014-10-15"
    },
    {
      "vote_count": 3130,
      "id": 49017,
      "video": false,
      "vote_average": 6.2,
      "title": "Drácula, la leyenda jamás contada",
      "popularity": 26.824,
      "poster_path": "\/45CH2aFnWb1yaE4MrpMIxXSID10.jpg",
      "original_language": "en",
      "original_title": "Dracula Untold",
      "genre_ids": [
        27,
        28,
        18,
        14,
        10752
      ],
      "backdrop_path": "\/6UPlIYKxZqUR6Xbpgu1JKG0J7UC.jpg",
      "adult": false,
      "overview": "Los orígenes del mito se revelan en esta película ambientada en los años de reinado de Vlad Tepes, príncipe de Rumania que inspiró la leyenda por sus peculiares métodos para provocar el miedo entre su población y sus enemigos. Una mezcla de mitología e historia para recoger cómo se transformó el sanguinario emperador en el primer vampiro de la historia. Uno de los más terribles y sádicos personajes de Europa que inspiró la clásica obra literaria de Bram Stoker mezclando el terror sobrenatural, las leyendas y pinceladas de amor, para cautivar por completo.",
      "release_date": "2014-10-01"
    },
    {
      "vote_count": 523,
      "id": 244506,
      "video": false,
      "vote_average": 6.8,
      "title": "Camp X-Ray",
      "popularity": 21.717,
      "poster_path": "\/oGcmIqOAbV8npgY57u7tqzwPgc.jpg",
      "original_language": "en",
      "original_title": "Camp X-Ray",
      "genre_ids": [
        18
      ],
      "backdrop_path": "\/2R07sv0C7HS1bHdeO5fDfIQplOM.jpg",
      "adult": false,
      "overview": "Drama político donde Kristen Stewart interpretará a una joven que huye de una pequeña localidad para unirse al ejército. Su intención es ir destinada a Iraq, pero finalmente es enviada a Guantánamo donde entablará amistad con un prisionero que lleva ocho años encarcelado.",
      "release_date": "2014-10-17"
    },
    {
      "vote_count": 834,
      "id": 262543,
      "video": false,
      "vote_average": 5.6,
      "title": "Autómata",
      "popularity": 20.178,
      "poster_path": "\/Hq0Z02mcy88AcePmuJqtLLsv7.jpg",
      "original_language": "en",
      "original_title": "Autómata",
      "genre_ids": [
        53,
        878
      ],
      "backdrop_path": "\/281QVUuSYKBgtdxmr5iAM7YDUZw.jpg",
      "adult": false,
      "overview": "En un futuro no lejano, en el que el planeta Tierra sufre una creciente desertización, Jacq Vaucan, un agente de seguros de una compañía de robótica, investiga un caso en apariencia rutinario cuando descubre algo que podría tener consecuencias decisivas para el futuro de la humanidad. Banderas produce y protagoniza este thriller futurista, que especula sobre lo que ocurriría si la inteligencia artificial superase a la humana.",
      "release_date": "2014-10-09"
    },
    {
      "vote_count": 347,
      "id": 277547,
      "video": false,
      "vote_average": 5.8,
      "title": "Déjate querer",
      "popularity": 17.942,
      "poster_path": "\/3ZFei27ALsBoDbMcAnkfhSaZMue.jpg",
      "original_language": "en",
      "original_title": "Playing It Cool",
      "genre_ids": [
        35,
        10749
      ],
      "backdrop_path": "\/dDxwX9quYcQRaLb8Q5g3owrok9e.jpg",
      "adult": false,
      "overview": "Un guionista está intentando escribir una película romántica, pero el primer obstáculo con el que se topa es que él no cree en el amor. Sin embargo, todo cambia cuando conoce a una mujer de la que rápidamente se enamora. Sólo hay un problema: ella está comprometida.",
      "release_date": "2014-09-26"
    },
    {
      "vote_count": 643,
      "id": 72784,
      "video": false,
      "vote_average": 6.4,
      "title": "The Loft",
      "popularity": 16.626,
      "poster_path": "\/lPv8TLidO57BsD1drVLUYk67oDP.jpg",
      "original_language": "en",
      "original_title": "The Loft",
      "genre_ids": [
        53
      ],
      "backdrop_path": "\/j7qWyikT1eKNezNKxqPkkC8lKz8.jpg",
      "adult": false,
      "overview": "Cinco hombres comparten en secreto un apartamento donde poder escaparse con sus amantes, donde relajarse o simplemente evadirse de la rutina. Hasta que un día aparece el cuerpo de una mujer asesinada en el apartamento y empieza un juego de sospechas entre ellos para intentar descubrir quién es el culpable y ver cómo se las arreglan para que todo el asunto no salga a la luz... Remake de la propia película de Erik Van Looy realizada en 2008.",
      "release_date": "2014-10-14"
    },
    {
      "vote_count": 1425,
      "id": 169917,
      "video": false,
      "vote_average": 6.3,
      "title": "Caminando entre las tumbas",
      "popularity": 15.759,
      "poster_path": "\/jVEEitXmLoB12qVlPh97hYmTyh4.jpg",
      "original_language": "en",
      "original_title": "A Walk Among the Tombstones",
      "genre_ids": [
        80,
        18,
        9648,
        53
      ],
      "backdrop_path": "\/e56QsaJy1weAUukiK2ZmIGVUALF.jpg",
      "adult": false,
      "overview": "Matt Scudder, un expolicía de Nueva York, trabaja como detective privado a pesar de que no tiene licencia. Cuando accede a regañadientes a ayudar a un traficante de heroína a cazar a los hombres que secuestraron y asesinaron brutalmente a su esposa, descubre que no es la primera vez que esos hombres han cometido este tipo de crímenes. Entonces decide recorrer las calles de Nueva York para detener a los asesinos antes de que vuelvan a matar.",
      "release_date": "2014-09-18"
    },
    {
      "vote_count": 1887,
      "id": 205587,
      "video": false,
      "vote_average": 7.2,
      "title": "El juez",
      "popularity": 15.147,
      "poster_path": "\/3o3Q2saOTyl1RtWtWugyg7b4FAk.jpg",
      "original_language": "en",
      "original_title": "The Judge",
      "genre_ids": [
        18
      ],
      "backdrop_path": "\/wIOR6vXb3SbZw7V7UnbbPTO9wkp.jpg",
      "adult": false,
      "overview": "Un abogado de la gran ciudad regresa a su hogar tras la muerte de su madre. En ese momento se entera de que su padre, que es juez y del que lleva un tiempo distanciado, es sospechoso de haber cometido un crimen. El hombre se propone descubrir la verdad sobre el asunto, reencontrándose en sus pesquisas con una familia de la que se alejó hace ya tiempo.",
      "release_date": "2014-10-08"
    },
    {
      "vote_count": 527,
      "id": 252178,
      "video": false,
      "vote_average": 6.8,
      "title": "'71",
      "popularity": 14.92,
      "poster_path": "\/n7C6PnTEAIwcdtE7IBj05JT4M0j.jpg",
      "original_language": "en",
      "original_title": "'71",
      "genre_ids": [
        53,
        28,
        18,
        10752
      ],
      "backdrop_path": "\/wlD4NgIp2mVyA3LeNqE39Lwx01J.jpg",
      "adult": false,
      "overview": "En 1971, un joven y desorientado soldado británico llamado Yann Demange, se extravía tras un motín en las mortales calles de Belfast.",
      "release_date": "2014-10-10"
    },
    {
      "vote_count": 379,
      "id": 255343,
      "video": false,
      "vote_average": 6.3,
      "title": "Escobar: Paraíso perdido",
      "popularity": 14.79,
      "poster_path": "\/uEuG0cxHeEPY6SirTu3SzRjkp9v.jpg",
      "original_language": "en",
      "original_title": "Escobar: Paradise Lost",
      "genre_ids": [
        53,
        10749
      ],
      "backdrop_path": "\/gbwOFHXSLi1DD3D7eI2vlZWIAyq.jpg",
      "adult": false,
      "overview": "Nick, un joven surfista, cree que todos sus sueños se han hecho realidad cuando va a visitar a su hermano en Colombia. Con el trasfondo idílico de lagunas azules y blancas playas, Nick se enamora perdidamente de una bella joven llamada María. Todo parece perfecto hasta que Nick conoce al tío de la joven, un tal Pablo Escobar.",
      "release_date": "2014-10-11"
    },
    {
      "vote_count": 2380,
      "id": 250546,
      "video": false,
      "vote_average": 5.5,
      "title": "Annabelle",
      "popularity": 14.602,
      "poster_path": "\/mQTRl8Ye01eqa3IFYAZvLSR5e2F.jpg",
      "original_language": "en",
      "original_title": "Annabelle",
      "genre_ids": [
        27
      ],
      "backdrop_path": "\/2gKX53lskaCYk9ycXmaDJKqWiy.jpg",
      "adult": false,
      "overview": "John Form encuentra el regalo perfecto para su mujer embarazada, Mia: una preciosa e inusual muñeca vintage que lleva un vestido de novia blanco inmaculado. Sin embargo, la alegría de Mia al recibir a Annabelle no dura mucho. Durante una espantosa noche la pareja ve como miembros de una secta satánica invaden su hogar y los atacan brutalmente. No sólo dejan sangre derramada y terror tras su visita…los miembros de la secta conjuran a un ente de tal maldad que nada de lo que han hecho se compara al siniestro camino a la maldición que ahora es… Annabelle.",
      "release_date": "2014-10-02"
    },
    {
      "vote_count": 2573,
      "id": 200727,
      "video": false,
      "vote_average": 7.8,
      "title": "Los imprevistos del amor",
      "popularity": 14.363,
      "poster_path": "\/tKvD9cr43nutURJkZHvXiVDEGXw.jpg",
      "original_language": "en",
      "original_title": "Love, Rosie",
      "genre_ids": [
        35,
        10749
      ],
      "backdrop_path": "\/hLFp6unynz4cBa6BJwrH0s27vn9.jpg",
      "adult": false,
      "overview": "Rosie y Alex son los mejores amigos del mundo y viven en Dublín. Desde su infancia, habían confiado el uno en el otro y se habían contado sus secretos y confidencias. En su época del instituto, los dos hicieron planes para ir juntos a la universidad, pero Rosie, en una noche de pasión junto a uno de los chicos más populares del instituto, se queda embarazada. Y justo cuando se lo va a contar a Alex, éste le dice que le han admitido en Harvard en la facultad de medicina.",
      "release_date": "2014-10-16"
    },
    {
      "vote_count": 539,
      "id": 218043,
      "video": false,
      "vote_average": 3.9,
      "title": "Desaparecidos sin rastro",
      "popularity": 14.321,
      "poster_path": "\/pIFRxEliGN8sh4EmFsMEG5rFDm.jpg",
      "original_language": "en",
      "original_title": "Left Behind",
      "genre_ids": [
        53,
        28,
        878
      ],
      "backdrop_path": "\/oUZn1QXB7FTqMBnM7GdqK5PFNzn.jpg",
      "adult": false,
      "overview": "En un abrir y cerrar de ojos, un rapto bíblico azota el mundo. Millones de personas desaparecen sin dejar rasto. Todo lo que queda es su ropa y sus pertenencias, y en un instante, el terror y el caos invade a la humanidad.",
      "release_date": "2014-10-03"
    },
    {
      "vote_count": 486,
      "id": 246403,
      "video": false,
      "vote_average": 5.2,
      "title": "Tusk",
      "popularity": 14.283,
      "poster_path": "\/iQa7FYR6Aj9AdjNfW1rB4fguCkw.jpg",
      "original_language": "en",
      "original_title": "Tusk",
      "genre_ids": [
        35,
        27,
        18,
        53
      ],
      "backdrop_path": "\/8EQg8fsxEElycBPSb0JszATwm1l.jpg",
      "adult": false,
      "overview": "“¡No quiero morir en Canadá!”, suplica Wallace Bryton, un popular podcaster que cruza la frontera de Canadá para entrevistar a Howard Howe, que una vez fue salvado por una morsa. Misántropo extremo, Howe secuestrará a Wallace para sacarle su lado más “animal”.",
      "release_date": "2014-09-19"
    },
    {
      "vote_count": 185,
      "id": 289720,
      "video": false,
      "vote_average": 4.6,
      "title": "Desterrado",
      "popularity": 13.969,
      "poster_path": "\/xtr0U4s2SdB6TG8SsdFaPDKUoIW.jpg",
      "original_language": "en",
      "original_title": "Outcast",
      "genre_ids": [
        28
      ],
      "backdrop_path": "\/jmZ8cnELpLGhEEgoRp5QR5VoGyp.jpg",
      "adult": false,
      "overview": "Aventura romántica épica que traslada la historia a China en pleno siglo XII, donde un legendario guerrero ha decidido purificar su alma y enmendar sus pecados. En el camino en busca de la redención, se cruzará con una princesa en apuros que le ofrecerá la oportunidad de liberarse de su carga a cambio de su ayuda. El misterioso caballero emprenderá una misión suicida para plantarle cara al terrorífico y sanguinario hijo del emperador, causante de toda la muerte y el miedo que reina en la población. Brujería, amor y mucha acción, son los ingredientes de esta historia fantástica protagonizada por Hayden Christensen (Star Wars: Episodio VI - El retorno del Jedi, Aprendiz de caballero) y Nicolas Cage (Kick-Ass, La búsqueda: El diario secreto).",
      "release_date": "2014-09-26"
    },
    {
      "vote_count": 1006,
      "id": 228326,
      "video": false,
      "vote_average": 7.4,
      "title": "El libro de la vida",
      "popularity": 13.415,
      "poster_path": "\/cLpSuvYBUQpfLXG39ThkSpPjURk.jpg",
      "original_language": "en",
      "original_title": "The Book of Life",
      "genre_ids": [
        10749,
        16,
        12,
        35,
        10751,
        14
      ],
      "backdrop_path": "\/lVshZpxU5EB8zXJrnXxblaDps6m.jpg",
      "adult": false,
      "overview": "La película cuenta el viaje de Manolo, un joven torero que se debate entre cumplir con las expectativas de su familia o seguir su corazón y dedicarse a su verdadera pasión: la música. Antes de escoger el camino que seguirá, emprende una aventura recorriendo tres mundos fantásticos, donde tendrá que superar sus peores miedos. Producida por Guillermo del Toro.",
      "release_date": "2014-10-01"
    }
  ]
}