{
	"info": {
		"_postman_id": "20f88735-25e9-4d58-a012-2833d1310b53",
		"name": "failures",
		"schema": "https://schema.getpostman.com/json/collection/v2.1.0/collection.json"
	},
	"item": [
		{
			"name": "GetPostByIdUnauthorized#23",
			"event": [
				{
					"listen": "test",
					"script": {
						"id": "4c20c145-1c2a-4f99-b29d-c76b57267f13",
						"exec": [
							"pm.test(\"Status code is 401\", function () {",
							"    pm.response.to.have.status(401);",
							"});",
							"",
							"",
							"let jsonData = pm.response.json();",
							"console.log(jsonData.error)",
							"pm.test(\"Message\", function () {",
							"  ",
							"    pm.expect(jsonData.message).to.eql(\"You are not authorized.\");",
							"});",
							""
						],
						"type": "text/javascript"
					}
				}
			],
			"request": {
				"method": "GET",
				"header": [],
				"url": {
					"raw": "{{BaseUrl}}/api/posts/6",
					"host": [
						"{{BaseUrl}}"
					],
					"path": [
						"api",
						"posts",
						"6"
					]
				}
			},
			"response": []
		},
		{
			"name": "GetAllLikesUnauthorized#22",
			"event": [
				{
					"listen": "test",
					"script": {
						"id": "e08c0a93-2e44-4fa8-8da5-25e5822754c0",
						"exec": [
							"pm.test(\"Status code is 401\", function () {",
							"    pm.response.to.have.status(401);",
							"});",
							"",
							"",
							"let jsonData = pm.response.json();",
							"console.log(jsonData.error)",
							"pm.test(\"Message\", function () {",
							"  ",
							"    pm.expect(jsonData.message).to.eql(\"You are not authorized.\");",
							"});",
							""
						],
						"type": "text/javascript"
					}
				}
			],
			"request": {
				"method": "GET",
				"header": [],
				"url": {
					"raw": "{{BaseUrl}}/api/likes",
					"host": [
						"{{BaseUrl}}"
					],
					"path": [
						"api",
						"likes"
					]
				}
			},
			"response": []
		},
		{
			"name": "GetLikeByIdUnautorized#21",
			"event": [
				{
					"listen": "test",
					"script": {
						"id": "02d31012-e929-4766-8aa8-f18cf342b475",
						"exec": [
							"pm.test(\"Status code is 401\", function () {",
							"    pm.response.to.have.status(401);",
							"});",
							"",
							"",
							"let jsonData = pm.response.json();",
							"console.log(jsonData.error)",
							"pm.test(\"Message\", function () {",
							"  ",
							"    pm.expect(jsonData.message).to.eql(\"You are not authorized.\");",
							"});",
							""
						],
						"type": "text/javascript"
					}
				}
			],
			"request": {
				"method": "GET",
				"header": [],
				"url": {
					"raw": "{{BaseUrl}}/api/likes/9",
					"host": [
						"{{BaseUrl}}"
					],
					"path": [
						"api",
						"likes",
						"9"
					]
				}
			},
			"response": []
		},
		{
			"name": "GetAllPostsUnautorized#20",
			"event": [
				{
					"listen": "test",
					"script": {
						"id": "8c299108-d695-479f-8e9d-8dd6267924ab",
						"exec": [
							"pm.test(\"Status code is 401\", function () {",
							"    pm.response.to.have.status(401);",
							"});",
							"",
							"",
							"let jsonData = pm.response.json();",
							"console.log(jsonData.error)",
							"pm.test(\"Message\", function () {",
							"  ",
							"    pm.expect(jsonData.message).to.eql(\"You are not authorized.\");",
							"});",
							""
						],
						"type": "text/javascript"
					}
				}
			],
			"request": {
				"method": "GET",
				"header": [],
				"url": {
					"raw": "{{BaseUrl}}/api/posts",
					"host": [
						"{{BaseUrl}}"
					],
					"path": [
						"api",
						"posts"
					]
				}
			},
			"response": []
		},
		{
			"name": "GetPostsByUserUnautorized#19",
			"event": [
				{
					"listen": "test",
					"script": {
						"id": "8c299108-d695-479f-8e9d-8dd6267924ab",
						"exec": [
							"pm.test(\"Status code is 401\", function () {",
							"    pm.response.to.have.status(401);",
							"});",
							"",
							"",
							"let jsonData = pm.response.json();",
							"console.log(jsonData.error)",
							"pm.test(\"Message\", function () {",
							"  ",
							"    pm.expect(jsonData.message).to.eql(\"You are not authorized.\");",
							"});",
							""
						],
						"type": "text/javascript"
					}
				}
			],
			"request": {
				"method": "GET",
				"header": [],
				"url": {
					"raw": "{{BaseUrl}}/api/users/testuser1",
					"host": [
						"{{BaseUrl}}"
					],
					"path": [
						"api",
						"users",
						"testuser1"
					]
				}
			},
			"response": []
		},
		{
			"name": "GetUserByIDUnautorized#18",
			"event": [
				{
					"listen": "test",
					"script": {
						"id": "394ab0f1-c0f3-499d-88fb-0b368bcb2d96",
						"exec": [
							"pm.test(\"Status code is 401\", function () {",
							"    pm.response.to.have.status(401);",
							"});",
							"",
							"",
							"let jsonData = pm.response.json();",
							"console.log(jsonData.error)",
							"",
							"pm.test(\"Message\", function () {",
							"      pm.expect(jsonData.message).to.eql(\"You are not authorized.\");",
							"    ",
							"});",
							"",
							""
						],
						"type": "text/javascript"
					}
				}
			],
			"request": {
				"method": "GET",
				"header": [],
				"url": {
					"raw": "{{BaseUrl}}/api/users/user/2",
					"host": [
						"{{BaseUrl}}"
					],
					"path": [
						"api",
						"users",
						"user",
						"2"
					]
				}
			},
			"response": []
		},
		{
			"name": "GetAllUsersEmailsUnautorized#17",
			"event": [
				{
					"listen": "test",
					"script": {
						"id": "24b17284-8eca-4690-8da7-5b849c26306f",
						"exec": [
							"pm.test(\"Status code is 401\", function () {",
							"    pm.response.to.have.status(401);",
							"});",
							"",
							"",
							"let jsonData = pm.response.json();",
							"console.log(jsonData.error)",
							"",
							"pm.test(\"Message\", function () {",
							"      pm.expect(jsonData.message).to.eql(\"You are not authorized.\");",
							"    ",
							"});",
							"",
							""
						],
						"type": "text/javascript"
					}
				}
			],
			"request": {
				"method": "GET",
				"header": [],
				"url": {
					"raw": "{{BaseUrl}}/api/users/user/emails",
					"host": [
						"{{BaseUrl}}"
					],
					"path": [
						"api",
						"users",
						"user",
						"emails"
					]
				}
			},
			"response": []
		},
		{
			"name": "GetUserByUsernameUnautorized#14",
			"event": [
				{
					"listen": "test",
					"script": {
						"id": "24b17284-8eca-4690-8da7-5b849c26306f",
						"exec": [
							"pm.test(\"Status code is 401\", function () {",
							"    pm.response.to.have.status(401);",
							"});",
							"",
							"",
							"let jsonData = pm.response.json();",
							"console.log(jsonData.error)",
							"",
							"pm.test(\"Message\", function () {",
							"      pm.expect(jsonData.message).to.eql(\"You are not authorized.\");",
							"    ",
							"});",
							"",
							""
						],
						"type": "text/javascript"
					}
				}
			],
			"request": {
				"method": "GET",
				"header": [],
				"url": {
					"raw": "{{BaseUrl}}/api/users/testuser1",
					"host": [
						"{{BaseUrl}}"
					],
					"path": [
						"api",
						"users",
						"testuser1"
					]
				}
			},
			"response": []
		}
	],
	"protocolProfileBehavior": {}
}