05-02-2020 11:17:06.0575|INFO |c.example.ridepal.RidepalApplication|Starting RidepalApplication on LenovoB5400 with PID 556 (C:\Users\User\Documents\TELERIK\repository\team-7---ridepal-final-project\ridepal\build\classes\java\main started by User in C:\Users\User\Documents\TELERIK\repository\team-7---ridepal-final-project\ridepal)
05-02-2020 11:17:06.0583|INFO |c.example.ridepal.RidepalApplication|No active profile set, falling back to default profiles: default
05-02-2020 11:17:19.0469|INFO |c.example.ridepal.RidepalApplication|Started RidepalApplication in 13.573 seconds (JVM running for 16.004)
05-02-2020 11:44:19.0614|INFO |c.e.r.services.PlaylistServiceImpl|createPlaylist is called. creatorName: mitt@abv.bg, playlistName: test
05-02-2020 11:44:20.0218|INFO |c.e.r.services.PlaylistServiceImpl|createPlaylist is called. creatorName: mitt@abv.bg, playlistName: test
05-02-2020 11:44:20.0788|INFO |c.e.r.services.PlaylistServiceImpl|createPlaylist is called. creatorName: mitt@abv.bg, playlistName: test
05-02-2020 11:46:44.0167|INFO |c.e.r.services.PlaylistServiceImpl|createPlaylist is called. creatorName: mitt@abv.bg, playlistName: test
05-02-2020 11:47:54.0740|INFO |c.example.ridepal.RidepalApplication|Starting RidepalApplication on LenovoB5400 with PID 556 (C:\Users\User\Documents\TELERIK\repository\team-7---ridepal-final-project\ridepal\build\classes\java\main started by User in C:\Users\User\Documents\TELERIK\repository\team-7---ridepal-final-project\ridepal)
05-02-2020 11:47:54.0741|INFO |c.example.ridepal.RidepalApplication|No active profile set, falling back to default profiles: default
05-02-2020 11:48:02.0906|INFO |c.example.ridepal.RidepalApplication|Started RidepalApplication in 8.362 seconds (JVM running for 1859.432)
05-02-2020 11:51:42.0705|INFO |c.e.r.services.PlaylistServiceImpl|createPlaylist is called. creatorName: mitt@abv.bg, playlistName: test
05-02-2020 12:10:32.0574|INFO |c.example.ridepal.RidepalApplication|Starting RidepalApplication on LenovoB5400 with PID 2220 (C:\Users\User\Documents\TELERIK\repository\team-7---ridepal-final-project\ridepal\build\classes\java\main started by User in C:\Users\User\Documents\TELERIK\repository\team-7---ridepal-final-project\ridepal)
05-02-2020 12:10:32.0588|INFO |c.example.ridepal.RidepalApplication|No active profile set, falling back to default profiles: default
05-02-2020 12:10:54.0513|INFO |c.example.ridepal.RidepalApplication|Started RidepalApplication in 23.605 seconds (JVM running for 28.156)
05-02-2020 12:12:35.0000|INFO |c.example.ridepal.RidepalApplication|Starting RidepalApplication on LenovoB5400 with PID 9684 (C:\Users\User\Documents\TELERIK\repository\team-7---ridepal-final-project\ridepal\build\classes\java\main started by User in C:\Users\User\Documents\TELERIK\repository\team-7---ridepal-final-project\ridepal)
05-02-2020 12:12:35.0000|INFO |c.example.ridepal.RidepalApplication|No active profile set, falling back to default profiles: default
05-02-2020 12:12:46.0799|INFO |c.example.ridepal.RidepalApplication|Started RidepalApplication in 12.382 seconds (JVM running for 14.941)
05-02-2020 12:14:53.0066|INFO |c.e.r.services.PlaylistServiceImpl|createPlaylist is called. creatorName: mitt@abv.bg, playlistName: test
05-02-2020 12:15:28.0444|INFO |c.e.r.services.PlaylistServiceImpl|createPlaylist is called. creatorName: mitt@abv.bg, playlistName: test
05-02-2020 12:16:02.0522|INFO |c.example.ridepal.RidepalApplication|Starting RidepalApplication on LenovoB5400 with PID 10128 (C:\Users\User\Documents\TELERIK\repository\team-7---ridepal-final-project\ridepal\build\classes\java\main started by User in C:\Users\User\Documents\TELERIK\repository\team-7---ridepal-final-project\ridepal)
05-02-2020 12:16:02.0522|INFO |c.example.ridepal.RidepalApplication|No active profile set, falling back to default profiles: default
05-02-2020 12:16:14.0018|INFO |c.example.ridepal.RidepalApplication|Started RidepalApplication in 12.189 seconds (JVM running for 14.577)
05-02-2020 12:17:11.0543|INFO |c.e.r.services.PlaylistServiceImpl|createPlaylist is called. creatorName: mitt@abv.bg, playlistName: test
05-02-2020 12:17:19.0463|INFO |c.example.ridepal.RidepalApplication|Starting RidepalApplication on LenovoB5400 with PID 5116 (C:\Users\User\Documents\TELERIK\repository\team-7---ridepal-final-project\ridepal\build\classes\java\main started by User in C:\Users\User\Documents\TELERIK\repository\team-7---ridepal-final-project\ridepal)
05-02-2020 12:17:19.0479|INFO |c.example.ridepal.RidepalApplication|No active profile set, falling back to default profiles: default
05-02-2020 12:17:30.0040|INFO |c.example.ridepal.RidepalApplication|Started RidepalApplication in 11.129 seconds (JVM running for 13.059)
05-02-2020 12:26:42.0220|INFO |c.e.r.services.PlaylistServiceImpl|createPlaylist is called. creatorName: mitt@abv.bg, playlistName: test
05-02-2020 12:26:58.0098|INFO |c.example.ridepal.RidepalApplication|Starting RidepalApplication on LenovoB5400 with PID 12388 (C:\Users\User\Documents\TELERIK\repository\team-7---ridepal-final-project\ridepal\build\classes\java\main started by User in C:\Users\User\Documents\TELERIK\repository\team-7---ridepal-final-project\ridepal)
05-02-2020 12:26:58.0109|INFO |c.example.ridepal.RidepalApplication|No active profile set, falling back to default profiles: default
05-02-2020 12:27:17.0795|INFO |c.example.ridepal.RidepalApplication|Started RidepalApplication in 20.4 seconds (JVM running for 23.147)
05-02-2020 12:59:34.0459|INFO |c.example.ridepal.RidepalApplication|Starting RidepalApplication on LenovoB5400 with PID 8160 (C:\Users\User\Documents\TELERIK\repository\team-7---ridepal-final-project\ridepal\build\classes\java\main started by User in C:\Users\User\Documents\TELERIK\repository\team-7---ridepal-final-project\ridepal)
05-02-2020 12:59:34.0459|INFO |c.example.ridepal.RidepalApplication|No active profile set, falling back to default profiles: default
05-02-2020 12:59:46.0336|INFO |c.example.ridepal.RidepalApplication|Started RidepalApplication in 12.593 seconds (JVM running for 15.17)
05-02-2020 13:04:36.0996|INFO |c.example.ridepal.RidepalApplication|Starting RidepalApplication on LenovoB5400 with PID 8160 (C:\Users\User\Documents\TELERIK\repository\team-7---ridepal-final-project\ridepal\build\classes\java\main started by User in C:\Users\User\Documents\TELERIK\repository\team-7---ridepal-final-project\ridepal)
05-02-2020 13:04:36.0997|INFO |c.example.ridepal.RidepalApplication|No active profile set, falling back to default profiles: default
05-02-2020 13:04:43.0760|INFO |c.example.ridepal.RidepalApplication|Started RidepalApplication in 7.168 seconds (JVM running for 312.595)
05-02-2020 13:05:57.0340|INFO |c.example.ridepal.RidepalApplication|Starting RidepalApplication on LenovoB5400 with PID 8160 (C:\Users\User\Documents\TELERIK\repository\team-7---ridepal-final-project\ridepal\build\classes\java\main started by User in C:\Users\User\Documents\TELERIK\repository\team-7---ridepal-final-project\ridepal)
05-02-2020 13:05:57.0340|INFO |c.example.ridepal.RidepalApplication|No active profile set, falling back to default profiles: default
05-02-2020 13:06:02.0009|INFO |c.example.ridepal.RidepalApplication|Started RidepalApplication in 4.744 seconds (JVM running for 390.85)
05-02-2020 13:07:41.0332|INFO |c.example.ridepal.RidepalApplication|Starting RidepalApplication on LenovoB5400 with PID 8160 (C:\Users\User\Documents\TELERIK\repository\team-7---ridepal-final-project\ridepal\build\classes\java\main started by User in C:\Users\User\Documents\TELERIK\repository\team-7---ridepal-final-project\ridepal)
05-02-2020 13:07:41.0333|INFO |c.example.ridepal.RidepalApplication|No active profile set, falling back to default profiles: default
05-02-2020 13:07:47.0363|INFO |c.example.ridepal.RidepalApplication|Started RidepalApplication in 6.136 seconds (JVM running for 496.187)
05-02-2020 13:09:49.0214|INFO |c.example.ridepal.RidepalApplication|Starting RidepalApplication on LenovoB5400 with PID 8160 (C:\Users\User\Documents\TELERIK\repository\team-7---ridepal-final-project\ridepal\build\classes\java\main started by User in C:\Users\User\Documents\TELERIK\repository\team-7---ridepal-final-project\ridepal)
05-02-2020 13:09:49.0215|INFO |c.example.ridepal.RidepalApplication|No active profile set, falling back to default profiles: default
05-02-2020 13:09:53.0546|INFO |c.example.ridepal.RidepalApplication|Started RidepalApplication in 4.383 seconds (JVM running for 622.375)
05-02-2020 13:12:31.0408|INFO |c.example.ridepal.RidepalApplication|Starting RidepalApplication on LenovoB5400 with PID 8160 (C:\Users\User\Documents\TELERIK\repository\team-7---ridepal-final-project\ridepal\build\classes\java\main started by User in C:\Users\User\Documents\TELERIK\repository\team-7---ridepal-final-project\ridepal)
05-02-2020 13:12:31.0409|INFO |c.example.ridepal.RidepalApplication|No active profile set, falling back to default profiles: default
05-02-2020 13:12:36.0617|INFO |c.example.ridepal.RidepalApplication|Started RidepalApplication in 5.346 seconds (JVM running for 785.446)
05-02-2020 13:15:10.0102|INFO |c.example.ridepal.RidepalApplication|Starting RidepalApplication on LenovoB5400 with PID 8160 (C:\Users\User\Documents\TELERIK\repository\team-7---ridepal-final-project\ridepal\build\classes\java\main started by User in C:\Users\User\Documents\TELERIK\repository\team-7---ridepal-final-project\ridepal)
05-02-2020 13:15:10.0102|INFO |c.example.ridepal.RidepalApplication|No active profile set, falling back to default profiles: default
05-02-2020 13:15:14.0623|INFO |c.example.ridepal.RidepalApplication|Started RidepalApplication in 4.596 seconds (JVM running for 943.46)
05-02-2020 13:18:58.0941|INFO |c.example.ridepal.RidepalApplication|Starting RidepalApplication on LenovoB5400 with PID 8160 (C:\Users\User\Documents\TELERIK\repository\team-7---ridepal-final-project\ridepal\build\classes\java\main started by User in C:\Users\User\Documents\TELERIK\repository\team-7---ridepal-final-project\ridepal)
05-02-2020 13:18:58.0944|INFO |c.example.ridepal.RidepalApplication|No active profile set, falling back to default profiles: default
05-02-2020 13:19:05.0716|INFO |c.example.ridepal.RidepalApplication|Started RidepalApplication in 6.874 seconds (JVM running for 1174.545)
05-02-2020 13:24:09.0142|INFO |c.example.ridepal.RidepalApplication|Starting RidepalApplication on LenovoB5400 with PID 10124 (C:\Users\User\Documents\TELERIK\repository\team-7---ridepal-final-project\ridepal\build\classes\java\main started by User in C:\Users\User\Documents\TELERIK\repository\team-7---ridepal-final-project\ridepal)
05-02-2020 13:24:09.0142|INFO |c.example.ridepal.RidepalApplication|No active profile set, falling back to default profiles: default
05-02-2020 13:24:21.0393|INFO |c.example.ridepal.RidepalApplication|Started RidepalApplication in 12.862 seconds (JVM running for 15.06)
05-02-2020 13:25:14.0627|INFO |c.example.ridepal.RidepalApplication|Starting RidepalApplication on LenovoB5400 with PID 10124 (C:\Users\User\Documents\TELERIK\repository\team-7---ridepal-final-project\ridepal\build\classes\java\main started by User in C:\Users\User\Documents\TELERIK\repository\team-7---ridepal-final-project\ridepal)
05-02-2020 13:25:14.0628|INFO |c.example.ridepal.RidepalApplication|No active profile set, falling back to default profiles: default
05-02-2020 13:25:20.0009|INFO |c.example.ridepal.RidepalApplication|Started RidepalApplication in 5.444 seconds (JVM running for 73.673)
05-02-2020 13:27:55.0830|INFO |c.example.ridepal.RidepalApplication|Starting RidepalApplication on LenovoB5400 with PID 10124 (C:\Users\User\Documents\TELERIK\repository\team-7---ridepal-final-project\ridepal\build\classes\java\main started by User in C:\Users\User\Documents\TELERIK\repository\team-7---ridepal-final-project\ridepal)
05-02-2020 13:27:55.0832|INFO |c.example.ridepal.RidepalApplication|No active profile set, falling back to default profiles: default
05-02-2020 13:28:00.0568|INFO |c.example.ridepal.RidepalApplication|Started RidepalApplication in 4.835 seconds (JVM running for 234.232)
05-02-2020 13:42:29.0809|INFO |c.example.ridepal.RidepalApplication|Starting RidepalApplication on LenovoB5400 with PID 10124 (C:\Users\User\Documents\TELERIK\repository\team-7---ridepal-final-project\ridepal\build\classes\java\main started by User in C:\Users\User\Documents\TELERIK\repository\team-7---ridepal-final-project\ridepal)
05-02-2020 13:42:29.0810|INFO |c.example.ridepal.RidepalApplication|No active profile set, falling back to default profiles: default
05-02-2020 13:42:36.0209|INFO |c.example.ridepal.RidepalApplication|Started RidepalApplication in 6.495 seconds (JVM running for 1109.872)
05-02-2020 13:43:48.0206|INFO |c.example.ridepal.RidepalApplication|Starting RidepalApplication on LenovoB5400 with PID 10124 (C:\Users\User\Documents\TELERIK\repository\team-7---ridepal-final-project\ridepal\build\classes\java\main started by User in C:\Users\User\Documents\TELERIK\repository\team-7---ridepal-final-project\ridepal)
05-02-2020 13:43:48.0209|INFO |c.example.ridepal.RidepalApplication|No active profile set, falling back to default profiles: default
05-02-2020 13:43:55.0384|INFO |c.example.ridepal.RidepalApplication|Started RidepalApplication in 7.34 seconds (JVM running for 1189.048)
05-02-2020 13:47:16.0808|INFO |c.example.ridepal.RidepalApplication|Starting RidepalApplication on LenovoB5400 with PID 10124 (C:\Users\User\Documents\TELERIK\repository\team-7---ridepal-final-project\ridepal\build\classes\java\main started by User in C:\Users\User\Documents\TELERIK\repository\team-7---ridepal-final-project\ridepal)
05-02-2020 13:47:16.0808|INFO |c.example.ridepal.RidepalApplication|No active profile set, falling back to default profiles: default
05-02-2020 13:47:22.0492|INFO |c.example.ridepal.RidepalApplication|Started RidepalApplication in 5.872 seconds (JVM running for 1396.156)
05-02-2020 13:49:59.0223|INFO |c.e.r.services.PlaylistServiceImpl|createPlaylist is called. creatorName: mitt@abv.bg, playlistName: test
05-02-2020 15:53:34.0344|INFO |c.example.ridepal.RidepalApplication|Starting RidepalApplication on LenovoB5400 with PID 5644 (C:\Users\User\Documents\TELERIK\repository\team-7---ridepal-final-project\ridepal\build\classes\java\main started by User in C:\Users\User\Documents\TELERIK\repository\team-7---ridepal-final-project\ridepal)
05-02-2020 15:53:34.0349|INFO |c.example.ridepal.RidepalApplication|No active profile set, falling back to default profiles: default
05-02-2020 15:54:54.0551|INFO |c.example.ridepal.RidepalApplication|Starting RidepalApplication on LenovoB5400 with PID 4400 (C:\Users\User\Documents\TELERIK\repository\team-7---ridepal-final-project\ridepal\build\classes\java\main started by User in C:\Users\User\Documents\TELERIK\repository\team-7---ridepal-final-project\ridepal)
05-02-2020 15:54:54.0556|INFO |c.example.ridepal.RidepalApplication|No active profile set, falling back to default profiles: default
05-02-2020 15:58:24.0699|INFO |c.example.ridepal.RidepalApplication|Starting RidepalApplication on LenovoB5400 with PID 9292 (C:\Users\User\Documents\TELERIK\repository\team-7---ridepal-final-project\ridepal\build\classes\java\main started by User in C:\Users\User\Documents\TELERIK\repository\team-7---ridepal-final-project\ridepal)
05-02-2020 15:58:24.0715|INFO |c.example.ridepal.RidepalApplication|No active profile set, falling back to default profiles: default
05-02-2020 15:58:41.0723|INFO |c.example.ridepal.RidepalApplication|Started RidepalApplication in 18.174 seconds (JVM running for 21.451)
05-02-2020 16:10:14.0662|INFO |c.example.ridepal.RidepalApplication|Starting RidepalApplication on LenovoB5400 with PID 9292 (C:\Users\User\Documents\TELERIK\repository\team-7---ridepal-final-project\ridepal\build\classes\java\main started by User in C:\Users\User\Documents\TELERIK\repository\team-7---ridepal-final-project\ridepal)
05-02-2020 16:10:14.0662|INFO |c.example.ridepal.RidepalApplication|No active profile set, falling back to default profiles: default
05-02-2020 16:10:20.0867|INFO |c.example.ridepal.RidepalApplication|Started RidepalApplication in 6.328 seconds (JVM running for 720.602)
05-02-2020 16:27:01.0801|INFO |c.example.ridepal.RidepalApplication|Starting RidepalApplication on LenovoB5400 with PID 9292 (C:\Users\User\Documents\TELERIK\repository\team-7---ridepal-final-project\ridepal\build\classes\java\main started by User in C:\Users\User\Documents\TELERIK\repository\team-7---ridepal-final-project\ridepal)
05-02-2020 16:27:01.0801|INFO |c.example.ridepal.RidepalApplication|No active profile set, falling back to default profiles: default
05-02-2020 16:27:08.0447|INFO |c.example.ridepal.RidepalApplication|Started RidepalApplication in 6.719 seconds (JVM running for 1728.169)
05-02-2020 16:31:59.0500|INFO |c.example.ridepal.RidepalApplication|Starting RidepalApplication on LenovoB5400 with PID 9292 (C:\Users\User\Documents\TELERIK\repository\team-7---ridepal-final-project\ridepal\build\classes\java\main started by User in C:\Users\User\Documents\TELERIK\repository\team-7---ridepal-final-project\ridepal)
05-02-2020 16:31:59.0500|INFO |c.example.ridepal.RidepalApplication|No active profile set, falling back to default profiles: default
05-02-2020 16:32:10.0321|INFO |c.example.ridepal.RidepalApplication|Started RidepalApplication in 10.885 seconds (JVM running for 2030.047)
05-02-2020 16:32:36.0735|INFO |c.e.r.services.PlaylistServiceImpl|createPlaylist is called. creatorName: mitt@abv.bg, playlistName: test
05-02-2020 16:33:51.0234|INFO |c.e.r.services.PlaylistServiceImpl|createPlaylist is called. creatorName: mitt@abv.bg, playlistName: test
05-02-2020 16:36:02.0664|INFO |c.e.r.services.PlaylistServiceImpl|createPlaylist is called. creatorName: mitt@abv.bg, playlistName: test
05-02-2020 16:36:53.0123|INFO |c.e.r.services.PlaylistServiceImpl|createPlaylist is called. creatorName: mitt@abv.bg, playlistName: test
05-02-2020 16:38:16.0010|INFO |c.example.ridepal.RidepalApplication|Starting RidepalApplication on LenovoB5400 with PID 800 (C:\Users\User\Documents\TELERIK\repository\team-7---ridepal-final-project\ridepal\build\classes\java\main started by User in C:\Users\User\Documents\TELERIK\repository\team-7---ridepal-final-project\ridepal)
05-02-2020 16:38:16.0010|INFO |c.example.ridepal.RidepalApplication|No active profile set, falling back to default profiles: default
05-02-2020 16:38:28.0506|INFO |c.example.ridepal.RidepalApplication|Started RidepalApplication in 13.103 seconds (JVM running for 15.368)
05-02-2020 16:40:22.0154|INFO |c.example.ridepal.RidepalApplication|Starting RidepalApplication on LenovoB5400 with PID 7932 (C:\Users\User\Documents\TELERIK\repository\team-7---ridepal-final-project\ridepal\build\classes\java\main started by User in C:\Users\User\Documents\TELERIK\repository\team-7---ridepal-final-project\ridepal)
05-02-2020 16:40:22.0154|INFO |c.example.ridepal.RidepalApplication|No active profile set, falling back to default profiles: default
05-02-2020 16:40:33.0256|INFO |c.example.ridepal.RidepalApplication|Started RidepalApplication in 11.581 seconds (JVM running for 13.136)
05-02-2020 16:41:31.0394|INFO |c.example.ridepal.RidepalApplication|Starting RidepalApplication on LenovoB5400 with PID 4256 (C:\Users\User\Documents\TELERIK\repository\team-7---ridepal-final-project\ridepal\build\classes\java\main started by User in C:\Users\User\Documents\TELERIK\repository\team-7---ridepal-final-project\ridepal)
05-02-2020 16:41:31.0410|INFO |c.example.ridepal.RidepalApplication|No active profile set, falling back to default profiles: default
05-02-2020 16:41:42.0877|INFO |c.example.ridepal.RidepalApplication|Started RidepalApplication in 11.92 seconds (JVM running for 13.575)
05-02-2020 16:43:05.0710|INFO |c.example.ridepal.RidepalApplication|Starting RidepalApplication on LenovoB5400 with PID 4256 (C:\Users\User\Documents\TELERIK\repository\team-7---ridepal-final-project\ridepal\build\classes\java\main started by User in C:\Users\User\Documents\TELERIK\repository\team-7---ridepal-final-project\ridepal)
05-02-2020 16:43:05.0710|INFO |c.example.ridepal.RidepalApplication|No active profile set, falling back to default profiles: default
05-02-2020 16:43:11.0690|INFO |c.example.ridepal.RidepalApplication|Started RidepalApplication in 6.063 seconds (JVM running for 102.394)
05-02-2020 16:44:34.0390|INFO |c.example.ridepal.RidepalApplication|Starting RidepalApplication on LenovoB5400 with PID 8232 (C:\Users\User\Documents\TELERIK\repository\team-7---ridepal-final-project\ridepal\build\classes\java\main started by User in C:\Users\User\Documents\TELERIK\repository\team-7---ridepal-final-project\ridepal)
05-02-2020 16:44:34.0394|INFO |c.example.ridepal.RidepalApplication|No active profile set, falling back to default profiles: default
05-02-2020 16:44:45.0013|INFO |c.example.ridepal.RidepalApplication|Started RidepalApplication in 11.057 seconds (JVM running for 12.622)
05-02-2020 16:48:53.0235|INFO |c.example.ridepal.RidepalApplication|Starting RidepalApplication on LenovoB5400 with PID 8232 (C:\Users\User\Documents\TELERIK\repository\team-7---ridepal-final-project\ridepal\build\classes\java\main started by User in C:\Users\User\Documents\TELERIK\repository\team-7---ridepal-final-project\ridepal)
05-02-2020 16:48:53.0235|INFO |c.example.ridepal.RidepalApplication|No active profile set, falling back to default profiles: default
05-02-2020 16:48:59.0813|INFO |c.example.ridepal.RidepalApplication|Started RidepalApplication in 6.657 seconds (JVM running for 267.411)
05-02-2020 16:52:21.0095|INFO |c.example.ridepal.RidepalApplication|Starting RidepalApplication on LenovoB5400 with PID 8232 (C:\Users\User\Documents\TELERIK\repository\team-7---ridepal-final-project\ridepal\build\classes\java\main started by User in C:\Users\User\Documents\TELERIK\repository\team-7---ridepal-final-project\ridepal)
05-02-2020 16:52:21.0095|INFO |c.example.ridepal.RidepalApplication|No active profile set, falling back to default profiles: default
05-02-2020 16:52:27.0166|INFO |c.example.ridepal.RidepalApplication|Started RidepalApplication in 6.128 seconds (JVM running for 474.774)
05-02-2020 16:53:36.0375|INFO |c.example.ridepal.RidepalApplication|Starting RidepalApplication on LenovoB5400 with PID 8232 (C:\Users\User\Documents\TELERIK\repository\team-7---ridepal-final-project\ridepal\build\classes\java\main started by User in C:\Users\User\Documents\TELERIK\repository\team-7---ridepal-final-project\ridepal)
05-02-2020 16:53:36.0375|INFO |c.example.ridepal.RidepalApplication|No active profile set, falling back to default profiles: default
05-02-2020 16:53:41.0222|INFO |c.example.ridepal.RidepalApplication|Started RidepalApplication in 4.913 seconds (JVM running for 548.82)
05-02-2020 16:58:36.0987|INFO |c.example.ridepal.RidepalApplication|Starting RidepalApplication on LenovoB5400 with PID 5344 (C:\Users\User\Documents\TELERIK\repository\team-7---ridepal-final-project\ridepal\build\classes\java\main started by User in C:\Users\User\Documents\TELERIK\repository\team-7---ridepal-final-project\ridepal)
05-02-2020 16:58:36.0987|INFO |c.example.ridepal.RidepalApplication|No active profile set, falling back to default profiles: default
05-02-2020 16:58:47.0582|INFO |c.example.ridepal.RidepalApplication|Started RidepalApplication in 11.162 seconds (JVM running for 13.226)
05-02-2020 17:15:00.0260|INFO |c.example.ridepal.RidepalApplication|Starting RidepalApplication on LenovoB5400 with PID 5344 (C:\Users\User\Documents\TELERIK\repository\team-7---ridepal-final-project\ridepal\build\classes\java\main started by User in C:\Users\User\Documents\TELERIK\repository\team-7---ridepal-final-project\ridepal)
05-02-2020 17:15:00.0260|INFO |c.example.ridepal.RidepalApplication|No active profile set, falling back to default profiles: default
05-02-2020 17:15:07.0054|INFO |c.example.ridepal.RidepalApplication|Started RidepalApplication in 6.884 seconds (JVM running for 992.706)
05-02-2020 17:17:09.0609|INFO |c.example.ridepal.RidepalApplication|Starting RidepalApplication on LenovoB5400 with PID 5344 (C:\Users\User\Documents\TELERIK\repository\team-7---ridepal-final-project\ridepal\build\classes\java\main started by User in C:\Users\User\Documents\TELERIK\repository\team-7---ridepal-final-project\ridepal)
05-02-2020 17:17:09.0609|INFO |c.example.ridepal.RidepalApplication|No active profile set, falling back to default profiles: default
05-02-2020 17:17:15.0242|INFO |c.example.ridepal.RidepalApplication|Started RidepalApplication in 5.692 seconds (JVM running for 1120.883)
05-02-2020 17:24:36.0186|INFO |c.example.ridepal.RidepalApplication|Starting RidepalApplication on LenovoB5400 with PID 2136 (C:\Users\User\Documents\TELERIK\repository\team-7---ridepal-final-project\ridepal\build\classes\java\main started by User in C:\Users\User\Documents\TELERIK\repository\team-7---ridepal-final-project\ridepal)
05-02-2020 17:24:36.0186|INFO |c.example.ridepal.RidepalApplication|No active profile set, falling back to default profiles: default
05-02-2020 17:24:49.0072|INFO |c.example.ridepal.RidepalApplication|Started RidepalApplication in 13.52 seconds (JVM running for 15.637)
05-02-2020 17:33:45.0775|INFO |c.example.ridepal.RidepalApplication|Starting RidepalApplication on LenovoB5400 with PID 2136 (C:\Users\User\Documents\TELERIK\repository\team-7---ridepal-final-project\ridepal\build\classes\java\main started by User in C:\Users\User\Documents\TELERIK\repository\team-7---ridepal-final-project\ridepal)
05-02-2020 17:33:45.0775|INFO |c.example.ridepal.RidepalApplication|No active profile set, falling back to default profiles: default
05-02-2020 17:33:53.0750|INFO |c.example.ridepal.RidepalApplication|Started RidepalApplication in 8.037 seconds (JVM running for 560.304)
05-02-2020 17:48:34.0791|INFO |c.example.ridepal.RidepalApplication|Starting RidepalApplication on LenovoB5400 with PID 2136 (C:\Users\User\Documents\TELERIK\repository\team-7---ridepal-final-project\ridepal\build\classes\java\main started by User in C:\Users\User\Documents\TELERIK\repository\team-7---ridepal-final-project\ridepal)
05-02-2020 17:48:34.0791|INFO |c.example.ridepal.RidepalApplication|No active profile set, falling back to default profiles: default
05-02-2020 17:48:40.0139|INFO |c.example.ridepal.RidepalApplication|Started RidepalApplication in 5.435 seconds (JVM running for 1446.694)
05-02-2020 17:54:47.0019|INFO |c.e.r.services.PlaylistServiceImpl|createPlaylist is called. creatorName: mitt@abv.bg, playlistName: test
05-02-2020 17:55:37.0032|INFO |c.example.ridepal.RidepalApplication|Starting RidepalApplication on LenovoB5400 with PID 2136 (C:\Users\User\Documents\TELERIK\repository\team-7---ridepal-final-project\ridepal\build\classes\java\main started by User in C:\Users\User\Documents\TELERIK\repository\team-7---ridepal-final-project\ridepal)
05-02-2020 17:55:37.0032|INFO |c.example.ridepal.RidepalApplication|No active profile set, falling back to default profiles: default
05-02-2020 17:55:42.0328|INFO |c.example.ridepal.RidepalApplication|Started RidepalApplication in 5.432 seconds (JVM running for 1868.901)
05-02-2020 17:56:48.0924|INFO |c.e.r.services.PlaylistServiceImpl|createPlaylist is called. creatorName: mitt@abv.bg, playlistName: test
05-02-2020 17:58:52.0636|INFO |c.example.ridepal.RidepalApplication|Starting RidepalApplication on LenovoB5400 with PID 2136 (C:\Users\User\Documents\TELERIK\repository\team-7---ridepal-final-project\ridepal\build\classes\java\main started by User in C:\Users\User\Documents\TELERIK\repository\team-7---ridepal-final-project\ridepal)
05-02-2020 17:58:52.0636|INFO |c.example.ridepal.RidepalApplication|No active profile set, falling back to default profiles: default
05-02-2020 17:58:58.0274|INFO |c.example.ridepal.RidepalApplication|Started RidepalApplication in 5.732 seconds (JVM running for 2064.848)
05-02-2020 18:00:30.0217|INFO |c.example.ridepal.RidepalApplication|Starting RidepalApplication on LenovoB5400 with PID 7788 (C:\Users\User\Documents\TELERIK\repository\team-7---ridepal-final-project\ridepal\build\classes\java\main started by User in C:\Users\User\Documents\TELERIK\repository\team-7---ridepal-final-project\ridepal)
05-02-2020 18:00:30.0217|INFO |c.example.ridepal.RidepalApplication|No active profile set, falling back to default profiles: default
05-02-2020 18:00:41.0315|INFO |c.example.ridepal.RidepalApplication|Started RidepalApplication in 11.638 seconds (JVM running for 13.514)
05-02-2020 18:15:17.0821|INFO |c.example.ridepal.RidepalApplication|Starting RidepalApplication on LenovoB5400 with PID 10452 (C:\Users\User\Documents\TELERIK\repository\team-7---ridepal-final-project\ridepal\build\classes\java\main started by User in C:\Users\User\Documents\TELERIK\repository\team-7---ridepal-final-project\ridepal)
05-02-2020 18:15:17.0828|INFO |c.example.ridepal.RidepalApplication|No active profile set, falling back to default profiles: default
05-02-2020 18:15:30.0633|INFO |c.example.ridepal.RidepalApplication|Started RidepalApplication in 13.459 seconds (JVM running for 15.66)
05-02-2020 18:16:09.0070|INFO |c.example.ridepal.RidepalApplication|Starting RidepalApplication on LenovoB5400 with PID 10452 (C:\Users\User\Documents\TELERIK\repository\team-7---ridepal-final-project\ridepal\build\classes\java\main started by User in C:\Users\User\Documents\TELERIK\repository\team-7---ridepal-final-project\ridepal)
05-02-2020 18:16:09.0070|INFO |c.example.ridepal.RidepalApplication|No active profile set, falling back to default profiles: default
05-02-2020 18:16:14.0940|INFO |c.example.ridepal.RidepalApplication|Started RidepalApplication in 5.931 seconds (JVM running for 59.971)
05-02-2020 19:25:47.0354|INFO |c.example.ridepal.RidepalApplication|Starting RidepalApplication on LenovoB5400 with PID 10452 (C:\Users\User\Documents\TELERIK\repository\team-7---ridepal-final-project\ridepal\build\classes\java\main started by User in C:\Users\User\Documents\TELERIK\repository\team-7---ridepal-final-project\ridepal)
05-02-2020 19:25:47.0355|INFO |c.example.ridepal.RidepalApplication|No active profile set, falling back to default profiles: default
05-02-2020 19:25:56.0810|INFO |c.example.ridepal.RidepalApplication|Started RidepalApplication in 9.665 seconds (JVM running for 4241.843)
05-02-2020 19:28:29.0281|INFO |c.example.ridepal.RidepalApplication|Starting RidepalApplication on LenovoB5400 with PID 10452 (C:\Users\User\Documents\TELERIK\repository\team-7---ridepal-final-project\ridepal\build\classes\java\main started by User in C:\Users\User\Documents\TELERIK\repository\team-7---ridepal-final-project\ridepal)
05-02-2020 19:28:29.0282|INFO |c.example.ridepal.RidepalApplication|No active profile set, falling back to default profiles: default
05-02-2020 19:28:35.0941|INFO |c.example.ridepal.RidepalApplication|Started RidepalApplication in 6.73 seconds (JVM running for 4400.974)
05-02-2020 19:29:51.0461|INFO |c.example.ridepal.RidepalApplication|Starting RidepalApplication on LenovoB5400 with PID 10452 (C:\Users\User\Documents\TELERIK\repository\team-7---ridepal-final-project\ridepal\build\classes\java\main started by User in C:\Users\User\Documents\TELERIK\repository\team-7---ridepal-final-project\ridepal)
05-02-2020 19:29:51.0461|INFO |c.example.ridepal.RidepalApplication|No active profile set, falling back to default profiles: default
05-02-2020 19:29:57.0506|INFO |c.example.ridepal.RidepalApplication|Started RidepalApplication in 6.102 seconds (JVM running for 4482.54)
05-02-2020 19:31:47.0536|INFO |c.example.ridepal.RidepalApplication|Starting RidepalApplication on LenovoB5400 with PID 10452 (C:\Users\User\Documents\TELERIK\repository\team-7---ridepal-final-project\ridepal\build\classes\java\main started by User in C:\Users\User\Documents\TELERIK\repository\team-7---ridepal-final-project\ridepal)
05-02-2020 19:31:47.0536|INFO |c.example.ridepal.RidepalApplication|No active profile set, falling back to default profiles: default
05-02-2020 19:31:53.0439|INFO |c.example.ridepal.RidepalApplication|Started RidepalApplication in 5.957 seconds (JVM running for 4598.485)
05-02-2020 19:35:21.0008|INFO |c.example.ridepal.RidepalApplication|Starting RidepalApplication on LenovoB5400 with PID 10452 (C:\Users\User\Documents\TELERIK\repository\team-7---ridepal-final-project\ridepal\build\classes\java\main started by User in C:\Users\User\Documents\TELERIK\repository\team-7---ridepal-final-project\ridepal)
05-02-2020 19:35:21.0008|INFO |c.example.ridepal.RidepalApplication|No active profile set, falling back to default profiles: default
05-02-2020 19:35:27.0835|INFO |c.example.ridepal.RidepalApplication|Started RidepalApplication in 6.912 seconds (JVM running for 4812.876)
05-02-2020 19:37:15.0493|INFO |c.example.ridepal.RidepalApplication|Starting RidepalApplication on LenovoB5400 with PID 10452 (C:\Users\User\Documents\TELERIK\repository\team-7---ridepal-final-project\ridepal\build\classes\java\main started by User in C:\Users\User\Documents\TELERIK\repository\team-7---ridepal-final-project\ridepal)
05-02-2020 19:37:15.0493|INFO |c.example.ridepal.RidepalApplication|No active profile set, falling back to default profiles: default
05-02-2020 19:37:25.0698|INFO |c.example.ridepal.RidepalApplication|Started RidepalApplication in 10.276 seconds (JVM running for 4930.74)
05-02-2020 19:44:41.0597|INFO |c.example.ridepal.RidepalApplication|Starting RidepalApplication on LenovoB5400 with PID 6240 (C:\Users\User\Documents\TELERIK\repository\team-7---ridepal-final-project\ridepal\build\classes\java\main started by User in C:\Users\User\Documents\TELERIK\repository\team-7---ridepal-final-project\ridepal)
05-02-2020 19:44:41.0597|INFO |c.example.ridepal.RidepalApplication|No active profile set, falling back to default profiles: default
05-02-2020 19:44:53.0297|INFO |c.example.ridepal.RidepalApplication|Started RidepalApplication in 12.265 seconds (JVM running for 14.302)
05-02-2020 19:48:32.0609|INFO |c.example.ridepal.RidepalApplication|Starting RidepalApplication on LenovoB5400 with PID 6240 (C:\Users\User\Documents\TELERIK\repository\team-7---ridepal-final-project\ridepal\build\classes\java\main started by User in C:\Users\User\Documents\TELERIK\repository\team-7---ridepal-final-project\ridepal)
05-02-2020 19:48:32.0610|INFO |c.example.ridepal.RidepalApplication|No active profile set, falling back to default profiles: default
05-02-2020 19:48:39.0546|INFO |c.example.ridepal.RidepalApplication|Started RidepalApplication in 7.015 seconds (JVM running for 240.541)
05-02-2020 19:50:58.0706|INFO |c.example.ridepal.RidepalApplication|Starting RidepalApplication on LenovoB5400 with PID 6240 (C:\Users\User\Documents\TELERIK\repository\team-7---ridepal-final-project\ridepal\build\classes\java\main started by User in C:\Users\User\Documents\TELERIK\repository\team-7---ridepal-final-project\ridepal)
05-02-2020 19:50:58.0707|INFO |c.example.ridepal.RidepalApplication|No active profile set, falling back to default profiles: default
05-02-2020 19:51:05.0207|INFO |c.example.ridepal.RidepalApplication|Started RidepalApplication in 6.579 seconds (JVM running for 386.202)
05-02-2020 19:52:43.0975|INFO |c.example.ridepal.RidepalApplication|Starting RidepalApplication on LenovoB5400 with PID 6240 (C:\Users\User\Documents\TELERIK\repository\team-7---ridepal-final-project\ridepal\build\classes\java\main started by User in C:\Users\User\Documents\TELERIK\repository\team-7---ridepal-final-project\ridepal)
05-02-2020 19:52:43.0976|INFO |c.example.ridepal.RidepalApplication|No active profile set, falling back to default profiles: default
05-02-2020 19:52:50.0291|INFO |c.example.ridepal.RidepalApplication|Started RidepalApplication in 6.39 seconds (JVM running for 491.286)
05-02-2020 19:59:20.0562|INFO |c.example.ridepal.RidepalApplication|Starting RidepalApplication on LenovoB5400 with PID 6240 (C:\Users\User\Documents\TELERIK\repository\team-7---ridepal-final-project\ridepal\build\classes\java\main started by User in C:\Users\User\Documents\TELERIK\repository\team-7---ridepal-final-project\ridepal)
05-02-2020 19:59:20.0562|INFO |c.example.ridepal.RidepalApplication|No active profile set, falling back to default profiles: default
05-02-2020 19:59:26.0570|INFO |c.example.ridepal.RidepalApplication|Started RidepalApplication in 6.076 seconds (JVM running for 887.577)
05-02-2020 20:11:13.0434|INFO |c.example.ridepal.RidepalApplication|Starting RidepalApplication on LenovoB5400 with PID 12760 (C:\Users\User\Documents\TELERIK\repository\team-7---ridepal-final-project\ridepal\build\classes\java\main started by User in C:\Users\User\Documents\TELERIK\repository\team-7---ridepal-final-project\ridepal)
05-02-2020 20:11:13.0450|INFO |c.example.ridepal.RidepalApplication|No active profile set, falling back to default profiles: default
05-02-2020 20:11:26.0845|INFO |c.example.ridepal.RidepalApplication|Started RidepalApplication in 14.606 seconds (JVM running for 16.729)
05-02-2020 20:13:50.0276|INFO |c.example.ridepal.RidepalApplication|Starting RidepalApplication on LenovoB5400 with PID 12760 (C:\Users\User\Documents\TELERIK\repository\team-7---ridepal-final-project\ridepal\build\classes\java\main started by User in C:\Users\User\Documents\TELERIK\repository\team-7---ridepal-final-project\ridepal)
05-02-2020 20:13:50.0276|INFO |c.example.ridepal.RidepalApplication|No active profile set, falling back to default profiles: default
05-02-2020 20:13:59.0999|INFO |c.example.ridepal.RidepalApplication|Started RidepalApplication in 9.781 seconds (JVM running for 169.885)
05-02-2020 20:17:46.0406|INFO |c.example.ridepal.RidepalApplication|Starting RidepalApplication on LenovoB5400 with PID 12760 (C:\Users\User\Documents\TELERIK\repository\team-7---ridepal-final-project\ridepal\build\classes\java\main started by User in C:\Users\User\Documents\TELERIK\repository\team-7---ridepal-final-project\ridepal)
05-02-2020 20:17:46.0406|INFO |c.example.ridepal.RidepalApplication|No active profile set, falling back to default profiles: default
05-02-2020 20:17:51.0969|INFO |c.example.ridepal.RidepalApplication|Started RidepalApplication in 5.645 seconds (JVM running for 401.865)
05-02-2020 20:19:44.0889|INFO |c.example.ridepal.RidepalApplication|Starting RidepalApplication on LenovoB5400 with PID 12760 (C:\Users\User\Documents\TELERIK\repository\team-7---ridepal-final-project\ridepal\build\classes\java\main started by User in C:\Users\User\Documents\TELERIK\repository\team-7---ridepal-final-project\ridepal)
05-02-2020 20:19:44.0889|INFO |c.example.ridepal.RidepalApplication|No active profile set, falling back to default profiles: default
05-02-2020 20:19:51.0515|INFO |c.example.ridepal.RidepalApplication|Started RidepalApplication in 6.689 seconds (JVM running for 521.41)
05-02-2020 20:21:34.0299|INFO |c.example.ridepal.RidepalApplication|Starting RidepalApplication on LenovoB5400 with PID 12760 (C:\Users\User\Documents\TELERIK\repository\team-7---ridepal-final-project\ridepal\build\classes\java\main started by User in C:\Users\User\Documents\TELERIK\repository\team-7---ridepal-final-project\ridepal)
05-02-2020 20:21:34.0299|INFO |c.example.ridepal.RidepalApplication|No active profile set, falling back to default profiles: default
05-02-2020 20:21:40.0086|INFO |c.example.ridepal.RidepalApplication|Started RidepalApplication in 5.837 seconds (JVM running for 629.974)
05-02-2020 20:29:31.0512|INFO |c.example.ridepal.RidepalApplication|Starting RidepalApplication on LenovoB5400 with PID 12760 (C:\Users\User\Documents\TELERIK\repository\team-7---ridepal-final-project\ridepal\build\classes\java\main started by User in C:\Users\User\Documents\TELERIK\repository\team-7---ridepal-final-project\ridepal)
05-02-2020 20:29:31.0512|INFO |c.example.ridepal.RidepalApplication|No active profile set, falling back to default profiles: default
05-02-2020 20:29:37.0973|INFO |c.example.ridepal.RidepalApplication|Started RidepalApplication in 6.529 seconds (JVM running for 1107.855)
05-02-2020 20:32:56.0085|INFO |c.example.ridepal.RidepalApplication|Starting RidepalApplication on LenovoB5400 with PID 12760 (C:\Users\User\Documents\TELERIK\repository\team-7---ridepal-final-project\ridepal\build\classes\java\main started by User in C:\Users\User\Documents\TELERIK\repository\team-7---ridepal-final-project\ridepal)
05-02-2020 20:32:56.0085|INFO |c.example.ridepal.RidepalApplication|No active profile set, falling back to default profiles: default
05-02-2020 20:33:03.0398|INFO |c.example.ridepal.RidepalApplication|Started RidepalApplication in 7.468 seconds (JVM running for 1313.295)
05-02-2020 20:37:45.0826|INFO |c.example.ridepal.RidepalApplication|Starting RidepalApplication on LenovoB5400 with PID 12760 (C:\Users\User\Documents\TELERIK\repository\team-7---ridepal-final-project\ridepal\build\classes\java\main started by User in C:\Users\User\Documents\TELERIK\repository\team-7---ridepal-final-project\ridepal)
05-02-2020 20:37:45.0826|INFO |c.example.ridepal.RidepalApplication|No active profile set, falling back to default profiles: default
05-02-2020 20:37:50.0954|INFO |c.example.ridepal.RidepalApplication|Started RidepalApplication in 5.184 seconds (JVM running for 1600.85)
05-02-2020 20:57:36.0249|INFO |c.example.ridepal.RidepalApplication|Starting RidepalApplication on LenovoB5400 with PID 11716 (C:\Users\User\Documents\TELERIK\repository\team-7---ridepal-final-project\ridepal\build\classes\java\main started by User in C:\Users\User\Documents\TELERIK\repository\team-7---ridepal-final-project\ridepal)
05-02-2020 20:57:36.0249|INFO |c.example.ridepal.RidepalApplication|No active profile set, falling back to default profiles: default
05-02-2020 20:57:47.0685|INFO |c.example.ridepal.RidepalApplication|Started RidepalApplication in 12.034 seconds (JVM running for 14.5)
05-02-2020 20:58:48.0789|INFO |c.example.ridepal.RidepalApplication|Starting RidepalApplication on LenovoB5400 with PID 11716 (C:\Users\User\Documents\TELERIK\repository\team-7---ridepal-final-project\ridepal\build\classes\java\main started by User in C:\Users\User\Documents\TELERIK\repository\team-7---ridepal-final-project\ridepal)
05-02-2020 20:58:48.0789|INFO |c.example.ridepal.RidepalApplication|No active profile set, falling back to default profiles: default
05-02-2020 20:58:56.0711|INFO |c.example.ridepal.RidepalApplication|Started RidepalApplication in 7.972 seconds (JVM running for 83.524)
05-02-2020 21:14:32.0596|INFO |c.example.ridepal.RidepalApplication|Starting RidepalApplication on LenovoB5400 with PID 11000 (C:\Users\User\Documents\TELERIK\repository\team-7---ridepal-final-project\ridepal\build\classes\java\main started by User in C:\Users\User\Documents\TELERIK\repository\team-7---ridepal-final-project\ridepal)
05-02-2020 21:14:32.0596|INFO |c.example.ridepal.RidepalApplication|No active profile set, falling back to default profiles: default
05-02-2020 21:14:44.0226|INFO |c.example.ridepal.RidepalApplication|Started RidepalApplication in 12.167 seconds (JVM running for 14.742)
05-02-2020 21:16:56.0898|INFO |c.example.ridepal.RidepalApplication|Starting RidepalApplication on LenovoB5400 with PID 11000 (C:\Users\User\Documents\TELERIK\repository\team-7---ridepal-final-project\ridepal\build\classes\java\main started by User in C:\Users\User\Documents\TELERIK\repository\team-7---ridepal-final-project\ridepal)
05-02-2020 21:16:56.0914|INFO |c.example.ridepal.RidepalApplication|No active profile set, falling back to default profiles: default
05-02-2020 21:17:02.0822|INFO |c.example.ridepal.RidepalApplication|Started RidepalApplication in 5.978 seconds (JVM running for 153.348)
05-02-2020 23:11:13.0762|INFO |c.example.ridepal.RidepalApplication|Starting RidepalApplication on LenovoB5400 with PID 11732 (C:\Users\User\Documents\TELERIK\repository\team-7---ridepal-final-project\ridepal\build\classes\java\main started by User in C:\Users\User\Documents\TELERIK\repository\team-7---ridepal-final-project\ridepal)
05-02-2020 23:11:13.0771|INFO |c.example.ridepal.RidepalApplication|No active profile set, falling back to default profiles: default
05-02-2020 23:11:50.0296|INFO |c.example.ridepal.RidepalApplication|Started RidepalApplication in 37.41 seconds (JVM running for 40.962)
05-02-2020 23:31:51.0817|INFO |c.example.ridepal.RidepalApplication|Starting RidepalApplication on LenovoB5400 with PID 11732 (C:\Users\User\Documents\TELERIK\repository\team-7---ridepal-final-project\ridepal\build\classes\java\main started by User in C:\Users\User\Documents\TELERIK\repository\team-7---ridepal-final-project\ridepal)
05-02-2020 23:31:51.0818|INFO |c.example.ridepal.RidepalApplication|No active profile set, falling back to default profiles: default
05-02-2020 23:32:01.0319|INFO |c.example.ridepal.RidepalApplication|Started RidepalApplication in 9.629 seconds (JVM running for 1251.983)
05-02-2020 23:33:00.0258|INFO |c.e.r.services.PlaylistServiceImpl|createPlaylist is called. creatorName: mitt@abv.bg, playlistName: test32343
