<svg id="g12" xmlns="http://www.w3.org/2000/svg" xmlns:xlink="http://www.w3.org/1999/xlink" width="207.932" height="213.554" viewBox="0 0 207.932 213.554">
  <defs>
    <clipPath id="clip-path">
      <path id="path16" d="M0-3190.659H207.932V-2977.1H0Z" transform="translate(0 3190.659)" fill="currentColor" />
    </clipPath>
  </defs>
  <g id="g14" transform="translate(0 0)" clip-path="url(#clip-path)">
    <g id="g20" transform="translate(11.936 8.624)">
      <path id="path22" d="M-373.227-533.714a13.333,13.333,0,0,0-1.317-5.8,88.918,88.918,0,0,1,60.417-23.564,88.87,88.87,0,0,1,56.446,20.118l0,0,2.92,2.514a4.536,4.536,0,0,1,.385.32l.01.009a4.449,4.449,0,0,1,1.416,3.26,4.45,4.45,0,0,1-1.521,3.354l-2.86,2.86.01.01-6.316,6.316,0,0-3.148,3.148a4.448,4.448,0,0,1-3.25,1.406,4.448,4.448,0,0,1-3.157-1.309l-.741-.589q-1.342-1.128-2.746-2.182l-.012-.009s0,0,0,0a62.193,62.193,0,0,0-37.43-12.451A62.469,62.469,0,0,0-376.6-473.833a62.469,62.469,0,0,0,62.469,62.469A62.492,62.492,0,0,0-253.1-460.447h-.14a4.462,4.462,0,0,0-4.461-4.432v-.03h-51.961a4.462,4.462,0,0,0-4.462,4.462,4.462,4.462,0,0,0,4.462,4.462h46.028a53.566,53.566,0,0,1-50.5,35.7,53.545,53.545,0,0,1-53.545-53.545,53.545,53.545,0,0,1,53.545-53.545A53.377,53.377,0,0,1-276.265-511.7l0,0a8.9,8.9,0,0,0,6.31,2.614,8.9,8.9,0,0,0,6.705-3.036l18.257-18.257-.03-.03a8.9,8.9,0,0,0,2.889-6.573,8.9,8.9,0,0,0-2.927-6.609A97.851,97.851,0,0,0-314.127-572a97.815,97.815,0,0,0-66.748,26.188,13.333,13.333,0,0,0-5.738-1.29A13.386,13.386,0,0,0-400-533.714a13.386,13.386,0,0,0,13.386,13.386,13.386,13.386,0,0,0,13.386-13.386" transform="translate(399.999 571.999)" fill="#2f2f37"/>
    </g>
    <g id="g24" transform="translate(24.006 79.992)">
      <path id="path26" d="M-2391.773-249.17h-.046a8.924,8.924,0,0,0-8.478-8.913v-.036h-76.618a13.391,13.391,0,0,0-12.623-8.924,13.386,13.386,0,0,0-13.386,13.386,13.386,13.386,0,0,0,13.386,13.386,13.391,13.391,0,0,0,12.623-8.924h67.248c0,.008,0,.017,0,.025h4.789a4.462,4.462,0,0,1,4.462,4.462l.118,4.451h0s0,.007,0,.011A89.241,89.241,0,0,1-2489.538-151a89.013,89.013,0,0,1-66.254-29.455l-.01.01a4.445,4.445,0,0,0-3.076-1.232,4.462,4.462,0,0,0-4.462,4.462,4.446,4.446,0,0,0,1.232,3.076h0a97.91,97.91,0,0,0,72.572,32.061,98.165,98.165,0,0,0,98.165-98.165q0-4.512-.4-8.924" transform="translate(2563.34 267.043)" fill="#2f2f37"/>
    </g>
  </g>
</svg>
