<svg width="9" height="18" viewBox="0 0 9 18" fill="none" xmlns="http://www.w3.org/2000/svg">
<path d="M7.99997 16.92L1.47997 10.4C0.709966 9.62996 0.709966 8.36996 1.47997 7.59996L7.99997 1.07996" stroke="#00132C" stroke-width="1.5" stroke-miterlimit="10" stroke-linecap="round" stroke-linejoin="round"/>
</svg>
