{
  "project_info": {
    "project_number": "343699622766",
    "firebase_url": "https://agrinstapp.firebaseio.com",
    "project_id": "agrinstapp",
    "storage_bucket": "agrinstapp.appspot.com"
  },
  "client": [
    {
      "client_info": {
        "mobilesdk_app_id": "1:343699622766:android:e874169440c6e97d",
        "android_client_info": {
          "package_name": "com.app.agrinstappaker"
        }
      },
      "oauth_client": [
        {
          "client_id": "343699622766-50uc7c4sf26fkckl9h7m4kicp1qibkfk.apps.googleusercontent.com",
          "client_type": 3
        }
      ],
      "api_key": [
        {
          "current_key": "AIzaSyCj2arsax5D8OEGe5U5gNtVnX9kFN-4XP8"
        }
      ],
      "services": {
        "analytics_service": {
          "status": 1
        },
        "appinvite_service": {
          "status": 1,
          "other_platform_oauth_client": []
        },
        "ads_service": {
          "status": 2
        }
      }
    }
  ],
  "configuration_version": "1"
}