{
  "$schema": "https://docs.renovatebot.com/renovate-schema.json",
  "extends": [
    "github>whitesource/merge-confidence:beta",
    "config:base"
  ],
  "force": {
    "constraints": {
      "python": "3.7"
    }
  }
}
