^C:\UE_PROJECTS\LESSON_01_17_05\CLASSES\DEBUG\CLASSES.OBJ
C:\UE_PROJECTS\LESSON_01_17_05\CLASSES\DEBUG\CLASSES.EXE
C:\UE_PROJECTS\LESSON_01_17_05\CLASSES\DEBUG\CLASSES.ILK
C:\UE_PROJECTS\LESSON_01_17_05\CLASSES\DEBUG\CLASSES.PDB
