^C:\UE_PROJECTS\LESSON_01_16_05\ARRAYSTUDING\DEBUG\ARRAYSTUDING.OBJ
C:\UE_PROJECTS\LESSON_01_16_05\ARRAYSTUDING\DEBUG\ARRAYSTUDING.EXE
C:\UE_PROJECTS\LESSON_01_16_05\ARRAYSTUDING\DEBUG\ARRAYSTUDING.ILK
C:\UE_PROJECTS\LESSON_01_16_05\ARRAYSTUDING\DEBUG\ARRAYSTUDING.PDB
