^C:\UE_PROJECTS\LESSON01_11_03\HELLOWORLD\HELLOWORLD.CPP
C:\UE_PROJECTS\LESSON01_11_03\HELLOWORLD\DEBUG\VC142.PDB
C:\UE_PROJECTS\LESSON01_11_03\HELLOWORLD\DEBUG\VC142.IDB
C:\UE_PROJECTS\LESSON01_11_03\HELLOWORLD\DEBUG\HELLOWORLD.OBJ
