{
  "main.css": "/static/css/main.fbddc6bf.chunk.css",
  "main.js": "/static/js/main.2ba8aafa.chunk.js",
  "main.js.map": "/static/js/main.2ba8aafa.chunk.js.map",
  "runtime~main.js": "/static/js/runtime~main.a8a9905a.js",
  "runtime~main.js.map": "/static/js/runtime~main.a8a9905a.js.map",
  "static/js/2.496284c1.chunk.js": "/static/js/2.496284c1.chunk.js",
  "static/js/2.496284c1.chunk.js.map": "/static/js/2.496284c1.chunk.js.map",
  "index.html": "/index.html",
  "precache-manifest.a12525a27c8fc4dd7083c7026583524f.js": "/precache-manifest.a12525a27c8fc4dd7083c7026583524f.js",
  "service-worker.js": "/service-worker.js",
  "static/css/main.fbddc6bf.chunk.css.map": "/static/css/main.fbddc6bf.chunk.css.map"
}