Division,WeightClassKg,Place,Name,Team,BodyweightKg,Best3SquatKg,Best3BenchKg,Best3DeadliftKg,TotalKg,Equipment,Event,Sex
Boys,51.71,1,Israel Soto,Midland Greenwood,50.89,127.01,70.31,154.22,351.53,Single-ply,SBD,M
Boys,51.71,2,Jordan Garcia,Slaton,47.45,102.06,52.16,127.01,281.23,Single-ply,SBD,M
Boys,59.87,1,Seth Barton,Midland Greenwood,59.69,167.83,108.86,181.44,458.13,Single-ply,SBD,M
Boys,59.87,2,Luke Krueger,Snyder,59.87,190.51,70.31,181.44,442.25,Single-ply,SBD,M
Boys,59.87,3,Santos Yanez,Slaton,57.79,136.08,70.31,147.42,353.8,Single-ply,SBD,M
Boys,59.87,4,Jake Robertson,Hermleigh,58.42,83.91,65.77,108.86,258.55,Single-ply,SBD,M
Boys,67.13,1,Tait Fullwood,Roscoe Collegiate,65.86,158.76,83.91,165.56,408.23,Single-ply,SBD,M
Boys,67.13,2,Jonathan Alvarez,Odessa Permian,64.86,142.88,102.06,158.76,403.7,Single-ply,SBD,M
Boys,67.13,3,Ali Mata,Snyder,64.86,129.27,86.18,174.63,390.09,Single-ply,SBD,M
Boys,67.13,4,Bo Franklin,Plains,63.59,113.4,72.57,138.35,324.32,Single-ply,SBD,M
Boys,67.13,5,Cameron Clement,Hermleigh,62.32,120.2,65.77,129.27,315.25,Single-ply,SBD,M
Boys,67.13,6,Austin Groeschel,Midland Greenwood,65.59,115.67,61.23,111.13,288.03,Single-ply,SBD,M
Boys,67.13,DQ,Victor Lujan,Plains,62.78,,,,,Single-ply,SBD,M
Boys,74.84,1,Abel Burciaga,Denver City,67.86,172.37,131.54,185.97,489.88,Single-ply,SBD,M
Boys,74.84,2,Taylor Hobbs,Denver City,74.12,174.63,102.06,192.78,469.47,Single-ply,SBD,M
Boys,74.84,3,Elliott Hilliard,Odessa,74.84,174.63,92.99,190.51,458.13,Single-ply,SBD,M
Boys,74.84,4,Steven Anna,Plains,72.85,161.03,111.13,183.7,455.86,Single-ply,SBD,M
Boys,74.84,5,Ivan Valverde,Denver City,74.57,170.1,99.79,170.1,439.98,Single-ply,SBD,M
Boys,74.84,6,Francisco Garcia,Roscoe Collegiate,74.84,183.7,102.06,151.95,437.72,Single-ply,SBD,M
Boys,74.84,7,Ramiro Pina,Midland Greenwood,70.03,167.83,86.18,165.56,419.57,Single-ply,SBD,M
Boys,74.84,8,Colton Messick,Hermleigh,70.67,147.42,79.38,149.69,376.48,Single-ply,SBD,M
Boys,74.84,9,Hunter Graves,Post,74.3,142.88,79.38,151.95,374.21,Single-ply,SBD,M
Boys,74.84,10,Christian Lachance,Odessa Permian,70.4,136.08,90.72,136.08,362.87,Single-ply,SBD,M
Boys,74.84,11,Brett Brunson,Snyder,73.03,136.08,92.99,124.74,353.8,Single-ply,SBD,M
Boys,74.84,12,Ezequiel Garcia,Odessa,71.03,115.67,79.38,156.49,351.53,Single-ply,SBD,M
Boys,74.84,13,Coltin Watts,Roscoe Collegiate,71.49,113.4,77.11,145.15,335.66,Single-ply,SBD,M
Boys,74.84,14,Michael Cobb,Hermleigh,74.12,124.74,68.04,136.08,328.85,Single-ply,SBD,M
Boys,74.84,DQ,Javier Davila,Denver City,73.21,,,,,Single-ply,SBD,M
Boys,74.84,DQ,Josh Morris #2,Post,68.86,,,,,Single-ply,SBD,M
Boys,82.1,1,Braden Latham,Midland Greenwood,81.65,197.31,129.27,188.24,514.83,Single-ply,SBD,M
Boys,82.1,2,Braden Rader,Midland Greenwood,80.38,190.51,106.59,188.24,485.34,Single-ply,SBD,M
Boys,82.1,3,Larry Steger,Odessa,80.01,174.63,115.67,183.7,474,Single-ply,SBD,M
Boys,82.1,4,Jj Burns,Snyder,78.2,188.24,79.38,185.97,453.59,Single-ply,SBD,M
Boys,82.1,5,Aaron Mendoza,Denver City,77.11,136.08,83.91,188.24,408.23,Single-ply,SBD,M
Boys,82.1,6,Levi Garland,Roby,77.75,158.76,70.31,172.37,401.43,Single-ply,SBD,M
Boys,82.1,7,Shawn Howell,Roby,80.1,172.37,72.57,154.22,399.16,Single-ply,SBD,M
Boys,82.1,8,Tucker Barton,Hermleigh,76.57,149.69,81.65,156.49,387.82,Single-ply,SBD,M
Boys,82.1,9,Adrian Lomas,Roscoe Collegiate,78.38,138.35,83.91,149.69,371.95,Single-ply,SBD,M
Boys,82.1,10,Luis Aguirre,Denver City,81.37,111.13,92.99,140.61,344.73,Single-ply,SBD,M
Boys,82.1,11,Saige Rodriguez,Slaton,80.38,129.27,68.04,124.74,322.05,Single-ply,SBD,M
Boys,89.81,1,Dalton Richardson,Midland Greenwood,87.36,233.6,111.13,226.8,571.53,Single-ply,SBD,M
Boys,89.81,2,Jacob Munoz,Odessa,85.73,190.51,106.59,233.6,530.7,Single-ply,SBD,M
Boys,89.81,3,Christian Bell,Midland Greenwood,87,151.95,97.52,151.95,401.43,Single-ply,SBD,M
Boys,89.81,4,Alexis Mendoza,Denver City,83.82,120.2,92.99,170.1,383.29,Single-ply,SBD,M
Boys,89.81,5,Damian Pena,Denver City,86.18,136.08,77.11,165.56,378.75,Single-ply,SBD,M
Boys,89.81,6,Parker Payne,Roscoe Collegiate,85.91,120.2,83.91,158.76,362.87,Single-ply,SBD,M
Boys,89.81,7,Caden Cornutt,Hermleigh,88.36,120.2,102.06,136.08,358.34,Single-ply,SBD,M
Boys,99.79,1,Valente Perez,Post,97.98,219.99,120.2,219.99,560.19,Single-ply,SBD,M
Boys,99.79,2,Jessy Villagomez,Roby,97.43,219.99,117.93,217.72,555.65,Single-ply,SBD,M
Boys,99.79,3,Christian Alvarez,Odessa,98.79,183.7,133.81,192.78,510.29,Single-ply,SBD,M
Boys,99.79,4,Adam Velasco,Denver City,92.71,181.44,127.01,181.44,489.88,Single-ply,SBD,M
Boys,99.79,5,Alex Jaimes,Snyder,97.52,206.38,102.06,165.56,474,Single-ply,SBD,M
Boys,99.79,6,Khaled Abu-Alghanam,Odessa Permian,94.17,190.51,106.59,170.1,467.2,Single-ply,SBD,M
Boys,99.79,7,Brison Smith,Odessa,94.17,156.49,127.01,176.9,460.4,Single-ply,SBD,M
Boys,99.79,8,Mark Prieto,Odessa Permian,98.97,172.37,120.2,165.56,458.13,Single-ply,SBD,M
Boys,99.79,9,Jerry Vasquez,Midland Greenwood,97.16,172.37,106.59,147.42,426.38,Single-ply,SBD,M
Boys,99.79,10,Austrin Lara,Roscoe Collegiate,91.26,158.76,95.25,142.88,396.89,Single-ply,SBD,M
Boys,99.79,11,Jonathan Hollis,Midland Greenwood,93.17,156.49,97.52,136.08,390.09,Single-ply,SBD,M
Boys,99.79,12,Zach Harty,Hermleigh,97.61,124.74,70.31,158.76,353.8,Single-ply,SBD,M
Boys,109.77,1,Alexis Gonzalez,Denver City,104.24,226.8,158.76,215.46,601.01,Single-ply,SBD,M
Boys,109.77,2,O'Ryan Farley,Odessa Permian,107.23,229.06,131.54,231.33,591.94,Single-ply,SBD,M
Boys,109.77,3,Matt Buckley,Roscoe Collegiate,107.68,226.8,127.01,204.12,557.92,Single-ply,SBD,M
Boys,109.77,4,Nathan Sanchez #2,Odessa,103.15,192.78,106.59,204.12,503.49,Single-ply,SBD,M
Boys,109.77,5,Jacob Wilkerson,Odessa Permian,102.69,197.31,136.08,149.69,483.08,Single-ply,SBD,M
Boys,109.77,6,Chase Carr,Hermleigh,108.86,181.44,92.99,192.78,467.2,Single-ply,SBD,M
Boys,109.77,7,Caleb O'Neal,Odessa Permian,102.15,158.76,113.4,183.7,455.86,Single-ply,SBD,M
Boys,109.77,8,Tracker Dugan,Hermleigh,105.23,158.76,72.57,174.63,405.97,Single-ply,SBD,M
Boys,109.77,9,George Harris,Odessa,104.05,151.95,92.99,154.22,399.16,Single-ply,SBD,M
Boys,124.74,1,Justin Trawick,Colorado City Colorado,121.93,238.14,124.74,226.8,589.67,Single-ply,SBD,M
Boys,124.74,2,Bailey Perez,Odessa,112.49,201.85,120.2,217.72,539.77,Single-ply,SBD,M
Boys,124.74,3,Orlando Bueno,Odessa Permian,124.28,226.8,113.4,181.44,521.63,Single-ply,SBD,M
Boys,124.74,4,Alex Lozano,Denver City,112.13,190.51,129.27,192.78,512.56,Single-ply,SBD,M
Boys,124.74,5,Jarod Rose,Midland Greenwood,120.38,201.85,117.93,181.44,501.22,Single-ply,SBD,M
Boys,124.74,6,Mario Luna,Post,119.93,222.26,92.99,172.37,487.61,Single-ply,SBD,M
Boys,124.74,7,Bryson White,Odessa Permian,113.4,183.7,111.13,170.1,464.93,Single-ply,SBD,M
Boys,124.74,8,Paul Freeman,Odessa Permian,121.29,154.22,115.67,163.29,433.18,Single-ply,SBD,M
Boys,124.74,9,John Garcia,Hermleigh,115.76,131.54,97.52,149.69,378.75,Single-ply,SBD,M
Boys,124.74+,1,Sean Humphrey,Snyder,129.27,294.84,154.22,215.46,664.51,Single-ply,SBD,M
Boys,124.74+,2,Alek Garcia,Slaton,173.45,294.84,113.4,235.87,644.1,Single-ply,SBD,M
Boys,124.74+,3,Kobe Fahntrapp,Snyder,130.18,238.14,151.95,185.97,576.06,Single-ply,SBD,M
Boys,124.74+,4,Pablo Olivares,Odessa Permian,135.81,249.48,113.4,208.65,571.53,Single-ply,SBD,M
Boys,124.74+,5,Dawson Reynolds,Odessa Permian,138.89,217.72,129.27,190.51,537.51,Single-ply,SBD,M
Boys,124.74+,6,Josh Salas,Slaton,142.79,213.19,102.06,185.97,501.22,Single-ply,SBD,M
Boys,124.74+,7,Brandon Jones,Odessa,157.85,183.7,115.67,170.1,469.47,Single-ply,SBD,M
Boys,124.74+,8,Victor Soto,Slaton,152.13,172.37,102.06,174.63,449.06,Single-ply,SBD,M
