Division,WeightClassKg,Place,Name,Team,BodyweightKg,Best3SquatKg,Best3BenchKg,Best3DeadliftKg,TotalKg,Equipment,Event,Sex
Boys,51.71,1,Jose Mancia,Greenville,47.17,92.99,52.16,115.67,260.82,Single-ply,SBD,M
Boys,51.71,2,Pablo Gutierrez,Mount Pleasant,47.63,88.45,49.9,113.4,251.74,Single-ply,SBD,M
Boys,55.79,1,Miguel Hernandez,Emory Rains,55.79,165.56,99.79,165.56,430.91,Single-ply,SBD,M
Boys,59.87,2,Jonathan Alvarez,Sulphur Springs,56.02,149.69,65.77,154.22,369.68,Single-ply,SBD,M
Boys,55.79,3,Josh Bolton,Paris North Lamar,54.88,142.88,72.57,142.88,358.34,Single-ply,SBD,M
Boys,55.79,4,Juan Ottino,Mount Pleasant,54.88,120.2,70.31,122.47,312.98,Single-ply,SBD,M
Boys,55.79,5,Wade Simpson,Maud,55.34,122.47,52.16,113.4,288.03,Single-ply,SBD,M
Boys,55.79,6,Chase McCleskey,Paris North Lamar,53.98,108.86,56.7,108.86,274.42,Single-ply,SBD,M
Boys,55.79,7,Zach Grabanski,Pattonville Prairiland,54.2,97.52,61.23,108.86,267.62,Single-ply,SBD,M
Boys,55.79,8,Dustin Crabtree,Sulphur Springs,53.3,106.59,43.09,106.59,256.28,Single-ply,SBD,M
Boys,55.79,9,De'Quenek Shepard,Mount Vernon,55.79,63.5,56.7,106.59,226.8,Single-ply,SBD,M
Boys,59.87,1,Kyler Cooper,Texarkana Pleasant Grove,59.87,136.08,83.91,142.88,362.87,Single-ply,SBD,M
Boys,59.87,2,Noah Craver,Mount Vernon,59.87,115.67,83.91,142.88,342.46,Single-ply,SBD,M
Boys,59.87,3,Jackson Kennedy,Texarkana Pleasant Grove,59.42,113.4,90.72,136.08,340.19,Single-ply,SBD,M
Boys,59.87,4,Tavon Gray,Paris,59.42,106.59,79.38,136.08,322.05,Single-ply,SBD,M
Boys,67.13,5,Scott Dudley,Paris,60.1,124.74,70.31,122.47,317.51,Single-ply,SBD,M
Boys,67.13,6,Brody Evans,Paris North Lamar,60.1,120.2,65.77,129.27,315.25,Single-ply,SBD,M
Boys,59.87,7,Jesus Perez,Mount Pleasant,58.97,113.4,68.04,122.47,303.91,Single-ply,SBD,M
Boys,59.87,8,DeAndre Daniel,Daingerfield,57.61,113.4,68.04,113.4,294.84,Single-ply,SBD,M
Boys,59.87,9,James Kirkman,Mount Vernon,57.83,104.33,65.77,120.2,290.3,Single-ply,SBD,M
Boys,59.87,10,Jonathan Palacios,Mount Pleasant,58.97,90.72,58.97,113.4,263.08,Single-ply,SBD,M
Boys,67.13,1,Matthew Solomon,Texarkana Liberty-Eylau,66.22,190.51,117.93,190.51,498.95,Single-ply,SBD,M
Boys,67.13,2,X-Zavius Gray,Paris,67.13,181.44,104.33,181.44,467.2,Single-ply,SBD,M
Boys,67.13,3,Rajuan Crabtree,Texarkana Liberty-Eylau,62.6,165.56,106.59,181.44,453.59,Single-ply,SBD,M
Boys,67.13,4,Dylan Gibson,Maud,61.69,185.97,83.91,170.1,439.98,Single-ply,SBD,M
Boys,67.13,5,Jared Scott #2,Texarkana Pleasant Grove,66.22,174.63,83.91,174.63,433.18,Single-ply,SBD,M
Boys,67.13,6,Taylor Ibarra,Sulphur Springs,61.92,165.56,92.99,161.03,419.57,Single-ply,SBD,M
Boys,67.13,7,Ethan Wagner,Texarkana Pleasant Grove,62.6,142.88,90.72,176.9,410.5,Single-ply,SBD,M
Boys,67.13,8,Cody Bargerhuff,Greenville,65.54,165.56,86.18,158.76,410.5,Single-ply,SBD,M
Boys,67.13,9,Vincent Morales,Sulphur Springs,66.45,145.15,65.77,172.37,383.29,Single-ply,SBD,M
Boys,67.13,10,Sergio Camacho,Emory Rains,63.5,138.35,81.65,161.03,381.02,Single-ply,SBD,M
Boys,67.13,11,Kearrius Ladell,Paris,64.64,149.69,70.31,158.76,378.75,Single-ply,SBD,M
Boys,67.13,12,Coy Larey,Bogata Rivercrest,64.64,122.47,79.38,163.29,365.14,Single-ply,SBD,M
Boys,74.84,13,Elijah Robinson,Pattonville Prairiland,67.36,129.27,81.65,142.88,353.8,Single-ply,SBD,M
Boys,67.13,14,Jeremiah Guenther,Paris North Lamar,65.09,129.27,68.04,147.42,344.73,Single-ply,SBD,M
Boys,67.13,15,Javier Macias,Mount Pleasant,61.23,113.4,70.31,151.95,335.66,Single-ply,SBD,M
Boys,67.13,16,Chase Newman,Linden-Kildare,65.77,117.93,83.91,124.74,326.59,Single-ply,SBD,M
Boys,67.13,17,Cor'tavius Pruitt,Sulphur Springs,63.73,111.13,77.11,131.54,319.78,Single-ply,SBD,M
Boys,67.13,18,Cameron Woods,Mount Vernon,63.5,106.59,58.97,124.74,290.3,Single-ply,SBD,M
Boys,67.13,19,Mason Huddleston,Mount Vernon,60.78,95.25,61.23,127.01,283.5,Single-ply,SBD,M
Boys,67.13,20,Matthew Rethman,Paris North Lamar,64.86,72.57,52.16,95.25,219.99,Single-ply,SBD,M
Boys,74.84,DQ,Anthony Nava,Daingerfield,67.36,88.45,,,,Single-ply,SBD,M
Boys,67.13,DQ,Anthony Barnes,Texarkana Texas,65.09,136.08,,,,Single-ply,SBD,M
Boys,67.13,DQ,Scott Galarza,Sulphur Springs,64.41,149.69,,,,Single-ply,SBD,M
Boys,67.13,DQ,Wesley Culbertson,Paris North Lamar,61.69,,,,,Single-ply,SBD,M
Boys,74.84,1,Matt Hahn,Texarkana Pleasant Grove,70.76,172.37,115.67,226.8,514.83,Single-ply,SBD,M
Boys,74.84,2,J'Kardi Witcher,Texarkana Texas,69.17,185.97,102.06,195.04,483.08,Single-ply,SBD,M
Boys,74.84,3,Joshua Martinez,Mount Pleasant,68.04,154.22,127.01,181.44,462.66,Single-ply,SBD,M
Boys,74.84,4,Jeremy Glenn,Greenville,73.94,185.97,92.99,165.56,444.52,Single-ply,SBD,M
Boys,74.84,5,Lamont Byrd,Texarkana Liberty-Eylau,72.57,161.03,97.52,181.44,439.98,Single-ply,SBD,M
Boys,74.84,6,Naim Diego,Emory Rains,69.85,158.76,83.91,185.97,428.64,Single-ply,SBD,M
Boys,74.84,7,Bradley Brown,Canton,74.39,145.15,90.72,183.7,419.57,Single-ply,SBD,M
Boys,74.84,8,Eric Pheng,Paris North Lamar,73.94,149.69,83.91,163.29,396.89,Single-ply,SBD,M
Boys,74.84,9,Tydarius Brannon,Daingerfield,72.35,151.95,92.99,142.88,387.82,Single-ply,SBD,M
Boys,74.84,10,Dustin Coleman,Ore City,71.67,142.88,83.91,151.95,378.75,Single-ply,SBD,M
Boys,74.84,11,Dakota Patterson,Maud,74.39,142.88,81.65,151.95,376.48,Single-ply,SBD,M
Boys,74.84,12,Cameron Greenburg,Mount Vernon,70.99,138.35,81.65,151.95,371.95,Single-ply,SBD,M
Boys,74.84,13,Devin Burns,Texarkana Pleasant Grove,72.57,131.54,97.52,142.88,371.95,Single-ply,SBD,M
Boys,74.84,14,Morgan Landreth,Pattonville Prairiland,73.71,151.95,77.11,142.88,371.95,Single-ply,SBD,M
Boys,74.84,15,Mason Chrisman,Paris North Lamar,70.53,127.01,81.65,156.49,365.14,Single-ply,SBD,M
Boys,74.84,16,John Haller,Mount Vernon,72.12,136.08,70.31,156.49,362.87,Single-ply,SBD,M
Boys,74.84,17,Jaxon Herron,Paris North Lamar,69.85,136.08,77.11,147.42,360.61,Single-ply,SBD,M
Boys,74.84,18,Thurman Morbley,Texarkana Liberty-Eylau,72.12,124.74,92.99,142.88,360.61,Single-ply,SBD,M
Boys,74.84,19,Michael Broyles,Canton,72.57,156.49,68.04,136.08,360.61,Single-ply,SBD,M
Boys,74.84,20,Tyler Hague,Canton,70.76,136.08,79.38,142.88,358.34,Single-ply,SBD,M
Boys,74.84,21,Mason Spangler,Paris North Lamar,68.27,136.08,68.04,142.88,347,Single-ply,SBD,M
Boys,74.84,22,Jose Mendez,Daingerfield,70.99,122.47,72.57,133.81,328.85,Single-ply,SBD,M
Boys,74.84,23,Jeremy Lambert,Canton,71.67,117.93,54.43,129.27,301.64,Single-ply,SBD,M
Boys,74.84,DQ,Mark Cornish,Mount Pleasant,69.4,154.22,,,,Single-ply,SBD,M
Boys,74.84,DQ,Zakk Haupert,Pattonville Prairiland,69.85,142.88,,,,Single-ply,SBD,M
Boys,82.1,1,Zanoah Arnold,Texarkana Liberty-Eylau,78.93,195.04,117.93,208.65,521.63,Single-ply,SBD,M
Boys,82.1,2,Logan Thompson,Canton,80.74,190.51,136.08,195.04,521.63,Single-ply,SBD,M
Boys,82.1,3,Mitchell Butler,Texarkana Texas,79.38,183.7,120.2,199.58,503.49,Single-ply,SBD,M
Boys,82.1,4,Chase Perry,Paris North Lamar,77.56,185.97,122.47,192.78,501.22,Single-ply,SBD,M
Boys,82.1,5,Patrick Hoffman,Mount Vernon,81.19,176.9,111.13,174.63,462.66,Single-ply,SBD,M
Boys,82.1,6,Guillermo Vasquez,Greenville,82.1,192.78,97.52,170.1,460.4,Single-ply,SBD,M
Boys,82.1,7,Jairus Aguilar,Emory Rains,82.1,183.7,83.91,179.17,446.79,Single-ply,SBD,M
Boys,82.1,8,Brandon Alverez,Bogata Rivercrest,80.74,179.17,97.52,149.69,426.38,Single-ply,SBD,M
Boys,82.1,9,Julian Watkins,Texarkana Texas,80.97,158.76,108.86,158.76,426.38,Single-ply,SBD,M
Boys,82.1,10,Josue Pena,Greenville,79.15,172.37,83.91,165.56,421.84,Single-ply,SBD,M
Boys,82.1,11,Dakota Hembree,Paris North Lamar,76.66,170.1,90.72,154.22,415.04,Single-ply,SBD,M
Boys,82.1,12,Cory Wiodarczak,Paris North Lamar,82.1,151.95,86.18,167.83,405.97,Single-ply,SBD,M
Boys,82.1,13,Tyron Evans,Texarkana Texas,77.11,149.69,99.79,147.42,396.89,Single-ply,SBD,M
Boys,82.1,14,Darron Styles,Maud,76.2,154.22,86.18,140.61,381.02,Single-ply,SBD,M
Boys,82.1,15,Skylar Justice,Paris North Lamar,76.66,154.22,79.38,147.42,381.02,Single-ply,SBD,M
Boys,89.81,16,Cody Godwin,Emory Rains,82.33,136.08,74.84,136.08,347,Single-ply,SBD,M
Boys,82.1,17,Lane Martin,Mount Pleasant,81.87,106.59,79.38,95.25,281.23,Single-ply,SBD,M
Boys,89.81,1,Crandal Hale,Greenville,88,238.14,131.54,215.46,585.13,Single-ply,SBD,M
Boys,89.81,2,Armando Cortes,Emory Rains,89.36,210.92,120.2,195.04,526.17,Single-ply,SBD,M
Boys,89.81,3,Ke'Mon Freeman,Texarkana Liberty-Eylau,86.64,181.44,117.93,183.7,483.08,Single-ply,SBD,M
Boys,89.81,4,Tommy Ingram,Greenville,88.45,188.24,104.33,176.9,469.47,Single-ply,SBD,M
Boys,89.81,5,Fernando Ramirez,Linden-Kildare,87.09,165.56,92.99,190.51,449.06,Single-ply,SBD,M
Boys,89.81,6,Sam Arneson,Sulphur Springs,89.36,156.49,108.86,181.44,446.79,Single-ply,SBD,M
Boys,89.81,7,Coltin Morrison,Sulphur Springs,84.82,165.56,111.13,165.56,442.25,Single-ply,SBD,M
Boys,89.81,8,Isaiah Neal,Sulphur Springs,83.23,172.37,92.99,174.63,439.98,Single-ply,SBD,M
Boys,89.81,9,Jacobe Ellis,Texarkana Texas,83.69,154.22,104.33,147.42,405.97,Single-ply,SBD,M
Boys,89.81,10,D'Wayne Coleman,Texarkana Liberty-Eylau,88.45,156.49,88.45,158.76,403.7,Single-ply,SBD,M
Boys,89.81,11,Caleb Handova,Ore City,86.64,113.4,77.11,149.69,340.19,Single-ply,SBD,M
Boys,89.81,12,Darron Mitchell,Paris,84.37,102.06,56.7,131.54,290.3,Single-ply,SBD,M
Boys,89.81,DQ,Nicky Goen,Ore City,85.28,140.61,,,,Single-ply,SBD,M
Boys,89.81,DQ,Andrew Turner,Mount Pleasant,83.46,,,,,Single-ply,SBD,M
Boys,99.79,1,Zack McGuire,Ore City,98.88,233.6,142.88,226.8,603.28,Single-ply,SBD,M
Boys,99.79,2,Austin Cooper,Greenville,99.11,238.14,136.08,219.99,594.21,Single-ply,SBD,M
Boys,99.79,3,Kerrian Goree,Greenville,97.07,233.6,145.15,208.65,587.4,Single-ply,SBD,M
Boys,99.79,4,Eli Britt,Emory Rains,92.99,244.94,117.93,208.65,571.53,Single-ply,SBD,M
Boys,99.79,5,Alex Gamez,Sulphur Springs,94.8,226.8,115.67,208.65,551.11,Single-ply,SBD,M
Boys,99.79,6,Kendall Alexander,Paris,95.48,210.92,124.74,206.38,542.04,Single-ply,SBD,M
Boys,99.79,7,Grayson Burns,Emory Rains,94.8,210.92,104.33,192.78,508.02,Single-ply,SBD,M
Boys,99.79,8,Joseph Snodgrass,Texarkana Pleasant Grove,96.62,195.04,117.93,176.9,489.88,Single-ply,SBD,M
Boys,99.79,9,Casey Harper,Paris North Lamar,93.44,170.1,136.08,154.22,460.4,Single-ply,SBD,M
Boys,99.79,10,Austin Rider,Greenville,97.52,174.63,104.33,179.17,458.13,Single-ply,SBD,M
Boys,99.79,11,Chris Davis,Maud,91.63,172.37,99.79,174.63,446.79,Single-ply,SBD,M
Boys,99.79,12,Darius Samuel,Paris,93.89,151.95,104.33,163.29,419.57,Single-ply,SBD,M
Boys,99.79,13,Tyreese Williams,Sulphur Springs,97.52,158.76,88.45,154.22,401.43,Single-ply,SBD,M
Boys,99.79,14,Ian Throckmorton,Ore City,93.44,142.88,90.72,158.76,392.36,Single-ply,SBD,M
Boys,99.79,15,Devante Johnson,Daingerfield,90.72,136.08,88.45,149.69,374.21,Single-ply,SBD,M
Boys,99.79,16,Tyran Benton,Texarkana Liberty-Eylau,91.63,120.2,83.91,154.22,358.34,Single-ply,SBD,M
Boys,99.79,17,Dalton Morgan,Daingerfield,96.39,136.08,83.91,136.08,356.07,Single-ply,SBD,M
Boys,99.79,18,Barnabas Hughes,Mount Vernon,95.93,113.4,74.84,136.08,324.32,Single-ply,SBD,M
Boys,99.79,19,Josh Coleman,Ore City,91.63,127.01,61.23,113.4,301.64,Single-ply,SBD,M
Boys,99.79,DQ,Jason White,Emory Rains,98.88,183.7,90.72,,,Single-ply,SBD,M
Boys,109.77,1,James Medley,Canton,105.23,226.8,136.08,197.31,560.19,Single-ply,SBD,M
Boys,109.77,2,Jack White,Paris North Lamar,103.87,226.8,131.54,197.31,555.65,Single-ply,SBD,M
Boys,109.77,3,Dennis Coleman,Paris,108.18,204.12,124.74,226.8,555.65,Single-ply,SBD,M
Boys,124.74,4,James Murphy,Texarkana Texas,110,204.12,131.54,181.44,517.1,Single-ply,SBD,M
Boys,109.77,5,Brandon Halliday,Paris North Lamar,103.87,199.58,115.67,192.78,508.02,Single-ply,SBD,M
Boys,124.74,6,Austin Decker,Mount Vernon,110,183.7,117.93,201.85,503.49,Single-ply,SBD,M
Boys,109.77,7,Ian Blanch,Sulphur Springs,104.33,208.65,104.33,176.9,489.88,Single-ply,SBD,M
Boys,109.77,8,Riley Russell,Bogata Rivercrest,104.78,183.7,133.81,167.83,485.34,Single-ply,SBD,M
Boys,109.77,9,Nathan Simmons,New Boston,101.6,199.58,106.59,167.83,474,Single-ply,SBD,M
Boys,109.77,10,Brandon Foster,Sulphur Springs,102.51,179.17,122.47,165.56,467.2,Single-ply,SBD,M
Boys,109.77,11,James Berry,Maud,105.69,161.03,104.33,154.22,419.57,Single-ply,SBD,M
Boys,109.77,12,Cheyanne Lockhart,Texarkana Liberty-Eylau,108.41,142.88,90.72,183.7,417.3,Single-ply,SBD,M
Boys,109.77,13,Zach Wrinkle,Texarkana Pleasant Grove,106.82,149.69,90.72,167.83,408.23,Single-ply,SBD,M
Boys,109.77,14,De'Waven Rowden,Texarkana Liberty-Eylau,102.06,138.35,92.99,170.1,401.43,Single-ply,SBD,M
Boys,109.77,15,Alex Sultz,Maud,104.78,181.44,74.84,142.88,399.16,Single-ply,SBD,M
Boys,109.77,16,Ryan Forbes,Texarkana Pleasant Grove,105.91,142.88,95.25,154.22,392.36,Single-ply,SBD,M
Boys,109.77,17,Colton Chamberlain,Paris North Lamar,107.5,145.15,83.91,149.69,378.75,Single-ply,SBD,M
Boys,109.77,18,Seth Shaffer,Ore City,100.7,122.47,68.04,147.42,337.93,Single-ply,SBD,M
Boys,109.77,19,Jorge Gutierrez,Mount Vernon,109.77,136.08,77.11,124.74,337.93,Single-ply,SBD,M
Boys,109.77,20,Kyle Carmichael,Ore City,105.23,131.54,83.91,113.4,328.85,Single-ply,SBD,M
Boys,124.74,1,Will Brown,Texarkana Texas,120.43,215.46,140.61,222.26,578.33,Single-ply,SBD,M
Boys,124.74,2,Matthew Davis,Texarkana Texas,124.74,215.46,124.74,204.12,544.31,Single-ply,SBD,M
Boys,124.74,3,Trey Potter,Ore City,112.04,215.46,127.01,192.78,535.24,Single-ply,SBD,M
Boys,124.74,4,Nick Runnels,Texarkana Texas,115.44,204.12,117.93,192.78,514.83,Single-ply,SBD,M
Boys,124.74,5,Ernesto Lopez,Greenville,117.93,215.46,115.67,174.63,505.76,Single-ply,SBD,M
Boys,124.74,6,Dakota Helm,Paris,116.12,181.44,111.13,208.65,501.22,Single-ply,SBD,M
Boys,124.74,7,Brady Watson,Mount Vernon,124.51,192.78,120.2,183.7,496.68,Single-ply,SBD,M
Boys,124.74,8,Frank Smith #3,Texarkana Liberty-Eylau,123.38,192.78,111.13,183.7,487.61,Single-ply,SBD,M
Boys,124.74,9,Ryder Bryant,Paris North Lamar,115.89,158.76,111.13,183.7,453.59,Single-ply,SBD,M
Boys,124.74,10,Quincy Spells,Texarkana Pleasant Grove,117.03,165.56,108.86,149.69,424.11,Single-ply,SBD,M
Boys,124.74,11,Nate Doss,Mount Pleasant,119.29,192.78,97.52,124.74,415.04,Single-ply,SBD,M
Boys,124.74,12,Logan DeGarso,Greenville,120.88,174.63,92.99,145.15,412.77,Single-ply,SBD,M
Boys,124.74,13,Ben Grisson,Mount Pleasant,123.83,147.42,83.91,136.08,367.41,Single-ply,SBD,M
Boys,124.74,14,Dj Carroll,Daingerfield,111.81,136.08,68.04,147.42,351.53,Single-ply,SBD,M
Boys,124.74,15,James Gray,Daingerfield,115.44,117.93,90.72,136.08,344.73,Single-ply,SBD,M
Boys,124.74,16,Camron Barnon,Daingerfield,116.12,113.4,81.65,136.08,331.12,Single-ply,SBD,M
Boys,124.74,DQ,Dre'Shawn Williams,Linden-Kildare,112.49,102.06,68.04,,,Single-ply,SBD,M
Boys,124.74,DQ,Israel Moreno,Sulphur Springs,111.13,,117.93,,,Single-ply,SBD,M
Boys,124.74,DQ,Mack Boyd,New Boston,119.75,204.12,,,,Single-ply,SBD,M
Boys,124.74,DQ,Byron Muse,Paris,119.98,183.7,122.47,,,Single-ply,SBD,M
Boys,124.74+,1,Will Wright,Mount Pleasant,158.76,249.48,158.76,213.19,621.42,Single-ply,SBD,M
Boys,124.74+,2,Keenan Ivory,Canton,147.64,265.35,117.93,222.26,605.55,Single-ply,SBD,M
Boys,124.74+,3,Zack Watson,Ore City,154.22,272.16,122.47,204.12,598.74,Single-ply,SBD,M
Boys,124.74+,4,Qurdale Huff,Paris,167.83,231.33,142.88,219.99,594.21,Single-ply,SBD,M
Boys,124.74+,5,Bailey Booker,Bogata Rivercrest,156.49,235.87,149.69,183.7,569.26,Single-ply,SBD,M
Boys,124.74+,6,Jalen Brown,Mount Pleasant,142.88,147.42,142.88,185.97,476.27,Single-ply,SBD,M
Boys,124.74+,7,Thomas Spann,Mount Pleasant,136.08,188.24,120.2,165.56,474,Single-ply,SBD,M
Boys,124.74+,8,Treaen Dores,New Boston,136.08,158.76,106.59,156.49,421.84,Single-ply,SBD,M
Boys,124.74+,9,Norris English,Sulphur Springs,135.17,163.29,88.45,147.42,399.16,Single-ply,SBD,M
Boys,124.74+,10,Nick Gavriel,Texarkana Pleasant Grove,128.14,136.08,97.52,151.95,385.55,Single-ply,SBD,M
Boys,124.74+,11,Victor Sanchez,New Boston,131.54,136.08,83.91,142.88,362.87,Single-ply,SBD,M
Boys,124.74+,DQ,Armando Molina,Mount Pleasant,125.65,151.95,,,,Single-ply,SBD,M
