Sex,WeightClassKg,Division,Name,BodyweightKg,Squat1Kg,Squat2Kg,Squat3Kg,Best3SquatKg,Bench1Kg,Bench2Kg,Bench3Kg,Best3BenchKg,Deadlift1Kg,Deadlift2Kg,Deadlift3Kg,Best3DeadliftKg,TotalKg,Place,Event,Equipment
M,59,Sub-Junior,Davide Cappa,57.21,120,130.5,138,138,85,95,101,101,140,150,162.5,162.5,401.5,1,SBD,Raw
M,59,Sub-Junior,Edoardo Crippa,58.06,110,117.5,125,125,67.5,75,82.5,82.5,155,162.5,165,165,372.5,2,SBD,Raw
M,59,Sub-Junior,Lorenzo Rizzo,58.22,95,102.5,-107.5,102.5,65,-72.5,72.5,72.5,135,142.5,152.5,152.5,327.5,3,SBD,Raw
M,66,Sub-Junior,Riccardo Stefanelli,63.65,-105,110,-120,110,75,80,-90,80,137.5,145,-150,145,335,1,SBD,Raw
M,74,Sub-Junior,Arturo Busetto,72.57,160,170,-177.5,170,110,116,121,121,175,185,200,200,491,1,SBD,Raw
M,74,Sub-Junior,Manuel Filios,67.07,105,115,-125,115,-75,-75,75,75,115,125,130,130,320,2,SBD,Raw
M,83,Sub-Junior,Umberto Moffa,82.21,160,167.5,-172.5,167.5,100,110.5,-122.5,110.5,180,190,200,200,478,1,SBD,Raw
M,83,Sub-Junior,Piersilvio Falcone,80.99,150,160,170,170,85,92.5,-100,92.5,175,-190,190,190,452.5,2,SBD,Raw
M,83,Sub-Junior,Loris Cropo,79.55,132.5,147.5,160,160,92.5,100,-105,100,150,165,180,180,440,3,SBD,Raw
M,83,Sub-Junior,Leonardo Corrieri,79.34,130,135,-142.5,135,80,85,90,90,145,152.5,157.5,157.5,382.5,4,SBD,Raw
M,93,Sub-Junior,Matteo Masciarelli,84.14,-205,217.5,-227.5,217.5,125,132.5,140,140,240,257.5,-275,257.5,615,1,SBD,Raw
M,105,Sub-Junior,Jacopo Greco,102.97,220,235,250,250,122.5,132.5,-137.5,132.5,227.5,240,260,260,642.5,1,SBD,Raw
M,120,Sub-Junior,Nicolas Palmiotti,108.09,140,150,157.5,157.5,85,90,95,95,175,190,208,208,460.5,1,SBD,Raw
M,59,Junior,Stefano Bonura,57.66,115,127.5,137.5,137.5,85,92.5,-95,92.5,142.5,-155,170,170,400,1,SBD,Raw
M,59,Junior,Giosuè Filippini,57.62,132.5,137.5,-140,137.5,82.5,87.5,-90,87.5,-172.5,172.5,-182.5,172.5,397.5,2,SBD,Raw
M,59,Junior,Izmir Teku,58.37,130,137.5,140,140,87.5,95,-97.5,95,147.5,160,-165,160,395,3,SBD,Raw
M,59,Junior,Dario Burruni,57.35,125,130,-132.5,130,90,95,-97.5,95,155,165,-175,165,390,4,SBD,Raw
M,59,Junior,Francesco Pierbattisti,58.49,115,-117.5,120,120,85,90,92.5,92.5,157.5,165,170,170,382.5,5,SBD,Raw
M,59,Junior,Mattia Zamichele,56.13,115,122.5,127.5,127.5,92.5,97.5,-100,97.5,130,-140,150,150,375,6,SBD,Raw
M,66,Junior,Andrea Castello,64.52,175,185,-192.5,185,110,117.5,-120,117.5,207.5,217.5,-225,217.5,520,1,SBD,Raw
M,66,Junior,Federico Murru,64.24,170,180.5,190,190,130.5,137.5,142.5,142.5,-175,182.5,-190,182.5,515,2,SBD,Raw
M,66,Junior,Stefano Riva,64.02,-160,160,170,170,90,95,-100,95,170,180,197.5,197.5,462.5,3,SBD,Raw
M,66,Junior,Francesco Vighi,64.34,150,160,-162.5,160,100,107.5,112.5,112.5,170,180,190,190,462.5,4,SBD,Raw
M,66,Junior,Lorenzo Botteghelli,64.94,150,160,-170,160,100,110,-112.5,110,160,170,175,175,445,5,SBD,Raw
M,66,Junior,Filippo Repetti,65.42,140,150,-160,150,90,95,-97.5,95,160,170,180,180,425,6,SBD,Raw
M,66,Junior,Nicolas Cioffi,64.96,135,142.5,-145,142.5,100,-107.5,-107.5,100,170,180,-192.5,180,422.5,7,SBD,Raw
M,66,Junior,Riccardo Compagni,64.43,125,135,142.5,142.5,87.5,-92.5,-92.5,87.5,-155,165,-172.5,165,395,8,SBD,Raw
M,66,Junior,Mirko Bergamini,65.04,-135,135,-147.5,135,115,120,-125,120,125,135,,135,390,9,SBD,Raw
M,74,Junior,Andrea Pes,71.81,175,205,233,233,165,175,-180,175,235,242.5,-246,242.5,650.5,1,SBD,Raw
M,74,Junior,Marco Poda,72.37,180,-187.5,187.5,187.5,125,127.5,130,130,220,-227.5,-227.5,220,537.5,2,SBD,Raw
M,74,Junior,Alessandro Raccagno,72.98,175,185,190,190,105,110,115,115,210,220,-235,220,525,3,SBD,Raw
M,74,Junior,Graziano Valentini,71.4,150,-160,165,165,130,135,-137.5,135,180,-195,-195,180,480,4,SBD,Raw
M,74,Junior,Valerio Gelfo,72.97,170,-180,180,180,-115,117.5,-125,117.5,160,175,-190,175,472.5,5,SBD,Raw
M,74,Junior,Mattia Coltella,73.6,160,167.5,-175,167.5,90,92.5,-95,92.5,200,212.5,-222.5,212.5,472.5,6,SBD,Raw
M,74,Junior,Alessandro Di Cianni,70.75,150,160,170,170,92.5,100,-105,100,185,200,-210,200,470,7,SBD,Raw
M,74,Junior,Gabriele Giannelli,73.98,160,172.5,180,180,80,87.5,-90,87.5,200,-212.5,-212.5,200,467.5,8,SBD,Raw
M,74,Junior,Alfonso Capolupo,72.78,155,167.5,-172.5,167.5,95,102.5,107.5,107.5,170,182.5,187.5,187.5,462.5,9,SBD,Raw
M,74,Junior,Andrea Caruso,71.1,142.5,-152.5,157.5,157.5,90,97.5,-102.5,97.5,180,192.5,197.5,197.5,452.5,10,SBD,Raw
M,74,Junior,Simone Lazzaroni,71.6,140,150,157.5,157.5,92.5,97.5,-102.5,97.5,170,185,-200,185,440,11,SBD,Raw
M,74,Junior,Ruggero Visentin,69.49,140,150,155,155,100,105,110,110,150,160,170,170,435,12,SBD,Raw
M,74,Junior,Ennio Nano,69.46,115,122.5,127.5,127.5,95,102.5,107.5,107.5,155,165,172.5,172.5,407.5,13,SBD,Raw
M,83,Junior,Enrico Scarcia,80.98,200,210,220,220,132.5,-137.5,-137.5,132.5,270,280.5,-300,280.5,633,1,SBD,Raw
M,83,Junior,Ion Trofim,80.29,195,205,212.5,212.5,-142.5,150,-157.5,150,252.5,267.5,-272.5,267.5,630,2,SBD,Raw
M,83,Junior,Francesco Cosseddu,82.7,205,220,227.5,227.5,135,145,150,150,250,-262.5,-262.5,250,627.5,3,SBD,Raw
M,83,Junior,Giuseppe Borriello,79.15,215,225,236.5,236.5,-150,-150,155,155,220,230,-240,230,621.5,4,SBD,Raw
M,83,Junior,Antonio Gorga,80.36,200,205,215,215,140,145,150,150,220,232.5,240,240,605,5,SBD,Raw
M,83,Junior,Tommaso Pratesi,81.73,170,182.5,190,190,140,145,-150,145,210,222.5,230,230,565,6,SBD,Raw
M,83,Junior,Andrea Bogoni,79.28,170,182.5,192.5,192.5,125,130,-132.5,130,210,222.5,-232.5,222.5,545,7,SBD,Raw
M,83,Junior,David Carer,78.48,-192.5,200,-207.5,200,122.5,130,132.5,132.5,197.5,205,-210,205,537.5,8,SBD,Raw
M,83,Junior,Giulio Panzeri,81.61,165,180,187.5,187.5,-110,-115,115,115,200,215,225,225,527.5,9,SBD,Raw
M,83,Junior,Alberto Visconti,74.26,170,185,-192.5,185,-92.5,95,100,100,-200,225,240,240,525,10,SBD,Raw
M,83,Junior,Andrea Antonio Mollicone,82.43,-175,180,187.5,187.5,100,105,-107.5,105,215,230,-240,230,522.5,11,SBD,Raw
M,83,Junior,Luigi Sabetta,76.43,160,170,175,175,127.5,137.5,142.5,142.5,185,195,-200,195,512.5,12,SBD,Raw
M,83,Junior,Matteo Todeschini,78.51,165,175,182.5,182.5,90,97.5,105,105,185,200,220,220,507.5,13,SBD,Raw
M,83,Junior,Anthony Focarile,78.44,160,170,-180,170,110,117.5,120,120,200,210,-212.5,210,500,14,SBD,Raw
M,83,Junior,Lorenzo Colombo,80.38,155,165,-170,165,105,-110,-110,105,180,200,-215,200,470,15,SBD,Raw
M,83,Junior,Andrea Bonazza,74.89,-140,150,160,160,90,100,-110,100,180,195,-200,195,455,16,SBD,Raw
M,83,Junior,Simone Carotenuto,79.87,140,150,160,160,90,95,100,100,180,-195,195,195,455,17,SBD,Raw
M,83,Junior,Matteo Ferro,81.41,135,145,152.5,152.5,80,-85,-85,80,162.5,172.5,-177.5,172.5,405,18,SBD,Raw
M,83,Junior,Iacopo Buzzolani,74.9,105,117.5,127.5,127.5,90,-100,102.5,102.5,150,165,-182.5,165,395,19,SBD,Raw
M,83,Junior,Luca Garbarino,79.12,125,135,142.5,142.5,77.5,-85,-90,77.5,160,167.5,170,170,390,20,SBD,Raw
M,83,Junior,Andrea Pesce,81.47,200,-202.5,,200,,,,,,,,,,DQ,SBD,Raw
M,93,Junior,Marco Bitti,90.27,190,205,215,215,170,180,187.5,187.5,235,242.5,252.5,252.5,655,1,SBD,Raw
M,93,Junior,Alessio Erba,91.22,215,225,230,230,-115,115,-120,115,250,260,-267.5,260,605,2,SBD,Raw
M,93,Junior,Andrea Angella,86.42,175,-195,200,200,132.5,137.5,-142.5,137.5,230,247.5,265,265,602.5,3,SBD,Raw
M,93,Junior,Leonardo Palmieri,87.91,210,220,-227.5,220,120,127.5,-135,127.5,235,247.5,255,255,602.5,4,SBD,Raw
M,93,Junior,Gianmarco Corrà,92.08,200,212.5,225,225,115,122.5,130,130,215,230,-252.5,230,585,5,SBD,Raw
M,93,Junior,Michele Piazza,91.71,170,180,190,190,120,127.5,135,135,215,225,230,230,555,6,SBD,Raw
M,93,Junior,Jacopo Cavanna,89.29,170,180,190,190,140,147.5,152.5,152.5,195,210,-220,210,552.5,7,SBD,Raw
M,93,Junior,Domenico Azzollini,91.11,215,-225,-225,215,105,110,115,115,190,205,-210,205,535,8,SBD,Raw
M,93,Junior,Francesco Ginesi,85.98,175,190,-200,190,90,95,100,100,210,225,235,235,525,9,SBD,Raw
M,93,Junior,Luca Negroni,90.65,160,170,180,180,105,112.5,117.5,117.5,200,225,-240,225,522.5,10,SBD,Raw
M,93,Junior,Massimo Mariani,84.97,170,180,185,185,115,-120,-120,115,200,210,220,220,520,11,SBD,Raw
M,93,Junior,Omar Albertin,88.31,180,190,200,200,110,-117.5,-117.5,110,210,-225,-225,210,520,12,SBD,Raw
M,93,Junior,Giacomo Brondi,90.4,152.5,165,175,175,105,110,115,115,175,187.5,200,200,490,13,SBD,Raw
M,93,Junior,Marco Bissolati,86.48,140,155,-170,155,90,95,-100,95,190,205,210,210,460,14,SBD,Raw
M,93,Junior,Alberto Govi,89.55,140,145,150,150,115,120,-122.5,120,180,190,-195,190,460,15,SBD,Raw
M,93,Junior,Simone Carpinelli,89.98,140,150,-160,150,110,-117.5,117.5,117.5,-180,180,-190,180,447.5,16,SBD,Raw
M,93,Junior,Alessandro Zoppa,89.92,160,-170,170,170,-115,-115,-115,,,,,,,DQ,SBD,Raw
M,105,Junior,Antonio Pio Gervasi,98.88,245,255,261,261,-145,145,152.5,152.5,270,285,-300,285,698.5,1,SBD,Raw
M,105,Junior,Davide Lovison,102.41,185,205,220,220,155,165,-170.5,165,267.5,285,300,300,685,2,SBD,Raw
M,105,Junior,Lorenzo Cerveri,99.31,195,210,215,215,145,155,-157.5,155,230,252.5,-255,252.5,622.5,3,SBD,Raw
M,105,Junior,Gabriele Lodolo,101.61,205,212.5,217.5,217.5,130,140,-142.5,140,-245,245,-267.5,245,602.5,4,SBD,Raw
M,105,Junior,Andrea Missaggia,103.7,205,-220,225,225,145,-155,-155,145,200,215,-220,215,585,5,SBD,Raw
M,105,Junior,Andrea Della Tomasa,100.95,-185,192.5,200,200,115,122.5,127.5,127.5,225,245,-257.5,245,572.5,6,SBD,Raw
M,105,Junior,Nikolas Kazantzis,102.55,190,-200,210,210,120,125,132.5,132.5,190,200,212.5,212.5,555,7,SBD,Raw
M,105,Junior,Nicola Pilia,103.09,190,200,210,210,125,132.5,-137.5,132.5,200,212.5,-220,212.5,555,8,SBD,Raw
M,105,Junior,Andrea Alborghetti,96.42,172.5,182.5,190,190,120,127.5,132.5,132.5,200,215,225,225,547.5,9,SBD,Raw
M,105,Junior,Simone Mancini,93.87,-180,-195,195,195,100,-110,-110,100,190,202.5,215,215,510,10,SBD,Raw
M,105,Junior,Max Moduszewski,103.24,220,230,235,235,-150,-150,-150,,,,,,,DQ,SBD,Raw
M,120,Junior,Gianluca Galletto,110.04,210,220,225,225,160,165,-170.5,165,250,265.5,278.5,278.5,668.5,1,SBD,Raw
M,120,Junior,Mattia Cravedi,118.54,217.5,230,236,236,142.5,150,155,155,230,250,277.5,277.5,668.5,2,SBD,Raw
M,120,Junior,Federico Costantini,108.18,205,215,225,225,122.5,130,135,135,210,230,-240,230,590,3,SBD,Raw
M,120,Junior,Giuseppe Gargiulo,115.16,185,195,205,205,112.5,117.5,120,120,215,230,240,240,565,4,SBD,Raw
M,120,Junior,Andrea Boschetto,105.56,-207.5,-217.5,-217.5,,,,,,,,,,,DQ,SBD,Raw
M,120,Junior,Denis Selita,116.58,210,-220,-220,210,-155,-155,-155,,,,,,,DQ,SBD,Raw
M,120+,Junior,Riccardo Venturi,143.91,160,170,-180,170,130,140,150,150,185,200,-210,200,520,1,SBD,Raw
M,59,Open,Moris Redini,57.75,161.5,171,-180,171,110,117.5,-121,117.5,187.5,197.5,208,208,496.5,1,SBD,Raw
M,59,Open,Marco Baglio,58.65,140,152.5,-157.5,152.5,75,82.5,87.5,87.5,190,198,-208.5,198,438,2,SBD,Raw
M,59,Open,Petero Vinetti,52.3,77.5,85,97.5,97.5,50,57.5,-62.5,57.5,110,120,130,130,285,3,SBD,Raw
M,66,Open,Andrea Zaino,64.6,170,180,187.5,187.5,120,127.5,132.5,132.5,220,230,237.5,237.5,557.5,1,SBD,Raw
M,66,Open,Salvatore Pisasale,65.09,200,210,-220,210,137.5,-143,-145,137.5,200,210,-220,210,557.5,2,SBD,Raw
M,66,Open,Luca Orrù,64.13,172.5,185,-190,185,97.5,102.5,105,105,200,220,-232.5,220,510,3,SBD,Raw
M,66,Open,Dennis Milello,64.95,162.5,-172.5,175,175,120,125,-130,125,210,-220,-222.5,210,510,4,SBD,Raw
M,66,Open,Nicola Signani,65.75,-150,160,-170,160,130,-135,135,135,205,215,-222.5,215,510,5,SBD,Raw
M,66,Open,Alessio Loni,65.08,180,192.5,-197.5,192.5,105,-112.5,-112.5,105,190,200,-215,200,497.5,6,SBD,Raw
M,66,Open,Vincenzo Boccaccio,64.68,-175,185,-192.5,185,90,92.5,-105,92.5,-210,210,-215,210,487.5,7,SBD,Raw
M,66,Open,Angelo Schembri,65.08,150,-160,165,165,110,120,-125,120,-190,200,-210,200,485,8,SBD,Raw
M,66,Open,Andrea Guerreschi,62.34,150,160,170,170,95,100,105,105,200,-215,-215,200,475,9,SBD,Raw
M,66,Open,Nima Shahrestani,64.24,140,150,157.5,157.5,110,-117.5,-117.5,110,160,175,-185,175,442.5,10,SBD,Raw
M,66,Open,Davide Milan,64.32,130,-140,145,145,95,100,-105,100,175,190,-200,190,435,11,SBD,Raw
M,66,Open,Fabio Ferrarese,65.47,-115,-115,115,115,-82.5,82.5,-90,82.5,145,-152.5,152.5,152.5,350,12,SBD,Raw
M,66,Open,Dario Frighieri,65.96,-90,90,105,105,65,72.5,80,80,120,135,145,145,330,13,SBD,Raw
M,74,Open,Riccardo Marchi,71.33,200,210,-217.5,210,130,137.5,140,140,230,245,-255,245,595,1,SBD,Raw
M,74,Open,Antimo Cembalo,73.77,190,200,-207.5,200,125,130,132.5,132.5,230,250,-263,250,582.5,2,SBD,Raw
M,74,Open,Federico Martella,71.85,192.5,200,210,210,125,135,-140,135,210,-230,235,235,580,3,SBD,Raw
M,74,Open,Michele Rancini,73.79,190,200,207.5,207.5,105,112.5,-115,112.5,240,260,-276,260,580,4,SBD,Raw
M,74,Open,Enrico Martis,71.72,175,190,197.5,197.5,115,-122.5,-125,115,220,240,250,250,562.5,5,SBD,Raw
M,74,Open,Claudio Forti,72.54,190,197.5,-202.5,197.5,115,-120,,115,237.5,245,-252.5,245,557.5,6,SBD,Raw
M,74,Open,Giacomo Rocco,72.56,175,185,192.5,192.5,125,130,-132.5,130,210,220,-225,220,542.5,7,SBD,Raw
M,74,Open,Nicolò Cracco,72.81,-155,-165,175,175,127.5,135,142.5,142.5,200,215,-230,215,532.5,8,SBD,Raw
M,74,Open,Andrea Di Matteo,71.83,160,170,180,180,-125,127.5,135,135,185,200,215,215,530,9,SBD,Raw
M,74,Open,Luca Laurenzano,72.61,160,170,175,175,127.5,-135,135,135,205,215,220,220,530,10,SBD,Raw
M,74,Open,Jacopo Fantuzzi,72.64,180,190,195,195,110,117.5,125,125,185,200,210,210,530,11,SBD,Raw
M,74,Open,Thomas Gambella,72.12,175,185,-192.5,185,115,125,-127.5,125,180,192.5,200,200,510,12,SBD,Raw
M,74,Open,Raffaele Alfiero,73.11,167.5,177.5,-190,177.5,102.5,-112.5,-115,102.5,190,207.5,225,225,505,13,SBD,Raw
M,74,Open,Ivan Vaiani,71.66,180,192.5,-202.5,192.5,105,-110,-110,105,200,-220,-220,200,497.5,14,SBD,Raw
M,74,Open,Gianmarco Luciano,73.11,165,175,-182.5,175,105,-112.5,112.5,112.5,200,210,-225,210,497.5,15,SBD,Raw
M,74,Open,Fabio Falzoi,73.15,160,170,-175,170,115,120,-122.5,120,190,202.5,-210,202.5,492.5,16,SBD,Raw
M,74,Open,Bruno Raffa,73.43,-160,160,-170,160,107.5,112.5,117.5,117.5,200,212.5,-222.5,212.5,490,17,SBD,Raw
M,74,Open,Nico Carrara,71.98,155,160,167.5,167.5,100,-102.5,-102.5,100,220,-225,-225,220,487.5,18,SBD,Raw
M,74,Open,Michele Guerra,71.8,160,-170,-172.5,160,105,112.5,-117.5,112.5,200,210,-217.5,210,482.5,19,SBD,Raw
M,74,Open,Roberto Franco Penuti,72.29,155,162.5,165,165,105,110,112.5,112.5,180,192.5,205,205,482.5,20,SBD,Raw
M,74,Open,Leonardo Pinsone,72.81,152.5,162.5,167.5,167.5,107.5,112.5,-117.5,112.5,190,202.5,-210,202.5,482.5,21,SBD,Raw
M,74,Open,Mattia Passerini,69.58,145,155,165,165,-95,105,-112.5,105,170,190,205,205,475,22,SBD,Raw
M,74,Open,Vlad Secara,71.48,147.5,157.5,165,165,100,107.5,-115,107.5,180,192.5,200,200,472.5,23,SBD,Raw
M,74,Open,Andrea Manca,73.35,145,155,165,165,115,120,-122.5,120,160,175,187.5,187.5,472.5,24,SBD,Raw
M,74,Open,Alex Caselli,70.29,160,170,-180,170,85,-95,-95,85,200,-215,215,215,470,25,SBD,Raw
M,74,Open,Ignazio Semproni,69.48,140,147.5,-152.5,147.5,-105,105,-110,105,165,177.5,190,190,442.5,26,SBD,Raw
M,74,Open,Jennys Chiuchiolo,72.3,140,-150,-150,140,-100,107.5,-110,107.5,170,182.5,-195,182.5,430,27,SBD,Raw
M,74,Open,Alessandro Cuttini,67.45,122.5,130,137.5,137.5,85,-90,-90,85,175,190,-200,190,412.5,28,SBD,Raw
M,74,Open,Alessandro Berte,69.35,117.5,125,-130,125,70,75,-80,75,150,160,165,165,365,29,SBD,Raw
M,74,Open,Massimo De Giudici,72.21,120,-127.5,-127.5,120,90,95,100,100,140,145,-150,145,365,30,SBD,Raw
M,83,Open,Giuseppe Manca,80.14,230,245,253,253,137.5,145,150,150,252.5,262.5,270,270,673,1,SBD,Raw
M,83,Open,Andrea La Rocca,82.29,235,250,-260,250,135,142.5,147.5,147.5,250,262.5,-270,262.5,660,2,SBD,Raw
M,83,Open,George Lupas,81.3,212.5,215,217.5,217.5,137.5,-142.5,142.5,142.5,252.5,267.5,282.5,282.5,642.5,3,SBD,Raw
M,83,Open,Simone Sanasi,82.45,205,215,222.5,222.5,135,142.5,145,145,247.5,262.5,275,275,642.5,4,SBD,Raw
M,83,Open,Niccolò De Giovanni,81.95,200,210,217.5,217.5,170,180.5,-183,180.5,230,235,242.5,242.5,640.5,5,SBD,Raw
M,83,Open,Lorenzo Di Giuseppe,81.6,220,230,237.5,237.5,150,157.5,-162.5,157.5,235,245,-260,245,640,6,SBD,Raw
M,83,Open,Lorenzo Lupo,81.26,210,225,235,235,140,147.5,155,155,230,245,-252.5,245,635,7,SBD,Raw
M,83,Open,Ivan Bellesia,81.37,200,207.5,215,215,145,150,155,155,245,260,-270,260,630,8,SBD,Raw
M,83,Open,Lorenzo Sala,81.51,200,210,-220,210,150,155,157.5,157.5,240,247.5,-255,247.5,615,9,SBD,Raw
M,83,Open,Stefano Robol,81.66,212.5,222.5,230,230,125,132.5,137.5,137.5,245,-262.5,-262.5,245,612.5,10,SBD,Raw
M,83,Open,Stefano Turnone,80.71,200,210,220,220,160,-170,-170,160,230,-250,-250,230,610,11,SBD,Raw
M,83,Open,Matteo Moretto,81.52,200,212.5,220,220,150,157.5,162.5,162.5,215,-230,-230,215,597.5,12,SBD,Raw
M,83,Open,Giorgio Junior Cimarosti,79.72,180,192.5,200,200,130,137.5,142.5,142.5,235,247.5,-260,247.5,590,13,SBD,Raw
M,83,Open,Francesco Capagni,81.87,205,-212.5,212.5,212.5,135,-142.5,-142.5,135,225,240,-250,240,587.5,14,SBD,Raw
M,83,Open,Andrea Bravi,80.39,195,205,-215,205,117.5,122.5,127.5,127.5,227.5,242.5,250,250,582.5,15,SBD,Raw
M,83,Open,Umberto Fava,82.61,180,192.5,200,200,122.5,-127.5,130,130,225,237.5,-245,237.5,567.5,16,SBD,Raw
M,83,Open,Simone Panizza,81.42,175,187.5,197.5,197.5,130,-137.5,137.5,137.5,210,225,-235,225,560,17,SBD,Raw
M,83,Open,Lorenzo Mosca,81.55,190,200,-212.5,200,135,140,-145,140,200,220,-230,220,560,18,SBD,Raw
M,83,Open,Stefano Semplici,80.61,180,187.5,-192.5,187.5,115,122.5,130,130,220,230,-245,230,547.5,19,SBD,Raw
M,83,Open,Simone Rizzardelli,81.9,187.5,200,-205,200,112.5,117.5,122.5,122.5,205,217.5,225,225,547.5,20,SBD,Raw
M,83,Open,Jonathan Caroni,81.85,152.5,162.5,175,175,110,117.5,120,120,220,240,250,250,545,21,SBD,Raw
M,83,Open,Matteo Breccia,81.22,180,190,-200,190,105,115,-125,115,210,225,235,235,540,22,SBD,Raw
M,83,Open,Alberto Bocchese,81.41,155,165,175,175,130,137.5,145,145,200,215,220,220,540,23,SBD,Raw
M,83,Open,Dimitri De Molo,81.78,190,202.5,210,210,107.5,112.5,115,115,215,-227.5,-227.5,215,540,24,SBD,Raw
M,83,Open,Luca Merola,82.1,190,200,-205,200,110,115,-120,115,220,225,-230,225,540,25,SBD,Raw
M,83,Open,Tiziano Fendoni,79.07,195,205,-215,205,120,127.5,-132.5,127.5,205,-215,-220,205,537.5,26,SBD,Raw
M,83,Open,Tommaso Duvia,81.77,175,-182.5,185,185,145,150,157.5,157.5,175,182.5,-190,182.5,525,27,SBD,Raw
M,83,Open,Nicola Gieci,78.98,190,200,-205,200,115,120,-122.5,120,195,202.5,-207.5,202.5,522.5,28,SBD,Raw
M,83,Open,Filippo D'Albero,81.49,165,172.5,-180,172.5,112.5,120,-125,120,215,227.5,-235,227.5,520,29,SBD,Raw
M,83,Open,Carlo Mitrati,82.64,165,172.5,180,180,120,125,-132.5,125,200,-210,212.5,212.5,517.5,30,SBD,Raw
M,83,Open,Paolo Accorsi Buttini,77.11,167.5,175,182.5,182.5,110,-112.5,-112.5,110,205,217.5,-222.5,217.5,510,31,SBD,Raw
M,83,Open,Jacopo Tamborra,81.55,160,172.5,180,180,135,140,-145,140,-190,190,-205,190,510,32,SBD,Raw
M,83,Open,Federico Viganò,80.48,170,-180,180,180,112.5,117.5,-125,117.5,180,195,207.5,207.5,505,33,SBD,Raw
M,83,Open,Angelo Famà,79.44,145,155,162.5,162.5,130,137.5,-142.5,137.5,190,202.5,-210,202.5,502.5,34,SBD,Raw
M,83,Open,Pietro Selis,79.83,155,-170,-170,155,130,-137.5,-137.5,130,210,-225,-225,210,495,35,SBD,Raw
M,83,Open,Alessio Piancatelli,79.11,150,160,175,175,105,115,-120,115,190,-200,200,200,490,36,SBD,Raw
M,83,Open,Jan Fertonani,81.13,155,167.5,-175,167.5,110,117.5,122.5,122.5,190,200,-215,200,490,37,SBD,Raw
M,83,Open,Ruben Dell'Ara,77.53,140,150,-165,150,-122.5,127.5,-130,127.5,-205,210,-225,210,487.5,38,SBD,Raw
M,83,Open,Matteo Londei,79.66,150,155,160,160,102.5,107.5,110,110,197.5,215,-220,215,485,39,SBD,Raw
M,83,Open,René Bounaudo,78.65,140,150,160,160,105,112.5,-117.5,112.5,180,195,205,205,477.5,40,SBD,Raw
M,83,Open,Alessandro Di Chirico,78.82,135,145,-155,145,95,102.5,107.5,107.5,175,190,200,200,452.5,41,SBD,Raw
M,83,Open,Riccardo Grotteria,75.94,142.5,-152.5,-160,142.5,85,87.5,-90,87.5,200,212.5,220,220,450,42,SBD,Raw
M,83,Open,Alvise Morandini,75.26,135,145,155,155,92.5,100,-105,100,155,177.5,192.5,192.5,447.5,43,SBD,Raw
M,83,Open,Alessandro Elefanti,78.51,140,150,155,155,75,82.5,85,85,170,190,200,200,440,44,SBD,Raw
M,83,Open,Lorenzo Ferri,80.15,135,145,-150,145,110,115,-120,115,180,-190,-190,180,440,45,SBD,Raw
M,83,Open,Gabriele Miceli,79.43,115,125,140,140,92.5,102.5,107.5,107.5,155,177.5,-192.5,177.5,425,46,SBD,Raw
M,83,Open,Fabio Robbiano,80.94,140,152.5,-160,152.5,92.5,97.5,100,100,-160,160,-170,160,412.5,47,SBD,Raw
M,83,Open,Marco Pesci,78.26,115,120,-130,120,90,95,-100,95,150,-160,165,165,380,48,SBD,Raw
M,93,Open,Fabrizio Posca,92.17,235,252.5,260,260,165,172.5,175,175,280,300,-313,300,735,1,SBD,Raw
M,93,Open,Joris Quai,83.9,245,-255,-255,245,150,155,157.5,157.5,280,290,-300,290,692.5,2,SBD,Raw
M,93,Open,Gianluca Martino,87.15,230,242.5,245,245,150,157.5,160,160,280,-290,-290,280,685,3,SBD,Raw
M,93,Open,Simone Rubessi,91.87,215,227.5,240,240,167.5,180,188,188,220,237.5,250,250,678,4,SBD,Raw
M,93,Open,Simone Vito Belsanti,87.35,-220,220,235,235,140,150,155,155,240,255,-265,255,645,5,SBD,Raw
M,93,Open,Andrea Cavicchioli,90.68,210,217.5,230,230,132.5,140,145,145,240,-270,270,270,645,6,SBD,Raw
M,93,Open,Riccardo Zanti,91.89,220,235,-245,235,140,150,-155,150,235,250,-270,250,635,7,SBD,Raw
M,93,Open,Davide Bartolone,91.59,200,210,220,220,150,-160,-160,150,240,250,-260,250,620,8,SBD,Raw
M,93,Open,Davide Balconi,91.28,200,215,-222.5,215,127.5,135,-137.5,135,240,252.5,260,260,610,9,SBD,Raw
M,93,Open,Simone Calabretto,91.59,-215,220,230,230,135,140,-147.5,140,215,230,240,240,610,10,SBD,Raw
M,93,Open,Walter Foglia,91.33,170,,,170,175,182.5,-188,182.5,220,250,-257.5,250,602.5,11,SBD,Raw
M,93,Open,Mattia Sileno,92.27,200,210,220,220,130,137.5,-140,137.5,215,227.5,240,240,597.5,12,SBD,Raw
M,93,Open,Cristiano Zanotelli,89.79,200,210,-215,210,145,-152.5,-152.5,145,-240,-240,240,240,595,13,SBD,Raw
M,93,Open,Silvio Davi Colaci,85.54,-195,-195,195,195,137.5,142.5,145,145,220,230,240,240,580,14,SBD,Raw
M,93,Open,Andrea Giuliani,88.93,177.5,187.5,200,200,122.5,130,-137.5,130,215,230,245,245,575,15,SBD,Raw
M,93,Open,Gianluca D'Antonio,90.33,200,210,217.5,217.5,125,130,-132.5,130,207.5,-217.5,225,225,572.5,16,SBD,Raw
M,93,Open,Daniele Della Rasa,90.22,200,-210,215,215,110,120,-125,120,205,215,230,230,565,17,SBD,Raw
M,93,Open,Matteo Merlo,87.27,-200,200,-215,200,-140,-140,140,140,200,210,220,220,560,18,SBD,Raw
M,93,Open,Ivan Re,87.97,170,180,190,190,122.5,130,137.5,137.5,210,-220,227.5,227.5,555,19,SBD,Raw
M,93,Open,Antonio Coppedè,91.22,200,210,-225,210,110,120,-127.5,120,200,210,220,220,550,20,SBD,Raw
M,93,Open,Carlo Alberto Bonomelli,91.86,185,195,200,200,125,-130,-130,125,212.5,222.5,-230,222.5,547.5,21,SBD,Raw
M,93,Open,Riccardo Focchiatti,84.44,200,-210,-210,200,-127.5,127.5,132.5,132.5,205,-212.5,212.5,212.5,545,22,SBD,Raw
M,93,Open,Giorgio Pierotti,89,165,175,185,185,147.5,155,-157.5,155,175,190,200,200,540,23,SBD,Raw
M,93,Open,Davide Fornasari,90.58,-170,180,-190,180,105,112.5,120,120,-210,220,240,240,540,24,SBD,Raw
M,93,Open,Paolo Maria Romano,92.94,190,200,-202.5,200,-150,150,-155,150,180,190,-200,190,540,25,SBD,Raw
M,93,Open,Angelo Velardi,86.31,205,-215,-222.5,205,100,110,120,120,200,212.5,-222.5,212.5,537.5,26,SBD,Raw
M,93,Open,Costantino DiPaolonicola,91.47,-175,185,-195,185,125,132.5,-137.5,132.5,202.5,212.5,-217.5,212.5,530,27,SBD,Raw
M,93,Open,Alessandro Marseglia,91.66,160,167.5,170,170,127.5,132.5,135,135,200,220,-230,220,525,28,SBD,Raw
M,93,Open,Simone Aversa,91.13,190,200,-210,200,105,112.5,-120,112.5,205,-210,210,210,522.5,29,SBD,Raw
M,93,Open,Mirko Artosi,91.65,175,185,-200,185,112.5,117.5,-122.5,117.5,190,205,217.5,217.5,520,30,SBD,Raw
M,93,Open,Matteo Calabrese,83.8,-175,-182.5,182.5,182.5,105,110,115,115,200,212.5,-220,212.5,510,31,SBD,Raw
M,93,Open,Francesco Bottarelli,85.9,-150,162.5,170,170,110,117.5,122.5,122.5,190,205,215,215,507.5,32,SBD,Raw
M,93,Open,Giordano Vecchi,89.52,180,195,-200,195,110,-115,-115,110,200,-210,,200,505,33,SBD,Raw
M,93,Open,Bruno Benassi,90.78,160,170,180,180,110,117.5,-125,117.5,185,-200,200,200,497.5,34,SBD,Raw
M,93,Open,Andrea Castaldo,89.38,157.5,167.5,172.5,172.5,115,120,-127.5,120,185,195,200,200,492.5,35,SBD,Raw
M,93,Open,Salvatore Magra,84.61,145,155,-162.5,155,100,110,115,115,185,200,-215,200,470,36,SBD,Raw
M,93,Open,Franco Linardi,87.97,140,150,-160,150,115,-122.5,-122.5,115,190,205,-215,205,470,37,SBD,Raw
M,93,Open,Luca Muzzini,88.66,-160,160,-170,160,-110,115,-117.5,115,160,175,190,190,465,38,SBD,Raw
M,93,Open,Mariano Acanfora,88.95,110,117.5,125,125,85,92.5,-97.5,92.5,160,170,180,180,397.5,39,SBD,Raw
M,93,Open,Fabio Finardi,83.4,-155,-162.5,-162.5,,,,,,,,,,,DQ,SBD,Raw
M,93,Open,Roberto Biondi,90.97,-170,-175,-175,,,,,,,,,,,DQ,SBD,Raw
M,93,Open,Michael Rubini,91.86,145,152.5,-157.5,152.5,-105,-105,-105,,,,,,,DQ,SBD,Raw
M,93,Open,Domingo Poliandri,92.57,220,230,240,240,-170,170,175,175,-260,-260,-260,,,DQ,SBD,Raw
M,93,Open,Mattia Perazzuolo,90.08,-240,,,,,,,,,,,,,DQ,SBD,Raw
M,105,Open,Valentino Durastanti,101.66,252.5,260,270,270,145,155,157.5,157.5,270,285,300,300,727.5,1,SBD,Raw
M,105,Open,Luigi Celeste,104.59,-275,275,-285,275,165,172.5,-177.5,172.5,-270,280,-285,280,727.5,2,SBD,Raw
M,105,Open,Davide Bettiol,101.75,220,-230,235,235,130,135,-137.5,135,280,-290,295,295,665,3,SBD,Raw
M,105,Open,Matteo Recchia,103.98,230,242.5,250,250,115,120,-122.5,120,265,282.5,-297.5,282.5,652.5,4,SBD,Raw
M,105,Open,Manuel Moretti,104.9,210,222.5,227.5,227.5,145,150,155,155,230,245,255,255,637.5,5,SBD,Raw
M,105,Open,Manuel Vecchiato,104.44,210,-220,220,220,175,177.5,-180,177.5,215,222.5,230,230,627.5,6,SBD,Raw
M,105,Open,Filippo Azzali,102.17,215,225,-230,225,-140,-140,140,140,230,245,-255,245,610,7,SBD,Raw
M,105,Open,Alessandro Camparsi,103.63,220,227.5,232.5,232.5,142.5,-145,145,145,215,222.5,230,230,607.5,8,SBD,Raw
M,105,Open,Giuseppe Veraldi,100.22,190,205,-210,205,175,182.5,-185,182.5,200,-210,-210,200,587.5,9,SBD,Raw
M,105,Open,Lorenzo Frustagatti,103.37,210,225,-230,225,130,-140,-140,130,230,-250,-250,230,585,10,SBD,Raw
M,105,Open,Gennaro Mazzuoccolo,102.91,190,197.5,207.5,207.5,125,130,-135,130,217.5,225,235,235,572.5,11,SBD,Raw
M,105,Open,Antonio Romano,99.42,160,170,180,180,135,140,-142.5,140,225,240,250,250,570,12,SBD,Raw
M,105,Open,Francesco Bovina,102.08,210,217.5,225,225,110,117.5,-125,117.5,210,225,-242.5,225,567.5,13,SBD,Raw
M,105,Open,Antonello Boccola,103.55,-190,195,-210,195,140,-147.5,-147.5,140,205,215,220,220,555,14,SBD,Raw
M,105,Open,Enrico Tanzi,102.77,200,-212.5,-212.5,200,130,135,137.5,137.5,200,-215,-215,200,537.5,15,SBD,Raw
M,105,Open,Luigi Raffaele,93.02,180,-190,-190,180,140,147.5,150,150,190,205,-215,205,535,16,SBD,Raw
M,105,Open,Calogero Marotta,94.76,150,165,172.5,172.5,120,122.5,-125,122.5,210,-225,225,225,520,17,SBD,Raw
M,105,Open,Alessandro Sidiropoulos,95.75,150,165,175,175,100,107.5,115,115,190,205,215,215,505,18,SBD,Raw
M,105,Open,Claudio Aversa,97.39,170,-185,-185,170,120,-130,135,135,200,-215,-215,200,505,19,SBD,Raw
M,105,Open,Matteo Della Santa,94.99,-150,155,-160,155,115,-120,120,120,200,215,220,220,495,20,SBD,Raw
M,105,Open,Luca Seardo,95.16,150,160,-165,160,110,117.5,-122.5,117.5,205,212.5,-217.5,212.5,490,21,SBD,Raw
M,105,Open,Alessandro Antonetti,101.35,152.5,-162.5,162.5,162.5,110,115,-120,115,185,195,210,210,487.5,22,SBD,Raw
M,105,Open,Stefano Campani,96.24,135,150,-167.5,150,100,110,-117.5,110,170,182.5,-192.5,182.5,442.5,23,SBD,Raw
M,105,Open,Andrea Cassani,101.19,225,-235,-235,225,135,-145,-145,135,-270,,,,,DQ,SBD,Raw
M,105,Open,Alberto Famiano,95.83,-172.5,-180,-182.5,,,,,,,,,,,DQ,SBD,Raw
M,120,Open,Corrado Siragusa,106.27,290,302.5,310,310,167.5,175,-180,175,290,-305,306,306,791,1,SBD,Raw
M,120,Open,Fabrizio Polloni,113.87,-235,245,-255,245,180,187.5,191,191,285,-301,305.5,305.5,741.5,2,SBD,Raw
M,120,Open,Marco Umberto Iannotti,115.49,245,255,-260,255,185,190.5,-192,190.5,255,265,277.5,277.5,723,3,SBD,Raw
M,120,Open,Enzo Falvo,117.34,245,-257.5,-260,245,165,170,,170,265,-270,-270,265,680,4,SBD,Raw
M,120,Open,Logrieco,109.26,200,220,230,230,135,145,-155,145,250,270,290,290,665,5,SBD,Raw
M,120,Open,Edoardo Marinucci,111.12,232.5,240,-250,240,-160,165,-170,165,240,-262.5,-262.5,240,645,6,SBD,Raw
M,120,Open,Stefano Bruno,117.54,200,220,235,235,125,-132.5,132.5,132.5,260,270,-285,270,637.5,7,SBD,Raw
M,120,Open,Ivan Latella,105.06,-235,-242.5,242.5,242.5,-125,127.5,130,130,235,255,-262.5,255,627.5,8,SBD,Raw
M,120,Open,Marco Petrin,107.4,215,235,-250,235,135,145,-150,145,235,242.5,-250,242.5,622.5,9,SBD,Raw
M,120,Open,Daniele Vasile,117.6,200,210,-220,210,170,-177.5,177.5,177.5,200,215,225,225,612.5,10,SBD,Raw
M,120,Open,Luca Crippa,105.91,170,180,190,190,127.5,132.5,140,140,200,215,225,225,555,11,SBD,Raw
M,120,Open,Stefano Fontanelli,117.69,200,-210,-210,200,-135,140,145,145,210,-220,,210,555,12,SBD,Raw
M,120,Open,Fabio Gamba,110.5,240,-247.5,-247.5,240,-160,-160,160,160,-240,,,,,DQ,SBD,Raw
M,120,Open,Fabio Giambrone,109.87,-195,215,225,225,-120,-125,-125,,,,,,,DQ,SBD,Raw
M,120+,Open,Michele Peluso,137.63,225,-240,250,250,175,182.5,190,190,250,-265,265,265,705,1,SBD,Raw
M,120+,Open,Simone Ciarla,121.81,200,220,225,225,120,130,-135,130,250,265,-281.5,265,620,2,SBD,Raw
M,120+,Open,Fabio Di Curzio,120.01,-190,197.5,-207.5,197.5,85,95,107.5,107.5,242.5,257.5,-281,257.5,562.5,3,SBD,Raw
M,120+,Open,Roberto Testa,123.57,-180,180,-192.5,180,130,-135,137.5,137.5,220,-225,-225,220,537.5,4,SBD,Raw
M,120+,Open,Roberto Garigale,122.44,175,190,-195,190,95,100,-102.5,100,200,210,-215,210,500,5,SBD,Raw
M,66,Master I,Nicola Bortone,63.9,-135,135,-141,135,90,95,-97.5,95,165,172.5,185,185,415,1,SBD,Raw
M,66,Master I,Alberto Castellucci,65.32,130,135,140.5,140.5,92.5,97.5,-100,97.5,167.5,172.5,-185,172.5,410.5,2,SBD,Raw
M,66,Master I,Stefano Costalunga,65.9,117.5,122.5,-130,122.5,80,82.5,85,85,175,-190,-205,175,382.5,3,SBD,Raw
M,74,Master I,Claudio Ravazzola,73.54,170,180,190.5,190.5,107.5,-112.5,112.5,112.5,205,215,-225,215,518,1,SBD,Raw
M,74,Master I,Cristian Cocchi,73.66,-185,185,191,191,125,128.5,-130.5,128.5,175,185,187.5,187.5,507,2,SBD,Raw
M,74,Master I,Nicola Porcu,73.5,120,140,160,160,105,-112.5,115,115,230,-250,-250,230,505,3,SBD,Raw
M,74,Master I,Danilo Rocchi,72.42,145,152.5,-157.5,152.5,100,,,100,170,,,170,422.5,4,SBD,Raw
M,83,Master I,Massimiliano Buccioni,82.9,207.5,217.5,-225,217.5,135,140,145,145,242.5,-255,-255,242.5,605,1,SBD,Raw
M,83,Master I,Michele Degiampietro,81.91,155,170,185,185,135,143.5,-145.5,143.5,200,-215,215,215,543.5,2,SBD,Raw
M,83,Master I,Antoni Mastrolorenzo,81.59,195,200,-205,200,127.5,130,-132.5,130,210,-220,-220,210,540,3,SBD,Raw
M,83,Master I,Alessandro Cuoghi,82.34,180,190,-205,190,105,115,-122.5,115,180,195,205,205,510,4,SBD,Raw
M,83,Master I,Marco Bastianelli,82.65,150,152.5,155,155,90,92.5,95,95,170,177.5,182.5,182.5,432.5,5,SBD,Raw
M,83,Master I,Rene Magagnini,81.99,-140,-140,140,140,85,-90,-90,85,170,175,182.5,182.5,407.5,6,SBD,Raw
M,83,Master I,Matteo Sandrini,81.97,155,162.5,-165,162.5,-125,-125,-125,,,,,,,DQ,SBD,Raw
M,93,Master I,Michele Lonardelli,87.31,210,222.5,-230,222.5,145,152.5,-157.5,152.5,245,255,-260,255,630,1,SBD,Raw
M,93,Master I,Rudy Agus,87.59,200,212.5,217.5,217.5,110,117.5,122.5,122.5,265,-287.5,-292.5,265,605,2,SBD,Raw
M,93,Master I,Nicola Milli,91.17,175,185,-195,185,130,-137.5,-137.5,130,245,-257.5,-257.5,245,560,3,SBD,Raw
M,93,Master I,Andrea Mondo,86.24,192.5,202.5,207.5,207.5,105,110,-112.5,110,210,220,230,230,547.5,4,SBD,Raw
M,93,Master I,Fabiano Fulvi,88.92,170,180,-185,180,125,130,-132.5,130,210,230,-240,230,540,5,SBD,Raw
M,105,Master I,Gianluca Minghetti,96.71,-150,155,165,165,105,110,-117.5,110,225,235,247.5,247.5,522.5,1,SBD,Raw
M,105,Master I,Cristian Turco,95.52,230,240,-250.5,240,160,165,-170.5,165,-240,-250,-250,,,DQ,SBD,Raw
M,120,Master I,Mario Pinna,106,230,240,247.5,247.5,145,150,-155,150,245,255,265,265,662.5,1,SBD,Raw
M,120,Master I,Luigi Brivio,114.89,225,240,250,250,165,-171,-171,165,210,225,-240,225,640,2,SBD,Raw
M,120,Master I,Fabio Ranuccini,108.87,155,165,-175,165,120,122.5,125,125,210,220,227.5,227.5,517.5,3,SBD,Raw
M,120,Master I,Alex Aguzzoli,111.24,155,167.5,-172.5,167.5,110,120,125,125,195,210,-220,210,502.5,4,SBD,Raw
M,120+,Master I,Paolo Pupin,120.03,-125,125,145,145,85,90,92.5,92.5,185,205,-210,205,442.5,1,SBD,Raw
M,66,Master II,Luca Cenacchi,64.77,125,135,145,145,82.5,87.5,92.5,92.5,180,190,-200,190,427.5,1,SBD,Raw
M,66,Master II,Ezio Basano,62.57,-85,92.5,-102.5,92.5,55,65,-70,65,110,120,132.5,132.5,290,2,SBD,Raw
M,83,Master II,Francesco Morese,82.1,195,205,212.5,212.5,137.5,142.5,-145,142.5,235,245,-251,245,600,1,SBD,Raw
M,83,Master II,Giorgio Agostinoni,82.09,205,215,-225,215,117.5,120,-122.5,120,230,240,-251,240,575,2,SBD,Raw
M,93,Master II,Luca Mancini,90.63,140,152.5,160,160,100,105,107.5,107.5,180,197.5,-210,197.5,465,1,SBD,Raw
M,93,Master II,Alberto Dall'Aglio,90.76,152.5,160,-165,160,95,102.5,110,110,180,-195,-195,180,450,2,SBD,Raw
M,93,Master II,Danilo Ceirani,90.2,115,-125,-125,115,122.5,127.5,-130,127.5,160,170,180,180,422.5,3,SBD,Raw
M,59,Master III,Franco Giummarra,57.47,130,140,150.5,150.5,57.5,-62.5,-62.5,57.5,140,150,-155,150,358,1,SBD,Raw
M,66,Master III,Lorenzo Costa,61.23,70.5,-75,-75,70.5,70,-75,75,75,142.5,150.5,155,155,300.5,1,SBD,Raw
M,83,Master III,Carlo DeCarli,80.99,125,-136,-143.5,125,75,81,-86,81,175,182.5,188,188,394,1,SBD,Raw
M,83,Master III,Romolo Carrozzo,77.97,-127.5,135,-143,135,75,80.5,85.5,85.5,152.5,162.5,172.5,172.5,393,2,SBD,Raw
M,93,Master III,Sandro Rossi,87.66,180,195,-210.5,195,80,90,100.5,100.5,230,240,251,251,546.5,1,SBD,Raw
F,63,Sub-Junior,Giulia Zandavali,60.29,102.5,110,-115.5,110,-65,65,-70,65,120,126,-129.5,126,301,1,SBD,Raw
F,63,Sub-Junior,Elisabetta Marino,58.66,-70,72.5,-77.5,72.5,40,42.5,45,45,80,85,90,90,207.5,2,SBD,Raw
F,72,Sub-Junior,Erica Arosio,63.64,70,77.5,82.5,82.5,47.5,52.5,55,55,90,100,110,110,247.5,1,SBD,Raw
F,47,Junior,Chiara Pastorio,45.47,92.5,100,-105,100,55,-60,-60,55,102.5,-107.5,-111,102.5,257.5,1,SBD,Raw
F,47,Junior,Rosalba Di Vaia,46.66,80,85,90,90,47.5,50,52.5,52.5,105,110,-115.5,110,252.5,2,SBD,Raw
F,52,Junior,Eliana Tunno,50.91,100,107.5,-115,107.5,45,50,-52.5,50,-145,-150,150,150,307.5,1,SBD,Raw
F,52,Junior,Munira Fornaciari,50.23,102.5,-110,110,110,60,63,66,66,105,115,-132.5,115,291,2,SBD,Raw
F,52,Junior,Rosa Maria Viterbo,51.09,90,-95,-95,90,62.5,-68,-68,62.5,110,122.5,-130,122.5,275,3,SBD,Raw
F,57,Junior,Anna Manenti,56.89,92.5,100,102.5,102.5,57.5,62.5,66,66,135,143,150,150,318.5,1,SBD,Raw
F,57,Junior,Sabrina Mancini,56.14,105,-112.5,-112.5,105,62.5,65.5,68,68,125,132.5,-140,132.5,305.5,2,SBD,Raw
F,57,Junior,Silvia Naldi,54.82,105,-110,115,115,55,57.5,-62.5,57.5,120,127.5,132.5,132.5,305,3,SBD,Raw
F,57,Junior,Sofia Traversa,56.43,112.5,118,-123,118,47.5,-50,-50,47.5,120,127.5,-135,127.5,293,4,SBD,Raw
F,57,Junior,Denise Sartin,55.02,80,87.5,-90,87.5,52.5,55,-60,55,85,90,95,95,237.5,5,SBD,Raw
F,57,Junior,Francesca Kanzian,56.99,75,80,85,85,-47.5,-47.5,-47.5,,,,,,,DQ,SBD,Raw
F,63,Junior,Carola Garra,62.23,110,120,130,130,117.5,122.5,130.5,130.5,130,142.5,155,155,415.5,1,SBD,Raw
F,63,Junior,Vivian Villarboito,60.39,87.5,90,92.5,92.5,55,60,-65,60,-115,115,-120,115,267.5,2,SBD,Raw
F,63,Junior,Sara Tirraf,57.48,80,85,87.5,87.5,-50,52.5,-55,52.5,90,95,100,100,240,3,SBD,Raw
F,63,Junior,Stefanie Hernandez,61.43,80,85,-90,85,-45,-45,45,45,85,95,105,105,235,4,SBD,Raw
F,72,Junior,Francesca Parrello,70.24,120,127.5,-130,127.5,65,-70,-70,65,150,162.5,170.5,170.5,363,1,SBD,Raw
F,72,Junior,Valentina Dell'Aversana,65.44,102.5,110,-115,110,52.5,55,57.5,57.5,160,170,171,171,338.5,2,SBD,Raw
F,84,Junior,Estella Marinelli,74.2,120,128,135.5,135.5,50,55,-58,55,145,153,-158,153,343.5,1,SBD,Raw
F,84,Junior,Chiara Pelliconi,76.46,87.5,95,97.5,97.5,47.5,50,-52.5,50,110,120,130,130,277.5,2,SBD,Raw
F,84,Junior,Jamie Jenks,74.58,-125,-132.5,-137.5,,,,,,,,,,,DQ,SBD,Raw
F,47,Open,Silvia Priore,46.15,91,100,105.5,105.5,58.5,62.5,65,65,110,-120,-120,110,280.5,1,SBD,Raw
F,52,Open,Marusca Bertoli,51.43,125,130,-133,130,70,75,77.5,77.5,155,165,-170,165,372.5,1,SBD,Raw
F,52,Open,Dalida Mari,50.58,120,127.5,-132.5,127.5,73,80,-82.5,80,127.5,-132.5,-132.5,127.5,335,2,SBD,Raw
F,52,Open,Linda Signorini,50.9,105,110,115,115,65,70,-72.5,70,112.5,120,125,125,310,3,SBD,Raw
F,52,Open,Jessica Palmieri,50.96,90,95,-100,95,40,45,-47.5,45,95,102.5,-110,102.5,242.5,4,SBD,Raw
F,52,Open,Cristina De Martin,50.03,75,80,82.5,82.5,40,42.5,-45,42.5,105,110,115,115,240,5,SBD,Raw
F,52,Open,Vera Compiani,50.32,87.5,-92.5,-92.5,87.5,55,-57.5,-57.5,55,90,97.5,-102.5,97.5,240,6,SBD,Raw
F,52,Open,Erica Cremonesini,51.4,82.5,87.5,-92.5,87.5,42.5,-45,-45,42.5,85,87.5,95,95,225,7,SBD,Raw
F,57,Open,Alice Veniani,56.48,115,120,122.5,122.5,60,65,-67.5,65,145,152.5,160,160,347.5,1,SBD,Raw
F,57,Open,Silvia Prosperi,54.44,107.5,-112.5,112.5,112.5,65,67.5,70.5,70.5,125,135,145,145,328,2,SBD,Raw
F,57,Open,Cristiana Velona,54.83,110,-115,-115,110,60,65,-67.5,65,140,148,-153.5,148,323,3,SBD,Raw
F,57,Open,Nunzia Manzari,55.11,85,-92.5,-92.5,85,50,-55,-55,50,135,-137.5,-140,135,270,4,SBD,Raw
F,57,Open,Francesca Rosi,53.77,85,-90,-95,85,-50,-50,50,50,110,117.5,-125,117.5,252.5,5,SBD,Raw
F,57,Open,Ilaria Marchionne,56.46,75,-80,-80,75,50,52.5,55,55,110,-120,-120,110,240,6,SBD,Raw
F,63,Open,Eugenia Orlando,62.49,120,127.5,132.5,132.5,75,80,82.5,82.5,140,147.5,150,150,365,1,SBD,Raw
F,63,Open,Whelma Pineda,61.82,105,115,120,120,75,80,-85,80,135,145,150,150,350,2,SBD,Raw
F,63,Open,Giulia Collerone,61.76,112.5,120,-122.5,120,70,75,77.5,77.5,125,135,145,145,342.5,3,SBD,Raw
F,63,Open,Martina Zellino,62.88,120,130,-135,130,67.5,-72.5,72.5,72.5,127.5,135,140,140,342.5,4,SBD,Raw
F,63,Open,Sara Baragatti,60.66,105,112.5,117.5,117.5,52.5,55,57.5,57.5,147.5,152.5,-160,152.5,327.5,5,SBD,Raw
F,63,Open,Chiara Maria De Marco,59.43,112.5,117.5,-122.5,117.5,52.5,55,-57.5,55,135,145,-150,145,317.5,6,SBD,Raw
F,63,Open,Nicol Feltrinelli,62.97,110,117.5,-120,117.5,47.5,52.5,-55,52.5,125,135,-140,135,305,7,SBD,Raw
F,63,Open,Verdiana Mineo,60.76,105,110,-115,110,62.5,65,-67.5,65,120,-132.5,-132.5,120,295,8,SBD,Raw
F,63,Open,Nunzia Laprocina,58.35,95,102.5,-107.5,102.5,50,-57.5,-57.5,50,130,-140,-142.5,130,282.5,9,SBD,Raw
F,63,Open,Cinzia Busatto,61.82,85,90,-95,90,45,-50,50,50,120,135,142.5,142.5,282.5,10,SBD,Raw
F,63,Open,Simona D'Angelo,59.75,80,87.5,95,95,47.5,52.5,57.5,57.5,-110,-115,120,120,272.5,11,SBD,Raw
F,63,Open,Sara Pontrelli,61.61,95,102.5,-110,102.5,40,45,-50,45,120,125,-132.5,125,272.5,12,SBD,Raw
F,63,Open,Eleonora Palmerini,62.56,95,100,-110,100,50,55,-57.5,55,-105,112.5,117.5,117.5,272.5,13,SBD,Raw
F,63,Open,Federica Santimaria,60.3,85,90,95,95,50,52.5,55,55,100,105,110,110,260,14,SBD,Raw
F,63,Open,Pierina Maria Castagnetti,60.74,-67.5,70,80,80,45,50,-55,50,105,115,120,120,250,15,SBD,Raw
F,63,Open,Natasha Vollero,61.01,-70,70,-80,70,50,-52.5,-52.5,50,75,80,-85,80,200,16,SBD,Raw
F,63,Open,Alice Cappello,62.69,-130,-130,-130,,,,,,,,,,,DQ,SBD,Raw
F,72,Open,Soledad Campostrini,68.04,130,137.5,-142.5,137.5,97.5,106,-110,106,145,155,165,165,408.5,1,SBD,Raw
F,72,Open,Luisa Torrisi,69.86,-130,137.5,-140,137.5,-72.5,72.5,-75,72.5,120,125,130,130,340,2,SBD,Raw
F,72,Open,Lorena Gambaretto,67.67,-102.5,102.5,110,110,57.5,60,-62.5,60,-140,150,-170,150,320,3,SBD,Raw
F,72,Open,Claudia Devall,65.35,-95,100,-105,100,57.5,62.5,-65,62.5,110,117.5,125,125,287.5,4,SBD,Raw
F,72,Open,Julia Crispino,68.07,95,-102.5,102.5,102.5,52.5,55,-57.5,55,100,107.5,112.5,112.5,270,5,SBD,Raw
F,72,Open,Alessia Magri,66.9,100,-105,-107.5,100,50,-55,-55,50,90,100,105,105,255,6,SBD,Raw
F,84,Open,Valentina Barbieri,79.65,175,180,185,185,85,88,90.5,90.5,180,190,-200,190,465.5,1,SBD,Raw
F,84,Open,Lucia Rivetti,74.18,120,132.5,140,140,60,65,-67.5,65,150,160,172.5,172.5,377.5,2,SBD,Raw
F,84,Open,Elisa Bellini,78.65,120,127.5,135,135,85.5,90,95,95,120,135,147.5,147.5,377.5,3,SBD,Raw
F,84,Open,Silvia Gobbi,76.07,-115,115,122.5,122.5,72.5,-75,75,75,135,140,-147.5,140,337.5,4,SBD,Raw
F,84,Open,Cristina Balduzi,72.83,110,120,125,125,67.5,72.5,-77.5,72.5,135,-145,-145,135,332.5,5,SBD,Raw
F,84,Open,Barbara Pezzangora,73.75,105,110,115,115,55,-60,-60,55,125,130,-135,130,300,6,SBD,Raw
F,84+,Open,Tamara Marabini,111.94,-110,-110,110,110,70,75.5,80,80,130,140,150,150,340,1,SBD,Raw
F,84+,Open,Antonella De Mattia,93.75,-120,120,130,130,50,55,57.5,57.5,130,137.5,150,150,337.5,2,SBD,Raw
F,84+,Open,Gabriella Pereyra,92.41,70,80,-90,80,42.5,47.5,-52.5,47.5,110,122.5,130,130,257.5,3,SBD,Raw
F,47,Master I,Elena Borgatti,45.43,80,82.5,95,95,47.5,-52.5,-52.5,47.5,110,115,117.5,117.5,260,1,SBD,Raw
F,52,Master I,Sonia Parlanti,50.18,80,-85,85,85,45,47.5,50,50,107.5,112.5,115,115,250,1,SBD,Raw
F,52,Master I,Anna Stenghel,50.44,85,-90,-90,85,60,62,-64,62,90,100,-105,100,247,2,SBD,Raw
F,57,Master I,Roberta Monaco,53.47,102.5,107.5,112.5,112.5,60,62.5,65,65,125,135,145.5,145.5,323,1,SBD,Raw
F,57,Master I,Anna Antonia Papapicco,53.48,90,100,-110,100,55,57.5,-60,57.5,130,137.5,145,145,302.5,2,SBD,Raw
F,57,Master I,Emanuela Arcari,54.76,87.5,-92.5,-92.5,87.5,-45,-45,-45,,,,,,,DQ,SBD,Raw
F,63,Master I,Raffaella Cachia,62.27,105,-110,112.5,112.5,57.5,-60,-60,57.5,127.5,135,-140,135,305,1,SBD,Raw
F,72,Master I,Manuela Dursi,71.47,105,110,-115,110,-65,-65,65,65,120,125,132.5,132.5,307.5,1,SBD,Raw
F,72,Master I,Francesca Marina,66.46,87.5,95,102.5,102.5,50,55,57.5,57.5,117.5,125,130,130,290,2,SBD,Raw
F,84,Master I,Paola Roccuzzo,82.7,-135,-135,-135,,,,,,,,,,,DQ,SBD,Raw
F,57,Master II,Teresa Palmisano,54.12,70,75,80,80,40,42.5,-45,42.5,107.5,112.5,118,118,240.5,1,SBD,Raw
F,57,Master II,Gabriella Tenerelli,52.26,72.5,77.5,80,80,-47.5,50,-52.5,50,105,110,-115,110,240,2,SBD,Raw
F,72,Master III,Sara Del Duca,71.5,85,-92.5,-92.5,85,67.5,-72.5,-72.5,67.5,130,140,150,150,302.5,1,SBD,Raw
