Division,WeightClassKg,Place,Name,Team,BodyweightKg,Best3SquatKg,Best3BenchKg,Best3DeadliftKg,TotalKg,Equipment,Event,Sex,BirthDate
Boys,51.71,1,Hugo Sanchez,Pattonville Prairiland,50.58,115.67,70.31,115.67,301.64,Single-ply,SBD,M,
Boys,51.71,2,Journey Sweet,Paris,51.57,108.86,58.97,111.13,278.96,Single-ply,SBD,M,
Boys,51.71,3,Austin McCain,Sulphur Springs,45.59,81.65,52.16,92.99,226.8,Single-ply,SBD,M,
Boys,55.79,1,Bryan Rodriquez,Greenville,55.57,192.78,99.79,183.7,476.27,Single-ply,SBD,M,
Boys,55.79,2,Jakovi Dabbs,Paris,54.98,165.56,88.45,174.63,428.64,Single-ply,SBD,M,
Boys,55.79,3,Freddy Ponce,Gilmer,53.75,163.29,97.52,163.29,424.11,Single-ply,SBD,M,
Boys,55.79,4,Johnny Garza,Pattonville Prairiland,54.88,142.88,83.91,172.37,399.16,Single-ply,SBD,M,
Boys,55.79,5,Hyker Ramirez,Commerce,55.79,131.54,49.9,124.74,306.17,Single-ply,SBD,M,
Boys,55.79,6,Nicolas Castro,Royse City,52.39,97.52,70.31,129.27,297.1,Single-ply,SBD,M,
Boys,59.87,1,Kollin Moss,Royse City,59.87,199.58,102.06,174.63,476.27,Single-ply,SBD,M,
Boys,59.87,2,Jabier Bocanegra,Gilmer,59.87,174.63,97.52,181.44,453.59,Single-ply,SBD,M,
Boys,59.87,3,Deuntre Adamson,Paris,59.42,161.03,97.52,183.7,442.25,Single-ply,SBD,M,
Boys,59.87,4,JaMichael Harris,Greenville,59.42,174.63,92.99,170.1,437.72,Single-ply,SBD,M,
Boys,59.87,5,Kyle Amos,Commerce,59.87,161.03,86.18,174.63,421.84,Single-ply,SBD,M,
Boys,59.87,6,Matt Faggione,Gilmer,59.87,133.81,102.06,167.83,403.7,Single-ply,SBD,M,
Boys,59.87,7,Luke Elrod,Paris North Lamar,56.25,138.35,77.11,163.29,378.75,Single-ply,SBD,M,
Boys,59.87,8,Vandon Lassiter,Paris North Lamar,57.83,145.15,79.38,140.61,365.14,Single-ply,SBD,M,
Boys,59.87,9,Ryan Bell,Paris North Lamar,58.97,113.4,74.84,136.08,324.32,Single-ply,SBD,M,
Boys,59.87,10,Cayden Day,Paris Chisum,58.74,102.06,56.7,142.88,301.64,Single-ply,SBD,M,
Boys,59.87,11,Anthony Cortez,Mount Pleasant,58.74,92.99,61.23,147.42,301.64,Single-ply,SBD,M,
Boys,67.13,1,Gage Dollins,Paris Chisum,66.22,233.6,156.49,235.87,625.96,Single-ply,SBD,M,
Boys,67.13,2,Jesse Carrillo,Sulphur Springs,66.9,204.12,129.27,204.12,537.51,Single-ply,SBD,M,
Boys,67.13,3,Alejandro Vasquez,Greenville,66.68,210.92,102.06,188.24,501.22,Single-ply,SBD,M,
Boys,67.13,4,GiTaeus Young,Paris,66.59,195.04,102.06,195.04,492.15,Single-ply,SBD,M,
Boys,67.13,5,Korrighan Smith,Commerce,67.13,183.7,111.13,192.78,487.61,Single-ply,SBD,M,
Boys,67.13,6,Arius Burton,Royse City,66.68,181.44,81.65,197.31,460.4,Single-ply,SBD,M,
Boys,67.13,7,Brice Dennis,Royse City,65.32,183.7,88.45,179.17,451.32,Single-ply,SBD,M,
Boys,67.13,8,Juan Hernandez,Sulphur Springs,65.09,165.56,77.11,181.44,424.11,Single-ply,SBD,M,
Boys,67.13,9,Johnathan Jones,Paris,64.18,174.63,74.84,167.83,417.3,Single-ply,SBD,M,
Boys,67.13,10,Hayden Bohme,Royse City,67.13,161.03,90.72,158.76,410.5,Single-ply,SBD,M,
Boys,67.13,11,Joey Mecaskey,Pattonville Prairiland,66.9,145.15,104.33,154.22,403.7,Single-ply,SBD,M,
Boys,67.13,12,Kadyn McDonald,Paris,66.22,158.76,77.11,165.56,401.43,Single-ply,SBD,M,
Boys,67.13,13,Abel Moreno,Pattonville Prairiland,65.32,151.95,79.38,163.29,394.63,Single-ply,SBD,M,
Boys,67.13,14,Brayden McCormack,Paris North Lamar,66,136.08,77.11,145.15,358.34,Single-ply,SBD,M,
Boys,67.13,15,Jesse Bailey,Sulphur Springs,65.09,145.15,68.04,138.35,351.53,Single-ply,SBD,M,
Boys,67.13,16,Esteban Trejo,Mount Pleasant,66.68,136.08,65.77,147.42,349.27,Single-ply,SBD,M,
Boys,67.13,17,Oscar Otero,Mount Pleasant,66.9,90.72,49.9,115.67,256.28,Single-ply,SBD,M,
Boys,74.84,1,Colton Danna,Pattonville Prairiland,74.84,206.38,158.76,217.72,582.87,Single-ply,SBD,M,
Boys,74.84,2,Zane Phillips,Mount Pleasant,74.84,226.8,99.79,199.58,526.17,Single-ply,SBD,M,
Boys,74.84,3,Sam Mitchum,Royse City,74.84,181.44,120.2,206.38,508.02,Single-ply,SBD,M,
Boys,74.84,4,Gavin Watts,Pattonville Prairiland,74.84,197.31,88.45,190.51,476.27,Single-ply,SBD,M,
Boys,74.84,5,Contreal Judkins,Ladonia Fannindel,74.84,165.56,97.52,210.92,474,Single-ply,SBD,M,
Boys,74.84,6,Corbin Martin,Paris,73.48,163.29,113.4,195.04,471.74,Single-ply,SBD,M,
Boys,74.84,7,Keegan Sprouse,Gilmer,74.84,156.49,111.13,204.12,471.74,Single-ply,SBD,M,
Boys,74.84,8,Reggie Ellis,Paris,74.16,181.44,99.79,185.97,467.2,Single-ply,SBD,M,
Boys,74.84,9,Montrel McCarty,Paris,69.9,167.83,102.06,181.44,451.32,Single-ply,SBD,M,
Boys,74.84,10,Jacoby Brown,Royse City,69.17,174.63,86.18,181.44,442.25,Single-ply,SBD,M,
Boys,74.84,11,Fernando Cortes,Pattonville Prairiland,74.84,170.1,99.79,158.76,428.64,Single-ply,SBD,M,
Boys,74.84,12,Henry Robinson,Argyle,74.84,165.56,86.18,176.9,428.64,Single-ply,SBD,M,
Boys,74.84,13,Brenden Fink,Sulphur Springs,69.4,158.76,97.52,170.1,426.38,Single-ply,SBD,M,
Boys,74.84,14,Anthony Jeffrey,Mount Pleasant,74.84,138.35,77.11,170.1,385.55,Single-ply,SBD,M,
Boys,74.84,15,Lane Cornmesser,Pattonville Prairiland,74.84,124.74,83.91,156.49,365.14,Single-ply,SBD,M,
Boys,74.84,16,Juan Nava,Mount Pleasant,74.84,122.47,61.23,145.15,328.85,Single-ply,SBD,M,
Boys,74.84,17,Dustin Holbert,Paris North Lamar,74.84,65.77,43.09,127.01,235.87,Single-ply,SBD,M,
Boys,74.84,18,Tatum Wood,Royse City,74.84,192.78,,,192.78,Single-ply,S,M,
Boys,82.1,1,Keshawn Wallace,Paris,80.51,222.26,142.88,222.26,587.4,Single-ply,SBD,M,
Boys,82.1,2,Caleb Robb,Royse City,81.19,190.51,115.67,208.65,514.83,Single-ply,SBD,M,
Boys,82.1,3,Cameron Cox,Gilmer,76.88,188.24,136.08,183.7,508.02,Single-ply,SBD,M,
Boys,82.1,4,Matthew Mitchell,Sulphur Springs,82.1,204.12,104.33,199.58,508.02,Single-ply,SBD,M,
Boys,82.1,5,Mark Castle,Argyle,77.34,190.51,88.45,215.46,494.42,Single-ply,SBD,M,
Boys,82.1,6,Lincoln Smith,Pattonville Prairiland,81.87,188.24,113.4,185.97,487.61,Single-ply,SBD,M,
Boys,82.1,7,Lain Atwood,Paris,78.02,190.51,102.06,185.97,478.54,Single-ply,SBD,M,
Boys,82.1,8,Henry Serrano,Commerce,81.42,183.7,106.59,181.44,471.74,Single-ply,SBD,M,
Boys,82.1,9,Jaquadrian Scott,Ladonia Fannindel,80.97,142.88,102.06,204.12,449.06,Single-ply,SBD,M,
Boys,82.1,10,Avery Weaver,Gilmer,79.38,172.37,90.72,183.7,446.79,Single-ply,SBD,M,
Boys,82.1,11,Maruin Norris,Paris Chisum,75.75,161.03,99.79,165.56,426.38,Single-ply,SBD,M,
Boys,82.1,12,Patrick Roland,Paris,76.43,151.95,86.18,172.37,410.5,Single-ply,SBD,M,
Boys,82.1,13,Aiden Hicks,Pattonville Prairiland,79.15,158.76,102.06,147.42,408.23,Single-ply,SBD,M,
Boys,82.1,14,Reese Chaffin,Paris North Lamar,77.56,151.95,90.72,154.22,396.89,Single-ply,SBD,M,
Boys,82.1,15,Kristofer Miranda,Pattonville Prairiland,81.87,142.88,99.79,149.69,392.36,Single-ply,SBD,M,
Boys,82.1,16,Logan McClung,Sulphur Springs,80.51,129.27,83.91,156.49,369.68,Single-ply,SBD,M,
Boys,82.1,17,Clayton Boykin,Sulphur Springs,81.87,129.27,92.99,145.15,367.41,Single-ply,SBD,M,
Boys,89.81,1,Giancarlos Belteton,Greenville,87.09,274.42,174.63,222.26,671.32,Single-ply,SBD,M,
Boys,89.81,2,Ryan Carrillo #2,Sulphur Springs,83.01,219.99,136.08,204.12,560.19,Single-ply,SBD,M,
Boys,89.81,3,Jailen Franklin,Paris,85.73,183.7,104.33,219.99,508.02,Single-ply,SBD,M,
Boys,89.81,4,Elias Elizondo,Mount Pleasant,88.45,197.31,90.72,199.58,487.61,Single-ply,SBD,M,
Boys,89.81,5,Jacen Gray,Royse City,89.36,197.31,97.52,190.51,485.34,Single-ply,SBD,M,
Boys,89.81,6,Wyatt Smithson,Sulphur Springs,83.23,201.85,104.33,170.1,476.27,Single-ply,SBD,M,
Boys,89.81,7,Dykalen Douglas,Paris,84.37,188.24,102.06,181.44,471.74,Single-ply,SBD,M,
Boys,89.81,8,Cayden Coleman,Gilmer,88,172.37,106.59,181.44,460.4,Single-ply,SBD,M,
Boys,89.81,9,Granger Ervin,Pattonville Prairiland,87.77,174.63,92.99,190.51,458.13,Single-ply,SBD,M,
Boys,89.81,10,Nick Clark,Gilmer,85.96,158.76,83.91,149.69,392.36,Single-ply,SBD,M,
Boys,89.81,11,Cole Gilbert,Pattonville Prairiland,82.78,147.42,90.72,138.35,376.48,Single-ply,SBD,M,
Boys,89.81,DQ,Richard Juarez,Ladonia Fannindel,85.96,,,,,Single-ply,SBD,M,
Boys,99.79,1,Tucker Momon,Greenville,92.22,274.42,158.76,294.84,728.02,Single-ply,SBD,M,
Boys,99.79,2,George Greenway,Sulphur Springs,92.08,303.91,142.88,254.01,700.8,Single-ply,SBD,M,
Boys,99.79,3,Chad Maynard,Sulphur Springs,96.62,238.14,127.01,206.38,571.53,Single-ply,SBD,M,
Boys,99.79,4,Carter Renfro,Paris North Lamar,97.3,197.31,136.08,229.06,562.45,Single-ply,SBD,M,
Boys,99.79,5,Kaden Wallace,Sulphur Springs,97.75,181.44,124.74,208.65,514.83,Single-ply,SBD,M,
Boys,99.79,6,Omarhi Davis,Commerce,95.25,190.51,106.59,215.46,512.56,Single-ply,SBD,M,
Boys,99.79,7,Chandler Sikes,Paris,91.85,195.04,106.59,208.65,510.29,Single-ply,SBD,M,
Boys,99.79,8,Trent Tennon,Paris,92.08,179.17,106.59,222.26,508.02,Single-ply,SBD,M,
Boys,99.79,9,Chance Knight,Commerce,99.11,204.12,102.06,192.78,498.95,Single-ply,SBD,M,
Boys,99.79,10,Caleb Leija,Greenville,98.66,188.24,117.93,188.24,494.42,Single-ply,SBD,M,
Boys,99.79,11,Landon Bailey,Pattonville Prairiland,94.57,183.7,124.74,181.44,489.88,Single-ply,SBD,M,
Boys,99.79,12,Astin Ledbetter,Mount Pleasant,94.8,174.63,113.4,199.58,487.61,Single-ply,SBD,M,
Boys,99.79,13,Taylor Nealy,Gilmer,97.52,181.44,122.47,165.56,469.47,Single-ply,SBD,M,
Boys,99.79,14,Aiden Rose,Royse City,99.34,181.44,86.18,197.31,464.93,Single-ply,SBD,M,
Boys,99.79,15,Richard Jackson,Commerce,95.03,165.56,111.13,181.44,458.13,Single-ply,SBD,M,
Boys,99.79,16,Corbin Branham,Pattonville Prairiland,93.44,163.29,95.25,195.04,453.59,Single-ply,SBD,M,
Boys,99.79,17,Maverick Brown,Paris North Lamar,95.93,158.76,102.06,156.49,417.3,Single-ply,SBD,M,
Boys,99.79,18,Remington Brown,Paris North Lamar,93.21,156.49,86.18,158.76,401.43,Single-ply,SBD,M,
Boys,99.79,19,Branden Dillehay,Ladonia Fannindel,98.2,124.74,83.91,161.03,369.68,Single-ply,SBD,M,
Boys,99.79,20,Garrett Odon,Royse City,98.2,131.54,79.38,156.49,367.41,Single-ply,SBD,M,
Boys,99.79,21,Collin Howe,Royse City,97.52,124.74,70.31,158.76,353.8,Single-ply,SBD,M,
Boys,99.79,22,Koda Kaiser,Royse City,91.85,133.81,65.77,138.35,337.93,Single-ply,SBD,M,
Boys,109.77,1,Quin Dangerfield,Paris,108.95,240.4,156.49,256.28,653.17,Single-ply,SBD,M,
Boys,109.77,2,Corjohnta Dunbar,Commerce,102.74,226.8,142.88,233.6,603.28,Single-ply,SBD,M,
Boys,109.77,3,Keiran Phounsath,Royse City,108.86,217.72,151.95,190.51,560.19,Single-ply,SBD,M,
Boys,109.77,4,Jarot Ritter,Gilmer,102.74,204.12,136.08,204.12,544.31,Single-ply,SBD,M,
Boys,109.77,5,Nico Gatson,Royse City,102.97,181.44,154.22,195.04,530.7,Single-ply,SBD,M,
Boys,109.77,6,Austin Criswell,Argyle,109.54,213.19,106.59,208.65,528.44,Single-ply,SBD,M,
Boys,109.77,7,Somjai Pryor,Sulphur Springs,102.97,206.38,115.67,204.12,526.17,Single-ply,SBD,M,
Boys,109.77,8,Blake Mays,Mount Pleasant,109.32,183.7,115.67,172.37,471.74,Single-ply,SBD,M,
Boys,109.77,9,Braden Howerton,Royse City,107.95,197.31,92.99,174.63,464.93,Single-ply,SBD,M,
Boys,109.77,10,Roy Gaffney,Commerce,102.74,163.29,90.72,170.1,424.11,Single-ply,SBD,M,
Boys,109.77,11,Ian Carrion,Royse City,109.32,165.56,83.91,172.37,421.84,Single-ply,SBD,M,
Boys,109.77,12,Virgle Scales,Paris Chisum,109.09,158.76,99.79,158.76,417.3,Single-ply,SBD,M,
Boys,109.77,13,Oscar Perez,Mount Pleasant,103.87,165.56,72.57,149.69,387.82,Single-ply,SBD,M,
Boys,109.77,DQ,Toby Childress,Ladonia Fannindel,100.24,,,,,Single-ply,SBD,M,
Boys,124.74,1,Jamie Cortez,Royse City,120.88,376.48,206.38,288.03,870.9,Single-ply,SBD,M,
Boys,124.74,2,George Lias,Mount Pleasant,112.72,308.44,142.88,242.67,694,Single-ply,SBD,M,
Boys,124.74,3,Daniel Bueno,Greenville,114.99,290.3,140.61,238.14,669.05,Single-ply,SBD,M,
Boys,124.74,4,Anthony Peak,Commerce,121.11,260.82,165.56,226.8,653.17,Single-ply,SBD,M,
Boys,124.74,5,Satchel Swain,Paris,122.7,254.01,149.69,226.8,630.49,Single-ply,SBD,M,
Boys,124.74,6,Bladen Collom,Gilmer,118.39,249.48,142.88,222.26,614.62,Single-ply,SBD,M,
Boys,124.74,7,Raydon McCormack,Sulphur Springs,118.39,249.48,120.2,206.38,576.06,Single-ply,SBD,M,
Boys,124.74,8,Jesus Gonzalez,Mount Pleasant,114.31,215.46,117.93,229.06,562.45,Single-ply,SBD,M,
Boys,124.74,9,Andrew Parker,Gilmer,119.75,199.58,147.42,208.65,555.65,Single-ply,SBD,M,
Boys,124.74,10,Bryce Hollenshead,Paris North Lamar,117.48,226.8,122.47,204.12,553.38,Single-ply,SBD,M,
Boys,124.74,11,Braden Tittle,Royse City,110.45,208.65,115.67,215.46,539.77,Single-ply,SBD,M,
Boys,124.74,12,Everett Stapleton,Commerce,122.47,208.65,104.33,208.65,521.63,Single-ply,SBD,M,
Boys,124.74,13,Braeden Wilkins,Paris North Lamar,121.79,204.12,122.47,185.97,512.56,Single-ply,SBD,M,
Boys,124.74,14,Noah Howell,Commerce,119.52,188.24,124.74,172.37,485.34,Single-ply,SBD,M,
Boys,124.74,15,Landon Manning,Gilmer,116.8,158.76,108.86,138.35,405.97,Single-ply,SBD,M,
Boys,124.74+,1,Anthony Cork,Commerce,135.62,272.16,183.7,238.14,694,Single-ply,SBD,M,
Boys,124.74+,2,Nick Calais,Royse City,130.63,283.5,165.56,235.87,684.92,Single-ply,SBD,M,
Boys,124.74+,3,Devin Moten,Paris,138.35,240.4,131.54,233.6,605.55,Single-ply,SBD,M,
Boys,124.74+,4,Josh Hicks,Argyle,139.25,238.14,133.81,201.85,573.79,Single-ply,SBD,M,
Boys,124.74+,5,Tyler Welborn,Mount Pleasant,152.18,204.12,124.74,226.8,555.65,Single-ply,SBD,M,
Boys,124.74+,6,Josh Herrera,Mount Pleasant,141.97,238.14,111.13,197.31,546.58,Single-ply,SBD,M,
Boys,124.74+,7,James Robles,Greenville,129.05,210.92,120.2,181.44,512.56,Single-ply,SBD,M,
Boys,124.74+,8,Luke Hohenberger,Paris North Lamar,142.2,204.12,111.13,192.78,508.02,Single-ply,SBD,M,
Boys,124.74+,9,Logan Hawkins,Paris Chisum,138.35,195.04,124.74,185.97,505.76,Single-ply,SBD,M,
Boys,124.74+,10,Garrick Felsberg,Paris North Lamar,130.63,190.51,124.74,176.9,492.15,Single-ply,SBD,M,
Boys,124.74+,11,Dylon Wheeler,Royse City,143.56,192.78,111.13,176.9,480.81,Single-ply,SBD,M,
Boys,124.74+,12,Ryan Giberson,Paris North Lamar,178.72,158.76,86.18,158.76,403.7,Single-ply,SBD,M,
