Division,WeightClassKg,Place,Name,Team,BodyweightKg,Best3SquatKg,Best3BenchKg,Best3DeadliftKg,TotalKg,Equipment,Event,Sex,BirthDate
Girls,44.23,1,Sofia Collantes,Gainesville,44.09,97.52,40.82,99.79,238.14,Single-ply,SBD,F,
Girls,44.23,DQ,Emma McLemore,Denison,43.73,56.7,,,,Single-ply,SBD,F,
Girls,47.85,1,Melissa Ocasio,Little Elm,46.45,113.4,56.7,115.67,285.76,Single-ply,SBD,F,
Girls,47.85,2,Celeste Novick,Frisco Wakeland,47.26,86.18,43.09,88.45,217.72,Single-ply,SBD,F,
Girls,47.85,DQ,Brenna Gibbons,Prosper,47.81,79.38,,,,Single-ply,SBD,F,
Girls,51.94,1,Emily Lamberson,Little Elm,51.62,108.86,47.63,102.06,258.55,Single-ply,SBD,F,
Girls,51.94,2,Elizabeth Gray,Gainesville,50.8,102.06,43.09,106.59,251.74,Single-ply,SBD,F,
Girls,51.94,3,Sidney Sulkin,Frisco Reedy,49.8,90.72,36.29,86.18,213.19,Single-ply,SBD,F,
Girls,51.94,4,Alena Martin,Frisco Reedy,49.99,61.23,29.48,72.57,163.29,Single-ply,SBD,F,
Girls,51.94,DQ,Angelina Alvarez,Frisco Reedy,51.8,63.5,,,,Single-ply,SBD,F,
Girls,56.02,1,Angel Sainz,Gainesville,55.97,97.52,72.57,106.59,276.69,Single-ply,SBD,F,
Girls,56.02,2,Fatima De Anda,Frisco Heritage,54.07,97.52,43.09,102.06,242.67,Single-ply,SBD,F,
Girls,56.02,3,Jaida Ford,Prosper,55.52,90.72,49.9,92.99,233.6,Single-ply,SBD,F,
Girls,60.1,1,Stefani Mason,Frisco Lone Star,56.97,129.27,58.97,129.27,317.51,Single-ply,SBD,F,
Girls,60.1,2,Morgan Foster,Prosper,60.06,104.33,63.5,120.2,288.03,Single-ply,SBD,F,
Girls,60.1,3,Abigail Farmer,Gainesville,58.15,83.91,29.48,88.45,201.85,Single-ply,SBD,F,
Girls,67.36,1,Su Bin Park,Frisco Heritage,66.04,133.81,61.23,124.74,319.78,Single-ply,SBD,F,
Girls,67.36,2,Taylor Bass,Prosper,67.31,113.4,70.31,131.54,315.25,Single-ply,SBD,F,
Girls,67.36,3,Makayla Brown,Bells,65.41,127.01,58.97,127.01,312.98,Single-ply,SBD,F,
Girls,67.36,4,Kornkanok Sophonsakulrat,Prosper,64.05,127.01,61.23,122.47,310.71,Single-ply,SBD,F,
Girls,67.36,5,Ashlyn Garrison,Gainesville,67.04,127.01,70.31,111.13,308.44,Single-ply,SBD,F,
Girls,67.36,6,Karlene Stelling,Frisco Reedy,61.51,108.86,61.23,117.93,288.03,Single-ply,SBD,F,
Girls,67.36,7,Megan Gearman,Frisco Lone Star,65.14,115.67,52.16,115.67,283.5,Single-ply,SBD,F,
Girls,67.36,8,Scarlett Matlock,Prosper,66.32,102.06,47.63,92.99,242.67,Single-ply,SBD,F,
Girls,67.36,9,Bailey Wright,Frisco Reedy,66.13,74.84,47.63,95.25,217.72,Single-ply,SBD,F,
Girls,67.36,DQ,Hannah McCarson,Prosper,61.14,,,,,Single-ply,SBD,F,
Girls,67.36,DQ,Tanealia Barnum,Denison,65.5,113.4,56.7,113.4,,Single-ply,SBD,F,
Girls,75.07,1,Jane Ambe,Frisco Lone Star,69.94,136.08,49.9,136.08,322.05,Single-ply,SBD,F,
Girls,75.07,2,Abigail Dick,Sherman,71.21,131.54,63.5,120.2,315.25,Single-ply,SBD,F,
Girls,75.07,3,Shelby Champion,Gainesville,73.48,124.74,63.5,111.13,299.37,Single-ply,SBD,F,
Girls,75.07,4,Courtney Anderson,Frisco Reedy,70.49,111.13,56.7,108.86,276.69,Single-ply,SBD,F,
Girls,75.07,DQ,Kayce Bolle,Little Elm,73.12,131.54,,,,Single-ply,SBD,F,
Girls,82.33,1,Serenity Thompson,Little Elm,80.29,133.81,72.57,127.01,333.39,Single-ply,SBD,F,
Girls,82.33,2,Ava Taylor,Frisco Memorial,78.56,131.54,70.31,127.01,328.85,Single-ply,SBD,F,
Girls,82.33,3,Kendall Brooks,Prosper,81.83,122.47,74.84,127.01,324.32,Single-ply,SBD,F,
Girls,82.33,4,Maria Mendez,Gainesville,79.74,120.2,70.31,129.27,319.78,Single-ply,SBD,F,
Girls,82.33,5,Marisabel Blanco,Little Elm,75.21,127.01,47.63,117.93,292.57,Single-ply,SBD,F,
Girls,90.04,1,Cameron Hernandez,Little Elm,87.18,142.88,79.38,129.27,351.53,Single-ply,SBD,F,
Girls,90.04,2,Rachel Lambeth,Frisco Wakeland,86.82,97.52,43.09,90.72,231.33,Single-ply,SBD,F,
Girls,90.04,DQ,Alexi Jordan,Denison,85,124.74,,,,Single-ply,SBD,F,
Girls,117.71,1,Ayjah Smith,Prosper,116.57,156.49,83.91,142.88,383.29,Single-ply,SBD,F,
Girls,117.71,DQ,Hallee Kolarek,Little Elm,112.13,,,,,Single-ply,SBD,F,
Girls,117.71+,1,Melaina Denison,Gainesville,130.63,142.88,86.18,117.93,347,Single-ply,SBD,F,
Girls,,NS,Marigol Lopez,Sherman,,,,,,Single-ply,SBD,F,
Girls,,NS,Christina Alvarez,Frisco Reedy,,,,,,Single-ply,SBD,F,
