Place,Name,Sex,Event,Division,WeightClassKg,Equipment,BirthYear,Team,State,BodyweightKg,Squat1Kg,Squat2Kg,Squat3Kg,Best3SquatKg,Bench1Kg,Bench2Kg,Bench3Kg,Best3BenchKg,Deadlift1Kg,Deadlift2Kg,Deadlift3Kg,Best3DeadliftKg,TotalKg,Age,BirthDate
1,Heather Faas,F,SBD,FR-O,52,Raw,1983,Southeast,SC,51.63,120,125,130,130,67.5,70,72.5,72.5,157.5,162.5,165,165,367.5,,
2,Erica Dellinger,F,SBD,FR-O,52,Raw,1983,Southwest,AZ,51.67,100,110,115,115,77.5,90,-95,90,110,125,132.5,132.5,337.5,,
1,Kathy Le,F,SBD,FR-O,57,Raw,1992,Northeast,CT,56.08,132.5,142.5,147.5,147.5,72.5,75,-77.5,75,175,182.5,-187.5,182.5,405,,
2,Abigayle Race,F,SBD,FR-O,57,Raw,1997,Midwest,IL,56.81,130,135,-137.5,135,77.5,80,82.5,82.5,147.5,155,160,160,377.5,,
1,Kait Mendall,F,SBD,FR-O,63,Raw,1988,Northeast,MA,61.79,132.5,140,145,145,92.5,97.5,-100,97.5,160,170,175,175,417.5,,
2,Cassandra Misiak,F,SBD,FR-O,63,Raw,1993,Midwest,IL,61.25,130,137.5,142.5,142.5,72.5,77.5,,77.5,137.5,147.5,-155,147.5,367.5,,
DQ,Karan Sanford-Taylor,F,SBD,FR-O,63,Raw,1966,Southeast,GA,57.14,-80,-82.5,-82.5,,52.5,55,-57.5,55,97.5,100,102.5,102.5,,,
1,Paige Hubbard,F,SBD,FR-O,72,Raw,1992,Midwest,OH,70.94,155,160,165,165,92.5,-97.5,-97.5,92.5,177.5,-185,185,185,442.5,,
2,Precious Andrew,F,SBD,FR-O,72,Raw,1986,Southwest,NM,69.82,142.5,150,155,155,85,92.5,95,95,175,185,-190,185,435,,
3,Brianna Bogdan,F,SBD,FR-O,72,Raw,1993,MidAtlantic,NJ,68.27,135,142.5,147.5,147.5,80,85,-87.5,85,182.5,195,-202.5,195,427.5,,
4,Elis Bradshaw,F,SBD,FR-O,72,Raw,1981,Central,MN,71.23,142.5,152.5,-155,152.5,72.5,77.5,80,80,145,155,-165,155,387.5,,
5,Kelsey Webb,F,SBD,FR-O,72,Raw,1989,Central,IA,69.89,145,-150,-150,145,77.5,80,-82.5,80,155,160,-165,160,385,,
6,Stella Pearson,F,SBD,FR-O,72,Raw,1997,Southern,TX,71.36,132.5,-142.5,142.5,142.5,67.5,70,72.5,72.5,147.5,160,-170,160,375,,
7,Rita Carrington,F,SBD,FR-O,72,Raw,1991,Central,MO,69.9,120,-130,130,130,60,65,67.5,67.5,140,150,-155,150,347.5,,
1,Jennifer Lusk,F,SBD,FR-O,84,Raw,1987,Southwest,AZ,83.51,172.5,185,-190,185,110,117.5,-120,117.5,192.5,205,-210,205,507.5,,
2,Daniela Kilgore,F,SBD,FR-O,84,Raw,1980,Southern,TX,78.57,-145,145,152.5,152.5,90,-92.5,92.5,92.5,177.5,187.5,-195,187.5,432.5,,
3,Kaela Dark,F,SBD,FR-O,84,Raw,1986,Northwest,WA,80.41,147.5,155,-162.5,155,97.5,100,102.5,102.5,170,-177.5,,170,427.5,,
4,Brittany Holloway,F,SBD,FR-O,84,Raw,1994,Southwest,AZ,81.09,150,155,157.5,157.5,95,-100,-100,95,140,147.5,155,155,407.5,,
5,Cheyenne Perkins,F,SBD,FR-O,84,Raw,1996,MidAtlantic,VA,72.14,147.5,-150,,147.5,77.5,82.5,-87.5,82.5,-155,155,,155,385,,
6,Amy Hutchison,F,SBD,FR-O,84,Raw,1982,Southeast,NC,74.2,-130,130,137.5,137.5,60,65,67.5,67.5,157.5,162.5,-165,162.5,367.5,,
1,Samantha Cohen,F,SBD,FR-O,84+,Raw,1981,Northeast,MA,90.57,-175,175,180,180,95,100,107.5,107.5,180,195,200,200,487.5,,
2,Michelle Akpala,F,SBD,FR-O,84+,Raw,1989,Southern,TX,89.88,145,155,165,165,67.5,72.5,77.5,77.5,200,215,227.5,227.5,470,,
G,Ricardo Gracias,M,SBD,MR-G,105,Raw,1992,MidAtlantic,MD,93.52,270,285,-295,285,-177.5,177.5,180,180,285,-300,-307.5,285,750,,
G,Steven Ridges,M,SBD,MR-G,120+,Raw,1992,Southeast,GA,120.45,245,255,267.5,267.5,165,167.5,182.5,182.5,290,305,315,315,765,,
1,Davis Parella,M,SBD,MR-O,66,Raw,1998,Northeast,MA,65.83,205,215,-222.5,215,130,135,140,140,240,250,260,260,615,,
2,Carlos Mata,M,SBD,MR-O,66,Raw,1985,Southern,TX,65.71,190,200,205,205,115,120,-122.5,120,230,250,-265,250,575,,
1,David McDonald,M,SBD,MR-O,74,Raw,1993,MidAtlantic,PA,72.98,-202.5,217.5,225,225,142.5,147.5,-150,147.5,247.5,265,280,280,652.5,,
2,Jeffrey Thompson,M,SBD,MR-O,74,Raw,1993,Central,MN,73.39,220,230,240,240,160,167.5,-172.5,167.5,230,242.5,-255,242.5,650,,
3,Keenan Dung,M,SBD,MR-O,74,Raw,1997,Southwest,HI,73.5,195,205,207.5,207.5,130,135,-137.5,135,270,285,-290,285,627.5,,
4,Christopher Destephen,M,SBD,MR-O,74,Raw,1986,Midwest,OH,72.97,-212.5,212.5,215,215,120,122.5,,122.5,-237.5,237.5,-240,237.5,575,,
5,Andrew Sardis,M,SBD,MR-O,74,Raw,1991,Southeast,FL,72.19,165,175,-182.5,175,120,127.5,-130,127.5,197.5,-212.5,-212.5,197.5,500,,
1,Joshua Broussard,M,SBD,MR-O,83,Raw,1996,Southeast,FL,82.91,242.5,257.5,267.5,267.5,157.5,170,-180,170,280,292.5,310,310,747.5,,
2,Adam Steede,M,SBD,MR-O,83,Raw,1993,Southeast,FL,82.23,242.5,-255,255,255,152.5,160,-162.5,160,295,310,-315,310,725,,
3,Nehemiah Owusu,M,SBD,MR-O,83,Raw,1995,Central,MN,82.01,247.5,260,-277.5,260,132.5,140,-150,140,265,280,295,295,695,,
4,Zachary Broderick,M,SBD,MR-O,83,Raw,1995,MidAtlantic,MD,82.46,230,242.5,-252.5,242.5,142.5,150,157.5,157.5,265,280,290,290,690,,
5,Michael Impennachio,M,SBD,MR-O,83,Raw,1989,Midwest,IL,82.66,185,195,200,200,140,147.5,-150,147.5,220,240,250,250,597.5,,
1,Tommy Schneider,M,SBD,MR-O,93,Raw,1994,Central,MN,91.54,245,260,-265,260,157.5,165,170,170,275,290,-295,290,720,,
2,Anthony Parrella,M,SBD,MR-O,93,Raw,1983,Northeast,NY,92,250,-262.5,262.5,262.5,160,167.5,-172.5,167.5,100,-102.5,,100,530,,
1,Albert Willingham,M,SBD,MR-O,105,Raw,1995,Southern,TX,103.83,277.5,290,300,300,227.5,-235,-235,227.5,260,270,-277.5,270,797.5,,
2,Brett Ramsey,M,SBD,MR-O,105,Raw,1997,Southern,TX,102.03,260,270,-277.5,270,157.5,165,170,170,280,-295,295,295,735,,
3,David Zvareck,M,SBD,MR-O,105,Raw,1984,Southwest,AZ,103.87,225,240,250,250,150,-160,160,160,280,302.5,-317.5,302.5,712.5,,
4,Micah Rodahl,M,SBD,MR-O,105,Raw,1993,Central,MN,102.35,-275,287.5,-295,287.5,135,-142.5,-142.5,135,247.5,257.5,-262.5,257.5,680,,
5,Shawn Watts,M,SBD,MR-O,105,Raw,1989,Southeast,SC,103.96,225,237.5,247.5,247.5,157.5,165,167.5,167.5,250,255,265,265,680,,
6,Timothy Callahan,M,SBD,MR-O,105,Raw,1992,Central,MO,100.46,225,240,-245,240,140,150,-157.5,150,240,255,265,265,655,,
DQ,Andrew Montoya,M,SBD,MR-O,120,Raw,1996,Central,SD,119.06,290,-300,,290,177.5,-185,-185,177.5,-290,-290,,,,,
1,Collyn Richardson,M,SBD,MR-O,120+,Raw,2000,Southeast,SC,145.01,307.5,337.5,350,350,207.5,220,232.5,232.5,280,307.5,325,325,907.5,,
2,Michael Astrologo,M,SBD,MR-O,120+,Raw,1998,Southeast,FL,139.96,315,327.5,340,340,227.5,235,245,245,280,302.5,-322.5,302.5,887.5,,
