Division,WeightClassKg,Place,Name,Team,BodyweightKg,Best3SquatKg,Best3BenchKg,Best3DeadliftKg,TotalKg,Equipment,Event,Sex,BirthDate
Boys,51.71,1,Isreal Rosas,Bruceville-Eddy,51.71,124.74,70.31,138.35,333.39,Single-ply,SBD,M,
Boys,51.71,2,Romvaldo Rosas,Bruceville-Eddy,47.63,102.06,61.23,117.93,281.23,Single-ply,SBD,M,
Boys,51.71,3,Garrett Kwast,Axtell,49.44,111.13,52.16,111.13,274.42,Single-ply,SBD,M,
Boys,51.71,4,Corey Michalak,Axtell,47.63,95.25,61.23,104.33,260.82,Single-ply,SBD,M,
Boys,51.71,5,Austin Michael,Palmer,51.26,95.25,52.16,113.4,260.82,Single-ply,SBD,M,
Boys,51.71,6,Ty Culwell,Cleburne,44,65.77,34.02,63.5,163.29,Single-ply,SBD,M,
Boys,55.79,1,Jordan Davis,Axtell,53.07,113.4,52.16,129.27,294.84,Single-ply,SBD,M,
Boys,55.79,2,Johnathan Graves,Godley,53.98,102.06,58.97,127.01,288.03,Single-ply,SBD,M,
Boys,55.79,3,Justin Manning,Axtell,53.98,83.91,52.16,102.06,238.14,Single-ply,SBD,M,
Boys,55.79,4,Ryan Holtan,Godley,53.98,99.79,34.02,102.06,235.87,Single-ply,SBD,M,
Boys,59.87,1,Wesley Romero,Palmer,57.61,111.13,65.77,142.88,319.78,Single-ply,SBD,M,
Boys,59.87,2,Duante Crawford,Meridian,56.47,92.99,47.63,97.52,238.14,Single-ply,SBD,M,
Boys,67.13,1,Anthony Seider,Lometa,66.22,183.7,95.25,192.78,471.74,Single-ply,SBD,M,
Boys,67.13,2,Daniel Dale #3,Bruceville-Eddy,66.22,147.42,74.84,145.15,367.41,Single-ply,SBD,M,
Boys,67.13,3,Victor Orozco,Meridian,66.5,133.81,83.91,147.42,365.14,Single-ply,SBD,M,
Boys,67.13,4,Braden Price,Grandview,65.77,115.67,72.57,165.56,353.8,Single-ply,SBD,M,
Boys,67.13,5,Dakota Kellett,Bruceville-Eddy,60.78,111.13,79.38,136.08,326.59,Single-ply,SBD,M,
Boys,67.13,6,Nick Lopez,Palmer,65.32,97.52,72.57,129.27,299.37,Single-ply,SBD,M,
Boys,67.13,7,Braedon Strevey,Grandview,60.33,115.67,52.16,102.06,269.89,Single-ply,SBD,M,
Boys,67.13,8,Benji Baker,Grandview,66.68,86.18,65.77,111.13,263.08,Single-ply,SBD,M,
Boys,67.13,DQ,William Lyendecker,Hubbard,66.68,102.06,,,,Single-ply,SBD,M,
Boys,74.84,1,Colby Henry,Lometa,74.39,199.58,136.08,185.97,521.63,Single-ply,SBD,M,
Boys,74.84,2,Teagan Smith,Meridian,71.26,181.44,111.13,165.56,458.13,Single-ply,SBD,M,
Boys,74.84,3,Stephen Fritz,Lingleville,68.49,170.1,99.79,176.9,446.79,Single-ply,SBD,M,
Boys,74.84,4,Collin Graves,Palmer,72.12,158.76,106.59,163.29,428.64,Single-ply,SBD,M,
Boys,74.84,5,Alexis Palacios,Godley,68.49,151.95,83.91,183.7,419.57,Single-ply,SBD,M,
Boys,74.84,6,Arturo Gonzalez,Palmer,73.48,147.42,102.06,167.83,417.3,Single-ply,SBD,M,
Boys,74.84,7,Ian Nunez,Cleburne,74.39,136.08,83.91,170.1,390.09,Single-ply,SBD,M,
Boys,74.84,8,Elliot Hall,Godley,73.48,158.76,81.65,147.42,387.82,Single-ply,SBD,M,
Boys,74.84,9,Brady Taylor,Meridian,72.12,142.88,83.91,147.42,374.21,Single-ply,SBD,M,
Boys,74.84,10,Jesse Hughling,Bruceville-Eddy,71.21,124.74,81.65,161.03,367.41,Single-ply,SBD,M,
Boys,74.84,11,Cj Seal,Florence,71.67,140.61,86.18,136.08,362.87,Single-ply,SBD,M,
Boys,74.84,12,Ryland Carlile,Florence,71.67,120.2,74.84,136.08,331.12,Single-ply,SBD,M,
Boys,74.84,13,Austin Perry,Meridian,69.17,113.4,61.23,142.88,317.51,Single-ply,SBD,M,
Boys,74.84,14,Rowdy Lilley,Florence,73.03,111.13,65.77,136.08,312.98,Single-ply,SBD,M,
Boys,74.84,15,Rj Flourney,Meridian,69.85,102.06,52.16,106.59,260.82,Single-ply,SBD,M,
Boys,74.84,DQ,Matt Rosas,Meridian,73.75,165.56,,151.95,,Single-ply,SBD,M,
Boys,74.84,DQ,Daniel Wessel,Axtell,71.67,113.4,,158.76,,Single-ply,SBD,M,
Boys,82.1,1,Kolby Barlett,Godley,78.93,204.12,92.99,174.63,471.74,Single-ply,SBD,M,
Boys,82.1,2,Nathan Quattlebaum,Bruceville-Eddy,75.3,188.24,102.06,174.63,464.93,Single-ply,SBD,M,
Boys,82.1,3,Alan Mata,Palmer,79.83,154.22,102.06,167.83,424.11,Single-ply,SBD,M,
Boys,82.1,4,Aiden Hill,Florence,80.74,158.76,97.52,163.29,419.57,Single-ply,SBD,M,
Boys,82.1,5,Caden McCarley,Florence,81.19,142.88,90.72,170.1,403.7,Single-ply,SBD,M,
Boys,82.1,6,Samuel Coats,Grandview,82.1,142.88,79.38,170.1,392.36,Single-ply,SBD,M,
Boys,82.1,7,Lakota Landeros,Cleburne,80.74,111.13,79.38,136.08,326.59,Single-ply,SBD,M,
Boys,82.1,8,Dustan Bowers,Meridian,75.57,124.74,61.23,129.27,315.25,Single-ply,SBD,M,
Boys,89.81,1,Mark Zagala,Palmer,88,185.97,124.74,197.31,508.02,Single-ply,SBD,M,
Boys,89.81,2,Baldomero Rodriguez,Bruceville-Eddy,83.91,167.83,120.2,174.63,462.66,Single-ply,SBD,M,
Boys,89.81,3,Gemell Matthews,Godley,86.18,149.69,86.18,195.04,430.91,Single-ply,SBD,M,
Boys,89.81,4,Emmanuel Lugo,Grandview,83.01,158.76,77.11,151.95,387.82,Single-ply,SBD,M,
Boys,89.81,5,Justin Ketcher,Axtell,89.81,145.15,88.45,97.52,331.12,Single-ply,SBD,M,
Boys,89.81,6,Rylee High,Hubbard,86.18,97.52,79.38,133.81,310.71,Single-ply,SBD,M,
Boys,99.79,1,Anthony Gonzalez,Meridian,92.08,170.1,99.79,183.7,453.59,Single-ply,SBD,M,
Boys,99.79,2,Max Bigham,Cleburne,98.88,170.1,113.4,167.83,451.32,Single-ply,SBD,M,
Boys,99.79,3,Kaleb Black,Godley,93.44,181.44,79.38,176.9,437.72,Single-ply,SBD,M,
Boys,99.79,4,Eddy Vargas,Palmer,90.26,154.22,97.52,161.03,412.77,Single-ply,SBD,M,
Boys,99.79,5,Xavier Navarro,Grandview,96.62,165.56,83.91,156.49,405.97,Single-ply,SBD,M,
Boys,99.79,6,Braydon Canada,Grandview,99.34,145.15,79.38,170.1,394.63,Single-ply,SBD,M,
Boys,109.77,1,Ben Lancone,Palmer,107.05,219.99,142.88,226.8,589.67,Single-ply,SBD,M,
Boys,109.77,2,Hunter Carter,Bruceville-Eddy,101.6,226.8,108.86,190.51,526.17,Single-ply,SBD,M,
Boys,109.77,3,Logan Hancock,Corsicana Mildred,107.5,197.31,108.86,219.99,526.17,Single-ply,SBD,M,
Boys,109.77,4,Elijah Stanford,Corsicana Mildred,107.95,226.8,108.86,161.03,496.68,Single-ply,SBD,M,
Boys,109.77,5,Jhonny Arreola,Palmer,105.23,181.44,104.33,190.51,476.27,Single-ply,SBD,M,
Boys,109.77,6,Skyler Lynch,Grandview,105.23,151.95,90.72,131.54,374.21,Single-ply,SBD,M,
Boys,109.77,7,Jackson Long,Cleburne,108.41,106.59,77.11,140.61,324.32,Single-ply,SBD,M,
Boys,109.77,8,Evan Bratcher,Cleburne,107.5,111.13,74.84,108.86,294.84,Single-ply,SBD,M,
Boys,124.74,1,Tim Zimaria,Godley,114.31,206.38,136.08,190.51,532.97,Single-ply,SBD,M,
Boys,124.74,2,Zion Barnes,Hubbard,115.21,195.04,138.35,188.24,521.63,Single-ply,SBD,M,
Boys,124.74,3,James Simons,Bruceville-Eddy,112.94,190.51,124.74,183.7,498.95,Single-ply,SBD,M,
Boys,124.74,4,Marcus Chanta,Cleburne,119.75,181.44,95.25,170.1,446.79,Single-ply,SBD,M,
Boys,124.74,5,Aijah Bell,Bruceville-Eddy,110.22,136.08,102.06,138.35,376.48,Single-ply,SBD,M,
Boys,124.74,6,Sebastian Uribe,Cleburne,112.04,111.13,77.11,129.27,317.51,Single-ply,SBD,M,
Boys,124.74,DQ,Jonah Hankins,Cleburne,114.76,181.44,102.06,,,Single-ply,SBD,M,
Boys,124.74+,1,Jacob Bayer,Grandview,146.06,288.03,170.1,229.06,687.19,Single-ply,SBD,M,
Boys,124.74+,2,Collin Black,Godley,132.45,226.8,136.08,183.7,546.58,Single-ply,SBD,M,
Boys,124.74+,3,Julian Ortuno,Lingleville,126.1,195.04,104.33,151.95,451.32,Single-ply,SBD,M,
Boys,124.74+,4,Brady Tawwatters,Godley,136.53,181.44,92.99,147.42,421.84,Single-ply,SBD,M,
Boys,124.74+,5,Darian Torres,Palmer,127.46,111.13,90.72,145.15,347,Single-ply,SBD,M,
Boys,,NS,Dylan Tyree,Palmer,,,,,,Single-ply,SBD,M,
Boys,,NS,Dawson Lunsford,Godley,,,,,,Single-ply,SBD,M,
Boys,,NS,Gavin Mickey,Godley,,,,,,Single-ply,SBD,M,
Boys,,NS,Cody Miser,Godley,,,,,,Single-ply,SBD,M,
Boys,,NS,Ethan Laramore,Cleburne,,,,,,Single-ply,SBD,M,
Boys,,NS,Sterling Bryant,Cleburne,,,,,,Single-ply,SBD,M,
Boys,,NS,Damion Ortuno,Lingleville,,,,,,Single-ply,SBD,M,
Boys,,NS,Braedyn Woodward,Milford,,,,,,Single-ply,SBD,M,
Boys,,NS,Devan Castille,Milford,,,,,,Single-ply,SBD,M,
Boys,,NS,Isaac Reyes,Lometa,,,,,,Single-ply,SBD,M,
Boys,,NS,Dyllen Workman,Lometa,,,,,,Single-ply,SBD,M,
Boys,,NS,Alonso Caso,Lometa,,,,,,Single-ply,SBD,M,
Boys,,NS,Leonel Caso,Lometa,,,,,,Single-ply,SBD,M,
Boys,,NS,Garrett Terry,Axtell,,,,,,Single-ply,SBD,M,
Boys,,NS,Cale Hayes,Corsicana Mildred,,,,,,Single-ply,SBD,M,
Boys,,NS,Henry Graham,Axtell,,,,,,Single-ply,SBD,M,
Boys,,NS,Matt Lehnhardt,Grandview,,,,,,Single-ply,SBD,M,
Boys,,NS,Caleb Bayer,Grandview,,,,,,Single-ply,SBD,M,
Boys,,NS,Noah Cano,Bruceville-Eddy,,,,,,Single-ply,SBD,M,
Boys,,NS,Daniel Torres,Hubbard,,,,,,Single-ply,SBD,M,
Boys,,NS,Gage Foster,Bruceville-Eddy,,,,,,Single-ply,SBD,M,
Boys,,NS,Cameron Fouts,Bruceville-Eddy,,,,,,Single-ply,SBD,M,
Boys,,NS,Chris Hughling,Bruceville-Eddy,,,,,,Single-ply,SBD,M,
