Place,Name,Division,Equipment,Event,BirthDate,BirthYear,Age,Sex,BodyweightKg,WeightClassKg,Squat1Kg,Squat2Kg,Squat3Kg,Best3SquatKg,Bench1Kg,Bench2Kg,Bench3Kg,Best3BenchKg,Deadlift1Kg,Deadlift2Kg,Deadlift3Kg,Best3DeadliftKg,TotalKg
1,Eloise Bastien,Sub-Juniors,Raw,SBD,,2002,16,F,42.91,43,55,65,-75,65,35,42.5,47.5,47.5,75,85,95,95,207.5
1,Coline Giraud,Sub-Juniors,Raw,SBD,,2003,15,F,50.94,52,90.5,95,-100,95,40,45,47.5,47.5,100,105,107.5,107.5,250
2,Jennifer Saunier,Sub-Juniors,Raw,SBD,,2003,15,F,51.49,52,80,87.5,92.5,92.5,37.5,42.5,45,45,102.5,-110.5,-113,102.5,240
3,Morgane Robillard,Sub-Juniors,Raw,SBD,,2002,16,F,51.43,52,80,85,87.5,87.5,42.5,-45,-45,42.5,85,92.5,95,95,225
4,Clervie Paugam,Sub-Juniors,Raw,SBD,,2001,17,F,51.41,52,72.5,75,-77.5,75,40,42.5,-45,42.5,102.5,-105,-105,102.5,220
5,Manon Dufour,Sub-Juniors,Raw,SBD,,2001,17,F,48.21,52,67.5,70,77.5,77.5,35,37.5,-40,37.5,92.5,95,100,100,215
6,Lisa Guillerm,Sub-Juniors,Raw,SBD,,2001,17,F,48.73,52,82.5,-87.5,-90,82.5,35,37.5,-40,37.5,87.5,90,95,95,215
7,Emma Carvalho,Sub-Juniors,Raw,SBD,,2001,18,F,50.72,52,70,75,80,80,35,-37.5,-37.5,35,75,80,85,85,200
1,Mathilde Devaux,Sub-Juniors,Raw,SBD,,2001,18,F,56.62,57,-90,90,-97.5,90,52.5,-57.5,57.5,57.5,100,-110,-110,100,247.5
2,Malvina Martin,Sub-Juniors,Raw,SBD,,2001,18,F,56.17,57,-75,77.5,-80,77.5,42.5,45,-47.5,45,90,-92.5,-92.5,90,212.5
1,Léa Bouton,Sub-Juniors,Raw,SBD,,2001,18,F,62.92,63,-100,100,115,115,50,55,-57.5,55,-115,115,-125,115,285
2,Clémentine Darras,Sub-Juniors,Raw,SBD,,2001,18,F,61.99,63,90,102.5,-110,102.5,35,40,-45,40,95,100,105,105,247.5
3,Séléna Berot,Sub-Juniors,Raw,SBD,,2002,17,F,60.51,63,85,-90,90,90,35,37.5,40,40,90,-95,-95,90,220
1,Clara Peyraud,Sub-Juniors,Raw,SBD,,2002,16,F,69.01,72,130,135,140,140,80,85,90,90,170,180,-190,180,410
2,Ines Fersiti,Sub-Juniors,Raw,SBD,,2001,18,F,71.24,72,105,112.5,-117.5,112.5,45,-50,-50,45,115,125,-140,125,282.5
3,Julie Hellouet,Sub-Juniors,Raw,SBD,,2002,17,F,69.49,72,90,92.5,95,95,42.5,-45,-45,42.5,110,-117.5,-117.5,110,247.5
G,Lina Matousi,Sub-Juniors,Raw,SBD,,2003,15,F,71.59,72,95,102.5,107.5,107.5,52.5,57.5,-62.5,57.5,120,127.5,132.5,132.5,297.5
1,Camellia Messaoui,Sub-Juniors,Raw,SBD,,2001,17,F,98.24,84+,130,140,150,150,65,-70,72.5,72.5,140,150,-160,150,372.5
1,Arthur Hauet,Sub-Juniors,Raw,SBD,,2001,17,M,58.32,59,145,152.5,-157.5,152.5,105,112.5,-113,112.5,175,-182.5,-182.5,175,440
2,Loïz Gautier,Sub-Juniors,Raw,SBD,,2001,17,M,58.26,59,130,137.5,145,145,102.5,-106,-107.5,102.5,152.5,162.5,-172.5,162.5,410
3,Pierre Martin,Sub-Juniors,Raw,SBD,,2001,17,M,57.84,59,115,122.5,127.5,127.5,67.5,72.5,-75,72.5,160,165,170,170,370
4,Coccian Bourbotte,Sub-Juniors,Raw,SBD,,2001,17,M,58.94,59,110,115,120,120,77.5,80,-82.5,80,160,-165,-167.5,160,360
5,Stéphane Philipot,Sub-Juniors,Raw,SBD,,2001,18,M,56.54,59,102.5,110,115,115,72.5,75,,75,130,135,142.5,142.5,332.5
6,Romain Saunier,Sub-Juniors,Raw,SBD,,2002,17,M,58.03,59,100,-110,-115,100,-67.5,-70,70,70,150,160,-165,160,330
7,Raphael Foulonneau,Sub-Juniors,Raw,SBD,,2003,15,M,58.19,59,102.5,107.5,-110,107.5,62.5,-67.5,-67.5,62.5,142.5,150,-157.5,150,320
1,Khaled Benbachir,Sub-Juniors,Raw,SBD,,2001,18,M,65.77,66,-165,165,175,175,125,130.5,132.5,132.5,200,215,-225,215,522.5
2,Kevin Lagos,Sub-Juniors,Raw,SBD,,2001,17,M,64.83,66,150,160,165,165,95,-105,-105,95,170,180,-190,180,440
3,Malik Bernoussi Triolet,Sub-Juniors,Raw,SBD,,2004,15,M,63.61,66,140,150,-160,150,95,-102.5,-102.5,95,165,180,-190,180,425
4,Gianni Loddo,Sub-Juniors,Raw,SBD,,2001,18,M,65.35,66,120,-130,130,130,90,95,100,100,160,175,-190,175,405
5,Alexis Rouquie,Sub-Juniors,Raw,SBD,,2001,18,M,65.65,66,125,135,142.5,142.5,80,90,-95,90,150,162.5,-170,162.5,395
6,Samuel Legaillard,Sub-Juniors,Raw,SBD,,2002,16,M,65.14,66,130,-135,135,135,82.5,-87.5,87.5,87.5,160,170,-182.5,170,392.5
7,Thomas Roulin Chastel,Sub-Juniors,Raw,SBD,,2002,17,M,64.94,66,135,145,150,150,65,70,72.5,72.5,145,152.5,160,160,382.5
1,Nahel Baali,Sub-Juniors,Raw,SBD,,2001,17,M,73.69,74,185,195,-202.5,195,145,-150,-150,145,235,250,-261,250,590
2,Baptiste Colin,Sub-Juniors,Raw,SBD,,2001,18,M,71.95,74,160,170,180,180,87.5,95,100,100,170,182.5,190,190,470
1,Richmond Baiden,Sub-Juniors,Raw,SBD,,2001,18,M,81.39,83,217.5,235,247.5,247.5,140,147.5,-155,147.5,245,265,-275,265,660
2,Christan Pounoussamy,Sub-Juniors,Raw,SBD,,2002,16,M,80.67,83,185,197.5,205,205,115,-122.5,-122.5,115,217.5,225,230,230,550
3,Morgan Mascaro,Sub-Juniors,Raw,SBD,,2001,17,M,81.35,83,180,190,195,195,125,130,-135,130,190,200,210,210,535
4,Lucas Couturier,Sub-Juniors,Raw,SBD,,2001,17,M,82.54,83,190,-200,-200,190,110,115,-120,115,-200,205,-215,205,510
G,Thomas Bouyer,Sub-Juniors,Raw,SBD,,2001,18,M,82.97,83,-207.5,-207.5,210,210,135,145,-150,145,230,242.5,-250,242.5,597.5
1,Guillaume Koenig,Sub-Juniors,Raw,SBD,,2001,18,M,89.15,93,202.5,205,215.5,215.5,138,142.5,-148,142.5,225,235,242.5,242.5,600.5
2,Léo Bernerd,Sub-Juniors,Raw,SBD,,2001,18,M,91.3,93,205,210,212.5,212.5,125,132.5,-135,132.5,220,232.5,-245,232.5,577.5
3,Gaël Montez,Sub-Juniors,Raw,SBD,,2001,17,M,90.47,93,160,170,180,180,110,115,120,120,190,200,,200,500
4,Julien Suteau,Sub-Juniors,Raw,SBD,,2001,17,M,91.91,93,150,152.5,162.5,162.5,100,-110,110,110,185,192.5,-200,192.5,465
1,Brandon Hautauulu,Sub-Juniors,Raw,SBD,,2002,16,M,100.21,105,165,175,182.5,182.5,100,110,-115,110,190,197.5,202.5,202.5,495
2,Mattéo Chevallier,Sub-Juniors,Raw,SBD,,2002,16,M,104.03,105,170,180,-190,180,90,100,105,105,195,205,-210,205,490
DQ,Sofiane Ayachi,Sub-Juniors,Raw,SBD,,2001,18,M,100.04,105,190,-200,-200,190,-115,-115,-115,,210,220,230,230,
1,Louchiano Rouget,Sub-Juniors,Raw,SBD,,2001,18,M,123.58,120+,210,220,-236,220,120,130,135,135,220,240,-251,240,595
1,Candys Le Bellego,Cadet,Raw,SBD,2005-01-13,,,F,56.09,57,,,,27.5,,,,27.5,,,,60,115
1,Raissa Sommica,Cadet,Raw,SBD,2005-05-31,,,F,59.86,63,,,,70,,,,42.5,,,,80,192.5
1,Nolan Le Bellego,Cadet,Raw,SBD,2005-01-13,,,M,50.96,53,,,,40,,,,40,,,,70,150
1,Maxance Haussy,Cadet,Raw,SBD,2005-03-08,,,M,59.74,66,,,,40,,,,30,,,,55,125