Division,WeightClassKg,Place,Name,Team,BodyweightKg,Best3SquatKg,Best3BenchKg,Best3DeadliftKg,TotalKg,Equipment,Event,Sex,BirthDate
Girls,44.23,1,Brianna Caballero,San Marcos,44.09,122.47,52.16,115.67,290.3,Single-ply,SBD,F,
Girls,44.23,2,Jayla Arellano,Kyle Lehman,43.54,92.99,58.97,115.67,267.62,Single-ply,SBD,F,
Girls,44.23,3,Alyssa Martinez,Kyle Lehman,43.09,97.52,40.82,106.59,244.94,Single-ply,SBD,F,
Girls,44.23,4,Mariah Watts,Georgetown East View,42.37,99.79,40.82,99.79,240.4,Single-ply,SBD,F,
Girls,44.23,5,Hannah Crowder,Kyle Lehman,43.82,90.72,43.09,95.25,229.06,Single-ply,SBD,F,
Girls,44.23,6,Gracie Martone,Belton,43.64,86.18,43.09,97.52,226.8,Single-ply,SBD,F,
Girls,44.23,7,Jenny Navarrete,Kyle Lehman,43.91,102.06,34.02,88.45,224.53,Single-ply,SBD,F,
Girls,44.23,8,Jolie Sanchez,College Station A&M Cons,40.55,104.33,38.56,79.38,222.26,Single-ply,SBD,F,
Girls,44.23,9,Lilanexis Gutierrez,Kyle Lehman,43.73,81.65,43.09,92.99,217.72,Single-ply,SBD,F,
Girls,44.23,10,Ariel Ramirez,Del Valle,44,81.65,45.36,90.72,217.72,Single-ply,SBD,F,
Girls,44.23,11,Athena Aviles,Copperas Cove,43.54,65.77,29.48,77.11,172.37,Single-ply,SBD,F,
Girls,44.23,DQ,Alyssa Marmolejo,Copperas Cove,43.45,,,,,Single-ply,SBD,F,
Girls,47.85,1,Ashley Villanueva,Kyle Lehman,46.99,136.08,74.84,138.35,349.27,Single-ply,SBD,F,
Girls,47.85,2,Jenni Venegas,Dripping Springs,47.36,142.88,61.23,136.08,340.19,Single-ply,SBD,F,
Girls,47.85,3,Genee Johnson,Waco Midway,46.72,127.01,61.23,122.47,310.71,Single-ply,SBD,F,
Girls,47.85,4,Gaby Niswanger,College Station,47.72,122.47,65.77,106.59,294.84,Single-ply,SBD,F,
Girls,47.85,5,Abigail Doyle,Burleson,46.72,97.52,45.36,108.86,251.74,Single-ply,SBD,F,
Girls,47.85,6,Erika Tormozov,Buda Hays,46.9,97.52,47.63,106.59,251.74,Single-ply,SBD,F,
Girls,47.85,7,Geneva Reyes,Kyle Lehman,46.72,97.52,45.36,106.59,249.48,Single-ply,SBD,F,
Girls,47.85,8,Brianna Vega,Dripping Springs,47.63,92.99,52.16,102.06,247.21,Single-ply,SBD,F,
Girls,47.85,9,Madelaine Brown,Burleson,47.54,108.86,43.09,92.99,244.94,Single-ply,SBD,F,
Girls,47.85,10,Quiana Green,San Marcos,47.08,97.52,43.09,102.06,242.67,Single-ply,SBD,F,
Girls,47.85,DQ,Miracle Gray,Dripping Springs,45.9,113.4,47.63,,,Single-ply,SBD,F,
Girls,47.85,DQ,Emily Cason,Copperas Cove,46.72,,,,,Single-ply,SBD,F,
Girls,51.94,1,Amber Saenz,Kyle Lehman,51.26,172.37,88.45,147.42,408.23,Single-ply,SBD,F,
Girls,51.94,2,Paige Bridenstine,Killeen Harker Heights,50.98,145.15,68.04,142.88,356.07,Single-ply,SBD,F,
Girls,51.94,3,Anna Scarborough,College Station,50.8,131.54,72.57,122.47,326.59,Single-ply,SBD,F,
Girls,51.94,4,Diamond Davis,Belton,51.26,120.2,58.97,129.27,308.44,Single-ply,SBD,F,
Girls,51.94,5,Jasmine Rodriguez,Kyle Lehman,50.17,129.27,47.63,129.27,306.17,Single-ply,SBD,F,
Girls,51.94,6,Hailey Sanchez,Burleson,51.44,120.2,47.63,138.35,306.17,Single-ply,SBD,F,
Girls,51.94,7,MaKayla Moulton,Burleson,51.53,108.86,61.23,136.08,306.17,Single-ply,SBD,F,
Girls,51.94,8,Julianna Jongolnee,Kyle Lehman,51.17,124.74,45.36,117.93,288.03,Single-ply,SBD,F,
Girls,51.94,9,Alyss Diaz,Belton,50.17,104.33,63.5,117.93,285.76,Single-ply,SBD,F,
Girls,51.94,10,Selena Giron,Belton,51.26,108.86,58.97,113.4,281.23,Single-ply,SBD,F,
Girls,51.94,11,Ingrid Pena,Buda Hays,51.8,104.33,52.16,120.2,276.69,Single-ply,SBD,F,
Girls,51.94,12,Jasmine Jaimes,Kyle Lehman,51.17,108.86,38.56,120.2,267.62,Single-ply,SBD,F,
Girls,56.02,1,Criselda Facundo,San Marcos,53.89,151.95,77.11,172.37,401.43,Single-ply,SBD,F,
Girls,56.02,2,Kaitlin Diers,Kyle Lehman,54.7,138.35,79.38,136.08,353.8,Single-ply,SBD,F,
Girls,56.02,3,Sidney Shipley,College Station,54.34,142.88,58.97,138.35,340.19,Single-ply,SBD,F,
Girls,56.02,4,Casey Jennings,Kyle Lehman,54.98,138.35,70.31,129.27,337.93,Single-ply,SBD,F,
Girls,56.02,5,Brittany Applegate,Cleburne,52.34,115.67,68.04,136.08,319.78,Single-ply,SBD,F,
Girls,56.02,6,Gabi Jensen,Buda Hays,52.89,117.93,72.57,122.47,312.98,Single-ply,SBD,F,
Girls,56.02,7,Ximena Castillo,Kyle Lehman,54.88,131.54,45.36,136.08,312.98,Single-ply,SBD,F,
Girls,56.02,8,Emilee Brown,Granbury,55.34,115.67,68.04,129.27,312.98,Single-ply,SBD,F,
Girls,56.02,9,Gabriella Medellin,San Marcos,54.98,133.81,58.97,115.67,308.44,Single-ply,SBD,F,
Girls,56.02,10,Hazel Jackson,Joshua,53.16,122.47,63.5,117.93,303.91,Single-ply,SBD,F,
Girls,56.02,DQ,Raquelle Chandarlis,Belton,55.25,106.59,54.43,,,Single-ply,SBD,F,
Girls,56.02,DQ,Bailey Steward,Burleson Centennial,53.98,,,,,Single-ply,SBD,F,
Girls,60.1,1,Madi Kimes,College Station,59.96,154.22,65.77,154.22,374.21,Single-ply,SBD,F,
Girls,60.1,2,Hannah Lopez,College Station,59.15,131.54,81.65,138.35,351.53,Single-ply,SBD,F,
Girls,60.1,3,Brooke Davenport,Kyle Lehman,58.33,138.35,72.57,131.54,342.46,Single-ply,SBD,F,
Girls,60.1,4,Stephanny Ruiz,Belton,59.24,140.61,61.23,133.81,335.66,Single-ply,SBD,F,
Girls,60.1,5,Arianna Eseroma,Copperas Cove,58.69,124.74,68.04,138.35,331.12,Single-ply,SBD,F,
Girls,60.1,6,Allura Bass,College Station,58.79,131.54,79.38,120.2,331.12,Single-ply,SBD,F,
Girls,60.1,7,Deavion Harris,Georgetown,58.88,136.08,54.43,136.08,326.59,Single-ply,SBD,F,
Girls,60.1,8,Taylor Wood,Georgetown,58.42,142.88,72.57,104.33,319.78,Single-ply,SBD,F,
Girls,60.1,9,Kassondra Bengston,Belton,59.24,120.2,56.7,142.88,319.78,Single-ply,SBD,F,
Girls,60.1,10,Taylor Moore,Burleson,58.6,120.2,58.97,138.35,317.51,Single-ply,SBD,F,
Girls,60.1,11,Mariana Coronel,Del Valle,59.15,120.2,68.04,124.74,312.98,Single-ply,SBD,F,
Girls,60.1,DQ,Jadyn Govea,Cleburne,58.97,,,,,Single-ply,SBD,F,
Girls,67.36,1,Fayth Ham,College Station,66.22,181.44,92.99,163.29,437.72,Single-ply,SBD,F,
Girls,67.36,2,Leah Lara,Kyle Lehman,66.22,176.9,77.11,163.29,417.3,Single-ply,SBD,F,
Girls,67.36,3,MaKaela Wyles,Lockhart,66.04,149.69,97.52,138.35,385.55,Single-ply,SBD,F,
Girls,67.36,4,Jiya Edwards,Copperas Cove,65.77,142.88,79.38,151.95,374.21,Single-ply,SBD,F,
Girls,67.36,5,Reagan Gault,Burleson,66.41,136.08,79.38,138.35,353.8,Single-ply,SBD,F,
Girls,67.36,6,Maya Jones,Belton,66.04,149.69,63.5,127.01,340.19,Single-ply,SBD,F,
Girls,67.36,7,Victoria Gutierrez,San Marcos,62.78,129.27,65.77,131.54,326.59,Single-ply,SBD,F,
Girls,67.36,8,Sydney Collazos,Georgetown,66.95,120.2,68.04,136.08,324.32,Single-ply,SBD,F,
Girls,67.36,9,Dana Kennedy,Dripping Springs,66.68,127.01,65.77,124.74,317.51,Single-ply,SBD,F,
Girls,67.36,DQ,Miriam Venegas,Dripping Springs,64.77,,,,,Single-ply,SBD,F,
Girls,67.36,DQ,Katina Stephens,Killeen Ellison,67.04,,,,,Single-ply,SBD,F,
Girls,67.36,DQ,Kayla Loupe,Kyle Lehman,66.95,176.9,,,,Single-ply,SBD,F,
Girls,75.07,1,Logan Loggins,Burleson,72.39,163.29,81.65,161.03,405.97,Single-ply,SBD,F,
Girls,75.07,2,Athena Polymenis,College Station,73.12,158.76,81.65,149.69,390.09,Single-ply,SBD,F,
Girls,75.07,3,Allison Perez,Cleburne,70.49,167.83,81.65,138.35,387.82,Single-ply,SBD,F,
Girls,75.07,4,Maddison Sheumaker,Copperas Cove,67.49,145.15,83.91,151.95,381.02,Single-ply,SBD,F,
Girls,75.07,5,Anissa Burnham,Buda Hays,72.57,156.49,68.04,156.49,381.02,Single-ply,SBD,F,
Girls,75.07,6,Julia Bradley,Georgetown,70.13,154.22,65.77,154.22,374.21,Single-ply,SBD,F,
Girls,75.07,7,Paige Smith,Killeen Ellison,70.31,131.54,90.72,140.61,362.87,Single-ply,SBD,F,
Girls,75.07,8,Kyndall Carroll,Belton,70.31,140.61,79.38,142.88,362.87,Single-ply,SBD,F,
Girls,75.07,9,Avery Miloch,Georgetown,73.66,147.42,65.77,147.42,360.61,Single-ply,SBD,F,
Girls,75.07,10,Esperanza Zuniga,Kyle Lehman,73.75,147.42,72.57,136.08,356.07,Single-ply,SBD,F,
Girls,75.07,DQ,Ashia Baker,Manor,70.76,,,,,Single-ply,SBD,F,
Girls,82.33,1,Abigail Mitchell,Joshua,79.02,170.1,106.59,163.29,439.98,Single-ply,SBD,F,
Girls,82.33,2,Karla Olmedo,Kyle Lehman,79.38,190.51,95.25,154.22,439.98,Single-ply,SBD,F,
Girls,82.33,3,Isabella Roberts,Burleson,78.29,172.37,79.38,156.49,408.23,Single-ply,SBD,F,
Girls,82.33,4,Rylee Pratt,Belton,77.38,147.42,90.72,138.35,376.48,Single-ply,SBD,F,
Girls,82.33,5,Ezra Mendez,San Marcos,80.1,142.88,61.23,163.29,367.41,Single-ply,SBD,F,
Girls,82.33,6,Marina Ramirez,Elgin,78.02,133.81,90.72,136.08,360.61,Single-ply,SBD,F,
Girls,82.33,7,Larissa Acosta,Kyle Lehman,81.92,154.22,58.97,145.15,358.34,Single-ply,SBD,F,
Girls,82.33,8,Viviana Sandoval,Granbury,80.47,142.88,70.31,133.81,347,Single-ply,SBD,F,
Girls,82.33,9,Raquel Ruiz,Buda Hays,78.83,138.35,56.7,147.42,342.46,Single-ply,SBD,F,
Girls,82.33,10,Hannah Scott,College Station,76.29,127.01,68.04,136.08,331.12,Single-ply,SBD,F,
Girls,82.33,11,Ashley Kimey,Hutto,79.29,127.01,43.09,156.49,326.59,Single-ply,SBD,F,
Girls,82.33,12,Naveah Castro,Georgetown East View,79.38,117.93,63.5,136.08,317.51,Single-ply,SBD,F,
Girls,82.33,DQ,Sadie Rhoder,Belton,75.3,,,,,Single-ply,SBD,F,
Girls,90.04,1,Kaylee Damron,Joshua,84.01,219.99,113.4,181.44,514.83,Single-ply,SBD,F,
Girls,90.04,2,Maddison Perdomo,Georgetown,88.36,190.51,97.52,165.56,453.59,Single-ply,SBD,F,
Girls,90.04,3,Brook Ragan,College Station,89.36,181.44,92.99,147.42,421.84,Single-ply,SBD,F,
Girls,90.04,4,J'Lyssa Gonzales,San Marcos,86.64,172.37,77.11,147.42,396.89,Single-ply,SBD,F,
Girls,90.04,5,Alisha Donnatien,Copperas Cove,87.54,165.56,70.31,147.42,383.29,Single-ply,SBD,F,
Girls,90.04,6,Kady Albarado,Bryan,84.28,145.15,79.38,149.69,374.21,Single-ply,SBD,F,
Girls,90.04,7,Sydney Lewis,Burleson Centennial,87.91,151.95,68.04,131.54,351.53,Single-ply,SBD,F,
Girls,90.04,8,Makayla Wesley,Georgetown East View,82.74,133.81,72.57,122.47,328.85,Single-ply,SBD,F,
Girls,90.04,9,Bryce Bourland,Belton,82.74,120.2,74.84,127.01,322.05,Single-ply,SBD,F,
Girls,90.04,DQ,Avery Tapia,Cleburne,88,158.76,104.33,,,Single-ply,SBD,F,
Girls,90.04,DQ,Mayte Martinez,Cleburne,88,163.29,,,,Single-ply,SBD,F,
Girls,90.04,DQ,Alyssa Rhoden,Killeen Ellison,88,154.22,68.04,,,Single-ply,SBD,F,
Girls,100.02,1,Malia Gonzales,Kyle Lehman,98.88,208.65,127.01,185.97,521.63,Single-ply,SBD,F,
Girls,100.02,2,Jakiya Wade,Burleson,96.98,181.44,90.72,174.63,446.79,Single-ply,SBD,F,
Girls,100.02,3,Rianna Taylor,Pflugerville,93.98,174.63,90.72,170.1,435.45,Single-ply,SBD,F,
Girls,100.02,4,JaKayla Gooden,College Station A&M Cons,93.89,167.83,99.79,149.69,417.3,Single-ply,SBD,F,
Girls,100.02,5,Abby Hodgson,Georgetown,95.8,163.29,95.25,149.69,408.23,Single-ply,SBD,F,
Girls,100.02,6,Marisol Zuniga,Kyle Lehman,98.52,172.37,79.38,147.42,399.16,Single-ply,SBD,F,
Girls,100.02,7,Bethany Sherwood,Belton,93.89,158.76,102.06,136.08,396.89,Single-ply,SBD,F,
Girls,100.02,8,Jessica Peterson,Burleson,97.61,161.03,65.77,138.35,365.14,Single-ply,SBD,F,
Girls,100.02,9,Audra Parsons,Cleburne,91.53,142.88,74.84,142.88,360.61,Single-ply,SBD,F,
Girls,100.02,10,Michaela Cary,Granbury,93.08,124.74,63.5,142.88,331.12,Single-ply,SBD,F,
Girls,100.02,11,Cate Julius,Kyle Lehman,98.43,138.35,63.5,124.74,326.59,Single-ply,SBD,F,
Girls,117.71,1,Lagi Ahsang,Killeen Ellison,115.39,217.72,90.72,215.46,523.9,Single-ply,SBD,F,
Girls,117.71,2,Courtney Nichols,Burleson,115.03,204.12,104.33,158.76,467.2,Single-ply,SBD,F,
Girls,117.71,3,Camryn Martinez,Lockhart,115.03,167.83,77.11,158.76,403.7,Single-ply,SBD,F,
Girls,117.71,4,Lydia St Clair,Georgetown,103.42,163.29,86.18,151.95,401.43,Single-ply,SBD,F,
Girls,117.71,5,Cerenity Hunkin,Killeen Harker Heights,108.59,154.22,72.57,156.49,383.29,Single-ply,SBD,F,
Girls,117.71,6,Marryah Smith-McCarthy,Belton,102.97,161.03,83.91,136.08,381.02,Single-ply,SBD,F,
Girls,117.71,7,Abbie Thumudo,Burleson Centennial,114.31,145.15,77.11,136.08,358.34,Single-ply,SBD,F,
Girls,117.71,8,Kayla Garmon,Killeen Shoemaker,110.68,154.22,65.77,133.81,353.8,Single-ply,SBD,F,
Girls,117.71,9,Arianna Martinez,Georgetown East View,103.87,129.27,81.65,117.93,328.85,Single-ply,SBD,F,
Girls,117.71,10,Dimond Grant,Killeen Shoemaker,103.87,108.86,52.16,158.76,319.78,Single-ply,SBD,F,
Girls,117.71,11,Asia Adams,Killeen Ellison,111.77,102.06,61.23,147.42,310.71,Single-ply,SBD,F,
Girls,117.71,DQ,Jisela Trevino,Del Valle,103.33,129.27,58.97,,,Single-ply,SBD,F,
Girls,117.71+,1,Alyssa Arnold,Copperas Cove,128.46,260.82,142.88,222.26,625.96,Single-ply,SBD,F,
Girls,117.71+,2,Kerrington Holiday,Elgin,138.98,185.97,83.91,181.44,451.32,Single-ply,SBD,F,
Girls,117.71+,3,Adecela Martinez,Lockhart,122.92,174.63,77.11,147.42,399.16,Single-ply,SBD,F,
Girls,117.71+,4,Olivia Valdez,Kyle Lehman,134.17,163.29,83.91,147.42,394.63,Single-ply,SBD,F,
Girls,117.71+,5,Jakoyah Bodie,Manor,119.02,136.08,58.97,136.08,331.12,Single-ply,SBD,F,
Girls,117.71+,6,Kyra Baker,Cleburne,150.32,102.06,61.23,120.2,283.5,Single-ply,SBD,F,
Girls,117.71+,7,Merissa Marley,Lockhart,123.56,79.38,47.63,115.67,242.67,Single-ply,SBD,F,
Girls,117.71+,DQ,Kayla Suaste-Gutierrez,Del Valle,120.2,,,,,Single-ply,SBD,F,
Girls,,NS,Jordan Dunn,Pflugerville Weiss,,,,,,Single-ply,SBD,F,
Girls,,NS,Abbagayle Keeton,Temple,,,,,,Single-ply,SBD,F,
