Place,Name,BodyweightKg,Best3SquatKg,Best3BenchKg,Best3DeadliftKg,TotalKg,WeightClassKg,Sex,CyrillicName,BirthYear,Event,Equipment,Division
1,Yelizaveta Ryzhak,47.3,110,70,122.5,302.5,48,F,Єлізавета Рижак,1990,SBD,Single-ply,Student
2,Oleksandra Pozdeeva,47.9,102.5,42.5,110,255,48,F,Олександра Поздєєва,1991,SBD,Single-ply,Student
3,Iryna Kurilova,47,85,35,90,210,48,F,Ірина Курілова,1991,SBD,Single-ply,Student
1,Iryna Khlebodarova,50.7,147.5,77.5,140,365,52,F,Ірина Хлєбодарова,1990,SBD,Single-ply,Student
2,Alina Yurchenko,50.5,80,30,90,200,52,F,Аліна Юрченко,1993,SBD,Single-ply,Student
1,Natalya Tolochna,54.7,157.5,85,140,382.5,56,F,Наталя Толочна,1988,SBD,Single-ply,Student
2,Olena Ukhach,55.7,155,72.5,140,367.5,56,F,Олена Ухач,1989,SBD,Single-ply,Student
3,Viktoriya Vovk,54.5,120,70,105,295,56,F,Вікторія Вовк,1991,SBD,Single-ply,Student
1,Ulyana Lyutnyk,59.1,165,105,170,440,60,F,Уляна Лютник,1984,SBD,Single-ply,Student
2,Natalya Piznyak,59.2,150,80,150,380,60,F,Наталя Пізняк,1992,SBD,Single-ply,Student
1,Vira Boboshko,62.8,160,85,150,395,67.5,F,Віра Бобошко,1993,SBD,Single-ply,Student
2,Irina Kotendzhi,60.8,125,77.5,137.5,340,67.5,F,Ірина Котенджи,1985,SBD,Single-ply,Student
3,Marina Zuy,66.9,100,67.5,120,287.5,67.5,F,Марина Зуй,1989,SBD,Single-ply,Student
1,Olena Krichkovska,72.9,175,90,182.5,447.5,75,F,Олена Крічковська,1988,SBD,Single-ply,Student
2,Kseniya Rossokhan,72.8,155,60,150,365,75,F,Ксенія Россохань,1989,SBD,Single-ply,Student
1,Olena Kozlova,80.8,160,90,160,410,82.5,F,Олена Козлова,1990,SBD,Single-ply,Student
2,Alla Nikitina,80.2,150,65,130,345,82.5,F,Алла Нікітіна,1992,SBD,Single-ply,Student
1,Yanina Ovrakh,116,115,87.5,130,332.5,90+,F,Яніна Оврах,1990,SBD,Single-ply,Student
1,Bogdan Vakarev,55.6,200,100,190,490,56,M,Богдан Вакарєв,1990,SBD,Single-ply,Student
2,Oleksiy Glushenkov,53.5,165,110,180,455,56,M,Олексій Глушенков,1992,SBD,Single-ply,Student
3,Dmitro Poderogin,54.5,110,62.5,140,312.5,56,M,Дмитро Подєрьогін,1992,SBD,Single-ply,Student
DQ,Ivan Zhyrov,52,-167.5,,,,56,M,Іван Жиров,1993,SBD,Single-ply,Student
1,Sergiy Antonyuk,59,245,140,210,595,60,M,Сергій Антонюк,1990,SBD,Single-ply,Student
2,Vasyl' Mitsa,59.9,230,120,230,580,60,M,Василь Мица,1989,SBD,Single-ply,Student
3,Oleksandr Sutyka,59,210,125,225,560,60,M,Олександр Сутика,1991,SBD,Single-ply,Student
4,Andriy Gumbin,58.8,200,85,200,485,60,M,Андрій Гумбін,1992,SBD,Single-ply,Student
5,Maksim Saenko,58.6,172.5,80,200,452.5,60,M,Максим Саєнко,1992,SBD,Single-ply,Student
6,Valeriy Nikonenko,58.9,152.5,110,190,452.5,60,M,Валерій Ніконенко,1991,SBD,Single-ply,Student
7,Oleksandr Shatrov,60,150,95,160,405,60,M,Олександр Шатров,1991,SBD,Single-ply,Student
DQ,Ruslan Koryaka,59.8,-220,,,,60,M,Руслан Коряка,1990,SBD,Single-ply,Student
DQ,Yuriy Pentsko,60,-175,,,,60,M,Юрій Пенцко,1993,SBD,Single-ply,Student
1,Dmitro Pavlenko,66.1,250,130,235,615,67.5,M,Дмитро Павленко,1992,SBD,Single-ply,Student
2,Artem Luchnikov,65.25,225,140,205,570,67.5,M,Артем Лучников,1990,SBD,Single-ply,Student
3,Dmytro Gaynulin,64.6,230,95,227.5,552.5,67.5,M,Дмитро Гайнулін,1992,SBD,Single-ply,Student
4,Igor Garaschenko,66.1,160,193,160,513,67.5,M,Ігор Гаращенко,1988,SBD,Single-ply,Student
5,Rostyslav Kleymenov,67,190,120,192.5,502.5,67.5,M,Ростислав Клейменов,1993,SBD,Single-ply,Student
6,Sergiy Krinitskiy,65.8,170,100,160,430,67.5,M,Сергій Криницький,1989,SBD,Single-ply,Student
7,Evgen Potipako,62.9,160,97.5,170,427.5,67.5,M,Євген Потіпако,1991,SBD,Single-ply,Student
DQ,Volodymyr Dubovoy,65.5,235,130,-220,,67.5,M,Володимир Дубовой,1990,SBD,Single-ply,Student
1,Sergiy Rybalko,74.9,295,175,267.5,737.5,75,M,Сергій Рибалко,1990,SBD,Single-ply,Student
2,Mykola Barannik,73.5,302.5,192.5,240,735,75,M,Микола Бараннік,1989,SBD,Single-ply,Student
3,Mykola Dudin,74.9,245,172.5,252.5,670,75,M,Микола Дудін,1991,SBD,Single-ply,Student
4,Yevgen Galitsyn,73.8,252.5,135,260,647.5,75,M,Євген Галіцин,1989,SBD,Single-ply,Student
5,Yuriy Nesterenko,75,235,160,240,635,75,M,Юрій Нестеренко,1988,SBD,Single-ply,Student
6,Vyacheslav Kashpullin,74.7,235,160,235,630,75,M,В'ячеслав Кашпулін,1989,SBD,Single-ply,Student
7,Denis Klantsatiy,74.1,230,135,235,600,75,M,Денис Кланцатий,1990,SBD,Single-ply,Student
8,Mikhaylo Kravchenko,74.1,250,135,210,595,75,M,Михайло Кравченко,1989,SBD,Single-ply,Student
9,Igor Buturlim,74.8,270,120,200,590,75,M,Ігор Бутурлим,1990,SBD,Single-ply,Student
10,Yuriy Nagorniy,74.9,200,120,235,555,75,M,Юрій Нагорний,1990,SBD,Single-ply,Student
11,Sergiy Sazonov,73,190,125,200,515,75,M,Сергій Сазонов,1993,SBD,Single-ply,Student
12,Anatoliy Tsmokalyuk,73.1,215,100,180,495,75,M,Анатолій Цмокалюк,1992,SBD,Single-ply,Student
13,Igor Mikhaylenko,72.7,150,112.5,215,477.5,75,M,Ігор Михайленко,1992,SBD,Single-ply,Student
DQ,David Nanagyulyan,74.2,-245,,,,75,M,Давид Нанагюлян,1989,SBD,Single-ply,Student
DQ,Yevgen Beliy,74.9,-200,,,,75,M,Євгеній Белий,1989,SBD,Single-ply,Student
DQ,Oleksandr Narizhnyuk,71.8,-240,,,,75,M,Олександр Нарижнюк,1990,SBD,Single-ply,Student
1,Artem Panteleyev,80.8,317.5,192.5,262.5,772.5,82.5,M,Артем Пантелєєв,1992,SBD,Single-ply,Student
2,Maksym Gorkin,81.3,250,170,295,715,82.5,M,Максим Горкін,1985,SBD,Single-ply,Student
3,Mykola Chelpanov,81.5,265,167.5,282.5,715,82.5,M,Микола Челпанов,1989,SBD,Single-ply,Student
4,Nazar Dyachuk,82.5,240,202.5,240,682.5,82.5,M,Назар Д'ячук,1991,SBD,Single-ply,Student
5,Sergiy Belkin,81.2,270,155,250,675,82.5,M,Сергій Белкін,1993,SBD,Single-ply,Student
6,Oleksandr Kryvoshyiko,82.4,242.5,150,227.5,620,82.5,M,Олександр Кривошийко,1990,SBD,Single-ply,Student
7,Maksim Scherbina,81.6,230,160,205,595,82.5,M,Максим Щербина,1991,SBD,Single-ply,Student
8,Maksim Klantsatiy,80,220,140,230,590,82.5,M,Максим Кланцатий,1990,SBD,Single-ply,Student
9,Oleksandr Shitik,77.1,210,125,242.5,577.5,82.5,M,Олександр Шитік,1991,SBD,Single-ply,Student
10,Sergiy Yaschenko,79.8,230,132.5,215,577.5,82.5,M,Сергій Ященко,1990,SBD,Single-ply,Student
11,Oleksandr Piskoviy,79.2,225,130,200,555,82.5,M,Олександр Пісковий,1990,SBD,Single-ply,Student
12,Oleksandr Gumbin,82.4,165,72.5,185,422.5,82.5,M,Олександр Гумбін,1993,SBD,Single-ply,Student
DQ,Sergiy Tustanovskiy,80.4,250,150,-230,,82.5,M,Сергій Тустановський,1988,SBD,Single-ply,Student
1,Artem Sendetskiy,88.6,320,180,297.5,797.5,90,M,Артем Сендецький,1988,SBD,Single-ply,Student
2,Igor Markin,86.5,305,195,295,795,90,M,Ігор Маркін,1988,SBD,Single-ply,Student
3,Artem Lobachov,87.8,300,200,252.5,752.5,90,M,Артем Лобачов,1988,SBD,Single-ply,Student
4,Oleksandr Styozhka,89.2,250,190,260,700,90,M,Олександр Стьожка,1988,SBD,Single-ply,Student
5,Andriy Lyakhov,89.3,262.5,162.5,235,660,90,M,Андрій Ляхов,1989,SBD,Single-ply,Student
6,Oleksandr Vinogradskiy,88.9,255,152.5,230,637.5,90,M,Олександр Виноградський,1992,SBD,Single-ply,Student
7,Dmitro Tantsyura,84.3,250,150,220,620,90,M,Дмитро Танцюра,1989,SBD,Single-ply,Student
8,Kostyantin Slukin,87.2,240,132.5,247.5,620,90,M,Костянтин Слукін,1990,SBD,Single-ply,Student
9,Oleksandr Nos,88.2,200,105,247.5,552.5,90,M,Олександр Нос,1988,SBD,Single-ply,Student
DQ,Dmytro Grabarchuk,90,310,-225,,,90,M,Дмитро Грабарчук,1988,SBD,Single-ply,Student
1,Valeriy Fedorenko,96.5,290,200,260,750,100,M,Валерій Федоренко,1988,SBD,Single-ply,Student
DQ,Valentin Burmistrov,98.4,-290,,,,100,M,Валентин Бурмістров,1990,SBD,Single-ply,Student
DQ,Yuriy Mykhaylov,92.2,340,-190,,,100,M,Юрій Михайлов,1985,SBD,Single-ply,Student
1,Volodymyr Smischuk,105.15,315,215,320,850,110,M,Володимир Сміщук,1985,SBD,Single-ply,Student
2,Valeriy Gazayev,106,320,220,290,830,110,M,Валерій Газаев,1987,SBD,Single-ply,Student
3,Maksim Varchenko,106.6,300,190,305,795,110,M,Максим Варченко,1991,SBD,Single-ply,Student
1,Mykhaylo Potapenko,110.6,317.5,225,282.5,825,125,M,Михайло Потапенко,1991,SBD,Single-ply,Student
2,Pavlo Krasnov,110.1,320,185,312.5,817.5,125,M,Павло Краснов,1987,SBD,Single-ply,Student
3,Vadym Katruk,116,275,190,242.5,707.5,125,M,Вадим Катрук,1990,SBD,Single-ply,Student
4,Oleksiy Saenko,117.3,255,175,252.5,682.5,125,M,Олексій Саєнко,1988,SBD,Single-ply,Student
5,Mykhaylo Urban,110.5,262.5,155,210,627.5,125,M,Михайло Урбан,1992,SBD,Single-ply,Student
6,Yaroslav Malko,115.1,212.5,127.5,210,550,125,M,Ярослав Малько,1990,SBD,Single-ply,Student
DQ,Ruslan Fursov,119,-280,,,,125,M,Руслан Фурсов,1991,SBD,Single-ply,Student
1,Mykhaylo Tys,125.5,307.5,170,250,727.5,125+,M,Михайло Тис,1991,SBD,Single-ply,Student
2,Yuriy Bulgakov,141.6,240,160,222.5,622.5,125+,M,Юрій Булгаков,1991,SBD,Single-ply,Student
3,Mikola Shevchenko,130.7,250,140,210,600,125+,M,Микола Шевченко,1992,SBD,Single-ply,Student
