Place,Name,Equipment,Event,Sex,BirthYear,BirthDate,Country,BodyweightKg,Squat1Kg,Squat2Kg,Squat3Kg,Best3SquatKg,Bench1Kg,Bench2Kg,Bench3Kg,Best3BenchKg,Deadlift1Kg,Deadlift2Kg,Deadlift3Kg,Best3DeadliftKg,TotalKg,WeightClassKg,Division
1,Sergey Fedosienko,Single-ply,SBD,M,1982,,Russia,57.03,260,280,295,295,-175,175,185,185,237.5,257.5,-270,257.5,737.5,59,Open
2,Carlos García,Single-ply,SBD,M,1980,,Venezuela,58.41,240,250,-257.5,250,165,-170,172.5,172.5,235,245,-250,245,667.5,59,Open
3,Dariusz Wszoła,Single-ply,SBD,M,1978,,Poland,58.77,-245,250,257.5,257.5,165,170,-175,170,205,215,227.5,227.5,655,59,Open
4,Franklin León,Single-ply,SBD,M,1983,,Ecuador,58.8,240,252.5,260,260,160,167.5,-170,167.5,215,227.5,-230,227.5,655,59,Open
5,Paweł Ośmiałowski,Single-ply,SBD,M,1977,,Poland,58.73,240,250,255,255,140,150,155,155,210,220,225,225,635,59,Open
6,Etienne Lited,Single-ply,SBD,M,1979,,France,58.8,-240,240,-250,240,-145,-145,145,145,235,247.5,-252.5,247.5,632.5,59,Open
7,Patrick Constantine,Single-ply,SBD,M,1969,,UK,58.51,240,-250,-252.5,240,127.5,137.5,140,140,-225,225,232.5,232.5,612.5,59,Open
8,Iván Cancel,Single-ply,SBD,M,1982,,Puerto Rico,58.92,220,227.5,232.5,232.5,150,155,-160,155,205,212.5,-220,212.5,600,59,Open
9,Takahiro Iimura,Single-ply,SBD,M,1990,,Japan,58.92,230,-240,-240,230,130,-145,-145,130,210,230,-240,230,590,59,Open
DQ,Frédéric Tinebra,Single-ply,SBD,M,1978,,France,58.67,-235,-240,-245,,-150,-150,150,150,215,225,-230,225,,59,Open
1,Sergey Gladkikh,Single-ply,SBD,M,1989,,Russia,65.94,300,310,315,315,185,195,205,205,280,290,-300,290,810,66,Open
2,Hassan El Belghiti,Single-ply,SBD,M,1975,,France,65.88,-285,290,-300,290,-155,155,-160,155,295,310,313,313,758,66,Open
3,Konstantin Danilov,Single-ply,SBD,M,1986,,Russia,64.55,-300,300,-315,300,175,182.5,-190,182.5,-260,260,272.5,272.5,755,66,Open
4,Lenin La Rosa,Single-ply,SBD,M,1985,,Venezuela,65.94,260,272.5,-280,272.5,-177.5,177.5,182.5,182.5,260,272.5,277.5,277.5,732.5,66,Open
5,Tsung-Ting Hsieh,Single-ply,SBD,M,1982,,Taiwan,64.88,200,220,240,240,195,205,210,210,-240,250,255,255,705,66,Open
6,Yoshihiro Sato,Single-ply,SBD,M,1982,,Japan,65.65,240,255,-262.5,255,190,197.5,202.5,202.5,220,235,-242.5,235,692.5,66,Open
7,Jean-Sébastien Rhéaume,Single-ply,SBD,M,1974,,Canada,65.78,230,242.5,255,255,-175,175,-180,175,225,235,-242.5,235,665,66,Open
8,Ming-Hui Lin,Single-ply,SBD,M,1983,,Taiwan,64.88,-230,230,245,245,195,-200,-200,195,200,210,220,220,660,66,Open
9,Jonathon Bareng,Single-ply,SBD,M,1983,,USA,65.6,237.5,245,-247.5,245,160,165,-170,165,225,232.5,242.5,242.5,652.5,66,Open
10,Lewis Noppers,Single-ply,SBD,M,1970,,Canada,65.96,220,230,-242.5,230,142.5,147.5,-150,147.5,250,270,275,275,652.5,66,Open
11,Karel Ruso,Single-ply,SBD,M,1965,,Czechia,65.69,235,255,265,265,95,102.5,-105,102.5,210,232.5,240,240,607.5,66,Open
12,Cruz Rodríguez,Single-ply,SBD,M,1959,,Puerto Rico,65.01,200,-210,-215,200,-142.5,142.5,-145,142.5,190,-200,200,200,542.5,66,Open
DQ,Robi Sujanto,Single-ply,SBD,M,1985,,Indonesia,64.86,240,265,-270,265,-195,-195,-195,,-250,-250,-250,,,66,Open
1,Jarosław Olech,Single-ply,SBD,M,1974,,Poland,72.99,335,355,-372.5,355,200,210,-217.5,210,300,310,-327.5,310,875,74,Open
2,Maliek Derstine,Single-ply,SBD,M,1988,,USA,73.72,287.5,300,310,310,200,215,222.5,222.5,-265,285,295,295,827.5,74,Open
3,Lung-Hsin Huang,Single-ply,SBD,M,1981,,Taiwan,73.91,275,285,-290,285,200,-210,210,210,295,305,-307.5,305,800,74,Open
4,Eriek Nickson,Single-ply,SBD,M,1975,,USA,73.85,255,272.5,285,285,182.5,-187.5,-212.5,182.5,292.5,307.5,-320.5,307.5,775,74,Open
5,Kim-Raino Rølvåg,Single-ply,SBD,M,1986,,Norway,74,265,272.5,280,280,-225,225,230,230,250,260,265,265,775,74,Open
6,Kader Baali,Single-ply,SBD,M,1968,,France,73.64,-277.5,-277.5,282.5,282.5,185,190,-192.5,190,-272.5,272.5,-282.5,272.5,745,74,Open
7,Yi-Hsin Kuan,Single-ply,SBD,M,1982,,Taiwan,72.39,265,-275,-275,265,165,-170,,165,295,302.5,305,305,735,74,Open
8,Antoni Mastrolorenzo,Single-ply,SBD,M,1982,,France,72.76,290,-300,-300,290,185,192.5,-197.5,192.5,240,-262.5,-262.5,240,722.5,74,Open
9,Merdan Nursahedov,Single-ply,SBD,M,1976,,Turkmenistan,73.35,200,,,200,212.5,217.5,222.5,222.5,220,240,,240,662.5,74,Open
10,Oliver Weissenbacher,Single-ply,SBD,M,1986,,Austria,69.49,-245,-245,245,245,160,165,-170,165,-215,215,-230,215,625,74,Open
11,David Salgado,Single-ply,SBD,M,1974,,Mexico,73.69,225,235,-240,235,155,-165,-165,155,-225,225,235,235,625,74,Open
12,Mauricio Mejia Boza Alvaro,Single-ply,SBD,M,1981,,Costa Rica,71.74,205,212.5,222.5,222.5,-145,145,150,150,230,-240,-240,230,602.5,74,Open
13,Isaac Laboy,Single-ply,SBD,M,1989,,Puerto Rico,73.68,180,190,-195,190,122.5,-130,-130,122.5,215,232.5,-242.5,232.5,545,74,Open
DQ,Norihiro Otani,Single-ply,SBD,M,1980,,Japan,73.75,-297.5,-297.5,-297.5,,190,200,-215,200,250,260,-270,260,,74,Open
DD,Eric Oishi,Single-ply,SBD,M,1979,,Brazil,72.95,295,-312.5,312.5,312.5,-197.5,200,207.5,207.5,260,-272.5,-272.5,260,,74,Open
DD,Rostislav Petkov,Single-ply,SBD,M,1988,,Bulgaria,73.54,300,315,322.5,322.5,220,230,-241,230,290,302.5,-327.5,302.5,,74,Open
1,Evgeniy Vasyukov,Single-ply,SBD,M,1985,,Russia,82.68,340,350,360,360,230,240,245,245,315,320,-335,320,925,83,Open
2,Andriy Naniev,Single-ply,SBD,M,1984,,Ukraine,82.32,-345,345,360,360,230,240,247.5,247.5,300,307.5,-312.5,307.5,915,83,Open
3,Volodymyr Rysiev,Single-ply,SBD,M,1982,,Ukraine,82.33,345,352.5,357.5,357.5,225,-235,235,235,310,317.5,-325,317.5,910,83,Open
4,José Castillo #1,Single-ply,SBD,M,1986,,Ecuador,83,325,-345,350,350,215,225,230,230,295,310,322.5,322.5,902.5,83,Open
5,Kjell Egil Bakkelund,Single-ply,SBD,M,1988,,Norway,82,325,337.5,342.5,342.5,235,240,245,245,300,312.5,-317.5,312.5,900,83,Open
6,Alexey Sorokin,Single-ply,SBD,M,1985,,Russia,82.83,350,365,-372.5,365,215,225,-230,225,300,310,-322.5,310,900,83,Open
7,Robert Palmer #2,Single-ply,SBD,M,1982,,UK,82.87,315,325,332.5,332.5,-225,225,230,230,285,295,-302.5,295,857.5,83,Open
8,Randolph Morgan,Single-ply,SBD,M,1978,,Guyana,82.07,285,300,-305,300,195,210,220,220,320,327.5,330,330,850,83,Open
9,Todor Vasilev,Single-ply,SBD,M,1978,,Bulgaria,82.53,310,-320,325,325,192.5,-200,200,200,307.5,317.5,325,325,850,83,Open
10,Knute Douglas,Single-ply,SBD,M,1989,,USA,82.91,317.5,330,340,340,190,-200,-200,190,307.5,320,-327.5,320,850,83,Open
11,Masahiro Mori,Single-ply,SBD,M,1972,,Japan,82.53,285,297.5,305,305,225,237.5,-245,237.5,270,-280,-280,270,812.5,83,Open
12,Romain Picot-Guéraud,Single-ply,SBD,M,1987,,France,82.2,-305,305,317.5,317.5,200,-207.5,207.5,207.5,285,-300,-300,285,810,83,Open
13,Eduard Tepper,Single-ply,SBD,M,1979,,Germany,82.13,280,-300,-300,280,-225,225,-230,225,285,-300,300,300,805,83,Open
14,Marcelo Silva,Single-ply,SBD,M,1984,,Brazil,83,275,290,305,305,225,240,-247.5,240,260,-275,-275,260,805,83,Open
15,Luis Tapia,Single-ply,SBD,M,1968,,Puerto Rico,82.22,325,-337.5,340,340,190,197.5,-202.5,197.5,255,265,-272.5,265,802.5,83,Open
16,Marcos Sanchéz,Single-ply,SBD,M,1974,,Ecuador,82.54,285,305,-315,305,200,-207.5,-207.5,200,225,-227.5,,225,730,83,Open
17,Chris Seville,Single-ply,SBD,M,1984,,Australia,82.65,270,280,-285,280,-160,160,-165,160,245,255,-262.5,255,695,83,Open
18,Ricardo Vicenteño,Single-ply,SBD,M,1983,,Mexico,80.16,225,235,242.5,242.5,137.5,147.5,152.5,152.5,260,267.5,275,275,670,83,Open
19,Ahmet Gurbanov,Single-ply,SBD,M,1992,,Turkmenistan,82.03,260,-270,-280,260,-170,-170,170,170,-240,240,-252.5,240,670,83,Open
DQ,Robert Mihailov,Single-ply,SBD,M,1977,,Bulgaria,82.62,-315,315,-330,315,-225,-225,-225,,280,-305,-322.5,280,,83,Open
DQ,Jaider Espinoza,Single-ply,SBD,M,1982,,Venezuela,82.98,-340,-352.5,-352.5,,240,-242.5,-242.5,240,,,,,,83,Open
1,Mykhaylo Bulanyy,Single-ply,SBD,M,1975,,Ukraine,92.92,365,-375,377.5,377.5,-245,245,-247.5,245,317.5,327.5,337.5,337.5,960,93,Open
2,Sergii Bilyi,Single-ply,SBD,M,1990,,Ukraine,92.52,-362.5,-362.5,362.5,362.5,247.5,255,260,260,315,322.5,-332.5,322.5,945,93,Open
3,Patrik Turesson,Single-ply,SBD,M,1974,,Sweden,92.44,345,-362.5,362.5,362.5,225,232.5,-237.5,232.5,305,320,-327.5,320,915,93,Open
4,Jan Wegiera,Single-ply,SBD,M,1965,,Poland,92.36,340,-360,-360,340,280,290,300,300,270,-282.5,-282.5,270,910,93,Open
5,Jan Bast,Single-ply,SBD,M,1977,,Germany,92.26,315,-322.5,325,325,260,265,-270,265,-285,290,297.5,297.5,887.5,93,Open
6,David Ricks,Single-ply,SBD,M,1959,,USA,91.63,-332.5,332.5,345,345,215,-225,225,225,292.5,305,-317.5,305,875,93,Open
7,David Coimbra,Single-ply,SBD,M,1983,,Brazil,91.59,305,325,335,335,207.5,-220,-220,207.5,300,320,-337.5,320,862.5,93,Open
8,Ramon Burgos,Single-ply,SBD,M,1987,,Puerto Rico,92.8,310,-320,320,320,165,172.5,180,180,312.5,325,337.5,337.5,837.5,93,Open
9,Pavol Varchola,Single-ply,SBD,M,1978,,Slovakia,92.83,315,325,-337.5,325,-200,200,-205,200,290,302.5,312.5,312.5,837.5,93,Open
10,Takayuki Arakawa,Single-ply,SBD,M,1978,,Japan,87.76,280,300,310,310,215,225,-235,225,270,290,-300,290,825,93,Open
11,Henrik Skov Nielsen,Single-ply,SBD,M,1984,,Denmark,92.2,315,330,-335,330,205,-212.5,212.5,212.5,265,277.5,282.5,282.5,825,93,Open
12,Kyohei Kubo,Single-ply,SBD,M,1987,,Japan,92.72,330,345,355,355,190,205,215,215,220,235,-257.5,235,805,93,Open
13,Robert Love,Single-ply,SBD,M,1977,,UK,92.7,300,317.5,325,325,170,180,187.5,187.5,270,280,287.5,287.5,800,93,Open
14,Gabriel García,Single-ply,SBD,M,1975,,Mexico,90.82,285,295,-305,295,207.5,215,-220,215,280,-290,-290,280,790,93,Open
DQ,Ruslan Yarullin,Single-ply,SBD,M,1982,,Kazakhstan,92.35,-350,-350,-350,,230,240,-247.5,240,-320,-320,-320,,,93,Open
DQ,Andreas Jandorek,Single-ply,SBD,M,1985,,Austria,92.75,-315,320,332.5,332.5,-235,-237.5,-240,,285,-307.5,-307.5,285,,93,Open
DQ,Pjotr van den Hoek,Single-ply,SBD,M,1972,,Netherlands,92.78,-335,-335,-335,,-257.5,-257.5,-257.5,,,,,,,93,Open
DQ,Hernán Ron,Single-ply,SBD,M,1981,,Venezuela,92.82,370,380,-390,380,-245,-245,-250,,-290,,,,,93,Open
DQ,André Hentschel,Single-ply,SBD,M,1984,,Germany,92.84,-320,-320,-320,,-232.5,,,,,,,,,93,Open
DQ,Margus Silbaum,Single-ply,SBD,M,1976,,Estonia,92.98,345,-360,360,360,-225,-225,-225,,-340,340,-355,340,,93,Open
DD,Zdravko Sarafimov,Single-ply,SBD,M,1984,,Bulgaria,92.66,340,-352.5,352.5,352.5,240,247.5,255,255,330,337.5,-352.5,337.5,,93,Open
1,Anibal Manuel Coimbra Marques,Single-ply,SBD,M,1972,,Luxembourg,104.39,380,-400,400,400,255,260,-262.5,260,340,355,387.5,387.5,1047.5,105,Open
2,Konstantin Lebedko,Single-ply,SBD,M,1981,,Russia,104.74,385,-400,400,400,280,290,295,295,-345,345,352.5,352.5,1047.5,105,Open
3,Vadym Dovhanyuk,Single-ply,SBD,M,1987,,Ukraine,104.42,390,402.5,410,410,300,310,315,315,310,-320,-320,310,1035,105,Open
4,José Mencias,Single-ply,SBD,M,1987,,Venezuela,103.93,347.5,355,-360,355,245,252.5,-257.5,252.5,325,332.5,-337.5,332.5,940,105,Open
5,Stian Walgermo,Single-ply,SBD,M,1988,,Norway,104.23,355,-365,365,365,242.5,-247.5,-250,242.5,307.5,315,320,320,927.5,105,Open
6,Tomáš Šárik,Single-ply,SBD,M,1975,,Czechia,104.93,332.5,345,-352.5,345,232.5,-240,-240,232.5,310,327.5,335,335,912.5,105,Open
7,Tomas Harsany,Single-ply,SBD,M,1982,,Slovakia,104.42,330,340,345,345,-215,215,230,230,310,325,335,335,910,105,Open
8,Peter Ovsonka,Single-ply,SBD,M,1982,,Slovakia,104.45,370,-392.5,-400,370,210,220,-225,220,-305,305,-322.5,305,895,105,Open
9,Sune Bak,Single-ply,SBD,M,1974,,Denmark,104.3,320,330,-335,330,237.5,245,250,250,295,305,312.5,312.5,892.5,105,Open
10,John MacDonald,Single-ply,SBD,M,1983,,Canada,104.96,322.5,332.5,340,340,225,-230,-230,225,305,322.5,-340,322.5,887.5,105,Open
11,Luis Jaimes,Single-ply,SBD,M,1989,,USA,104.66,330,-340,-340,330,265,-275,-295,265,250,265,280,280,875,105,Open
12,Takahito Akutsu,Single-ply,SBD,M,1982,,Japan,101.37,-310,310,325,325,235,240,245,245,260,280,300,300,870,105,Open
13,Johan Smith,Single-ply,SBD,M,1991,,South Africa,104.7,320,332.5,337.5,337.5,215,225,-232.5,225,280,290,300,300,862.5,105,Open
14,Ildefonso Pardo,Single-ply,SBD,M,1973,,Mexico,101.77,295,307.5,-312.5,307.5,230,242.5,247.5,247.5,260,270,-275,270,825,105,Open
15,David Jame,Single-ply,SBD,M,1981,,Australia,104.1,-320,320,-332.5,320,175,-180,-180,175,280,300,315,315,810,105,Open
16,Jaromír Sršeň,Single-ply,SBD,M,1974,,Czechia,96,300,-310,-310,300,-215,215,-227.5,215,270,290,-300,290,805,105,Open
17,Antonio González,Single-ply,SBD,M,1971,,Puerto Rico,98.91,-307.5,307.5,-317.5,307.5,190,200,-205,200,-262.5,-270,270,270,777.5,105,Open
DQ,Sofiane Belkesir,Single-ply,SBD,M,1984,,France,104.1,-360,360,-372.5,360,-235,-235,-235,,,,,,,105,Open
DQ,Jacek Wiak,Single-ply,SBD,M,1975,,Poland,104.37,-385,385,-395,385,-260,-260,-260,,300,320,-342.5,320,,105,Open
DQ,Hebert Sena,Single-ply,SBD,M,1973,,Uruguay,104.74,-310,-310,-310,,-210,210,-215,210,,,,,,105,Open
1,Maxim Barkhatov,Single-ply,SBD,M,1981,,Russia,119.91,-400,400,410,410,270,277.5,282.5,282.5,340,-360,360,360,1052.5,120,Open
2,Ivaylo Hristov,Single-ply,SBD,M,1979,,Bulgaria,118.31,375,395,405,405,292.5,300,305,305,320,340,-345,340,1050,120,Open
3,Valeriy Karpov,Single-ply,SBD,M,1984,,Ukraine,118.92,380,395,405,405,280,287.5,295,295,320,332.5,-352.5,332.5,1032.5,120,Open
4,Tor-Herman Omland,Single-ply,SBD,M,1977,,Norway,117.89,385,-397.5,397.5,397.5,290,-295,295,295,310,317.5,327.5,327.5,1020,120,Open
5,Jørgen Andreas Hansen,Single-ply,SBD,M,1986,,Norway,119.52,375,392.5,402.5,402.5,257.5,262.5,267.5,267.5,320,330,342.5,342.5,1012.5,120,Open
6,Steve Mann,Single-ply,SBD,M,1975,,USA,119.74,365,382.5,392.5,392.5,272.5,-287.5,287.5,287.5,275,290,305,305,985,120,Open
7,Sami Pullinen,Single-ply,SBD,M,1983,,Finland,119.9,340,-360,-360,340,-280,285,-302.5,285,280,295,-320,295,920,120,Open
8,Ben Banks,Single-ply,SBD,M,1984,,UK,117.11,320,-335,-335,320,240,250,260,260,300,320,327.5,327.5,907.5,120,Open
9,Carlos Rivera,Single-ply,SBD,M,1982,,Puerto Rico,118.56,335,347.5,350,350,230,245,-250,245,280,300,312.5,312.5,907.5,120,Open
10,Marco Porras,Single-ply,SBD,M,1982,,Mexico,114.75,342.5,-360,360,360,230,235,-242.5,235,290,310,-320,310,905,120,Open
11,Zbyněk Krejča,Single-ply,SBD,M,1974,,Czechia,118.86,330,-340,340,340,275,-285,-285,275,285,-295,-295,285,900,120,Open
12,Franz Leberwurst,Single-ply,SBD,M,1969,,Austria,113.45,345,-360,-360,345,210,-230,-230,210,295,310,-317.5,310,865,120,Open
13,Jean-Luc Collart,Single-ply,SBD,M,1959,,Belgium,118.95,320,335,350,350,200,-220,220,220,280,295,-302.5,295,865,120,Open
14,Hernan Vargas Velez Libardo,Single-ply,SBD,M,1979,,Colombia,116.95,-300,300,305,305,160,-180,-180,160,220,230,-232.5,230,695,120,Open
DQ,Tatsuma Yamamoto,Single-ply,SBD,M,1980,,Japan,109.92,-305,305,-315,305,-255,-255,-255,,250,260,265,265,,120,Open
DQ,Tony Cliffe,Single-ply,SBD,M,1984,,UK,118.92,365,-377.5,-377.5,365,-277.5,-277.5,-277.5,,320,340,345,345,,120,Open
1,Viktor Testsov,Single-ply,SBD,M,1989,,Ukraine,137.94,410,425,435,435,-345,345,357.5,357.5,345,-352.5,355,355,1147.5,120+,Open
2,Andrey Konovalov #1,Single-ply,SBD,M,1986,,Russia,162.45,440,455,460,460,325,335,340,340,335,345,-355,345,1145,120+,Open
3,Carl Yngvar Christensen,Single-ply,SBD,M,1990,,Norway,163.47,422.5,437.5,445,445,317.5,325,330,330,345,357.5,-375,357.5,1132.5,120+,Open
4,Volodymyr Svistunov,Single-ply,SBD,M,1987,,Ukraine,160.06,420,442.5,-450,442.5,310,320,-327.5,320,330,-357.5,-370,330,1092.5,120+,Open
5,Milan Špingl,Single-ply,SBD,M,1980,,Czechia,146.47,-425,425,440,440,290,302.5,310,310,320,-342.5,-342.5,320,1070,120+,Open
6,Blaine Sumner,Single-ply,SBD,M,1987,1987-06-22,USA,158.27,-440,440,-450,440,-295,295,-320,295,315,332.5,-337.5,332.5,1067.5,120+,Open
7,Kenneth Sandvik,Single-ply,SBD,M,1975,,Finland,140.22,390,405,412.5,412.5,330,337.5,342.5,342.5,310,-317.5,-317.5,310,1065,120+,Open
8,Auðunn Jónsson,Single-ply,SBD,M,1972,,Iceland,138.83,390,412.5,-417.5,412.5,262.5,-272.5,275,275,335,362.5,-375,362.5,1050,120+,Open
9,Jewgenij Kondraschow,Single-ply,SBD,M,1983,,Germany,144.65,345,365,375,375,-245,250,265,265,305,320,345,345,985,120+,Open
10,William Schouten,Single-ply,SBD,M,1975,,US Virgin Islands,137.06,-402.5,422.5,-437.5,422.5,230,240,-250,240,295,320,-330,320,982.5,120+,Open
11,Ryan Stinn,Single-ply,SBD,M,1981,,Canada,131.96,305,317.5,327.5,327.5,245,260,267.5,267.5,285,295,-305,295,890,120+,Open
12,Eumenes Souza,Single-ply,SBD,M,1972,,Brazil,141.09,330,350,-360,350,225,240,-250,240,270,290,-302.5,290,880,120+,Open
13,Lazaro Nieves,Single-ply,SBD,M,1977,,Puerto Rico,126.98,-305,-317.5,317.5,317.5,-210,225,235,235,300,317.5,-325,317.5,870,120+,Open
14,Carlos Manuel Campos Murillo,Single-ply,SBD,M,1979,,Costa Rica,125.94,310,325,335,335,220,-230,-230,220,-310,310,-330,310,865,120+,Open
15,Niels Rook,Single-ply,SBD,M,1988,,Netherlands,138.29,325,-335,-335,325,215,-220,-220,215,-285,285,290,290,830,120+,Open
DQ,Hans Magne Bårtvedt,Single-ply,SBD,M,1983,,Norway,156.52,-395,395,407.5,407.5,-310,-310,-315,,335,347.5,360,360,,120+,Open
1,Wei-Ling Chen,Single-ply,SBD,F,1982,,Taiwan,46.29,177.5,185,190,190,80,85,-87.5,85,170,180,-190,180,455,47,Open
2,Yukako Fukushima,Single-ply,SBD,F,1970,,Japan,45.67,165,175,-180,175,-117.5,-117.5,117.5,117.5,150,157.5,-167.5,157.5,450,47,Open
3,Raija Koskinen-Jurkko,Single-ply,SBD,F,1963,,Finland,46.52,162.5,170,,170,90,95,-97.5,95,-145,150,157.5,157.5,422.5,47,Open
4,María Luisa Vásquez,Single-ply,SBD,F,1985,,Puerto Rico,46.14,162.5,167.5,-170,167.5,85,90,-92.5,90,145,152.5,-157.5,152.5,410,47,Open
5,Bénédicte LePanse,Single-ply,SBD,F,1978,,France,46.03,145,155,-162.5,155,85,90,92.5,92.5,145,152.5,157.5,157.5,405,47,Open
DQ,Ilka Schwengl-Forsthuber,Single-ply,SBD,F,1965,,Austria,46.72,135,-140,-142.5,135,-107.5,-107.5,-107.5,,,,,,,47,Open
1,Natalia Salnikova,Single-ply,SBD,F,1986,,Russia,51.24,180,192.5,200,200,120,125,-130,125,165,175,180,180,505,52,Open
2,Vilma Ochoa Vargas,Single-ply,SBD,F,1980,,Ecuador,51.88,200,210,215,215,92.5,97.5,-100,97.5,167.5,177.5,-185,177.5,490,52,Open
3,Anastasiya Derevyanko,Single-ply,SBD,F,1987,,Ukraine,51.39,165,175,-185,175,100,107.5,112.5,112.5,170,-177.5,177.5,177.5,465,52,Open
4,Mailebis Oquendo,Single-ply,SBD,F,1987,,Venezuela,51.84,175,182.5,-190,182.5,87.5,92.5,95,95,175,-185,-185,175,452.5,52,Open
5,Irani Rodrigues Barbosa,Single-ply,SBD,F,1986,,Brazil,51.63,172.5,-180,-180,172.5,-97.5,97.5,-100,97.5,150,160,167.5,167.5,437.5,52,Open
6,Yi-Ju Chou,Single-ply,SBD,F,1980,,Taiwan,50.82,165,-172.5,-172.5,165,75,80,82.5,82.5,180,187.5,-195.5,187.5,435,52,Open
7,Suzanne Hartwig-Gary,Single-ply,SBD,F,1968,,USA,51.49,157.5,-167.5,167.5,167.5,87.5,92.5,-97.5,92.5,150,160,167.5,167.5,427.5,52,Open
8,Sanna Apuli,Single-ply,SBD,F,1981,,Finland,50.78,155,162.5,-167.5,162.5,82.5,87.5,-90,87.5,155,162.5,167.5,167.5,417.5,52,Open
9,Miia Liimatainen,Single-ply,SBD,F,1986,,Sweden,50.79,165,175,182.5,182.5,80,-85,-85,80,155,-165,-167.5,155,417.5,52,Open
10,Vanessa Martin,Single-ply,SBD,F,1976,,France,51.45,150,160,-162.5,160,87.5,90,92.5,92.5,145,150,152.5,152.5,405,52,Open
11,Mervi Sirkiä,Single-ply,SBD,F,1972,,Finland,51.84,-155,155,-160,155,90,-92.5,-92.5,90,155,160,-167.5,160,405,52,Open
12,Mika Teramura,Single-ply,SBD,F,1962,,Japan,51.83,135,142.5,-152.5,142.5,92.5,95,-100,95,142.5,150,-157.5,150,387.5,52,Open
13,Louise Edwards #1,Single-ply,SBD,F,1978,,UK,50.76,122.5,130,135,135,60,65,67.5,67.5,140,147.5,152.5,152.5,355,52,Open
14,Frances Báez,Single-ply,SBD,F,1988,,Puerto Rico,51.71,-120,120,125,125,60,65,-70,65,130,-135,-135,130,320,52,Open
1,Hartati Sri,Single-ply,SBD,F,1984,,Indonesia,56.38,205,215,-222.5,215,130,135,-140.5,135,180,190,195,195,545,57,Open
2,Hui-Chun Wu,Single-ply,SBD,F,1986,,Taiwan,56.21,-180,180,187.5,187.5,120,-127.5,-127.5,120,185,192.5,195,195,502.5,57,Open
3,Mervi Anita Rantamäki,Single-ply,SBD,F,1974,,Finland,56.88,195,200,205,205,-112.5,112.5,117.5,117.5,-170,170,180,180,502.5,57,Open
4,Tetyana Prymenchuk,Single-ply,SBD,F,1972,,Ukraine,56.94,187.5,200,-205,200,122.5,127.5,-130,127.5,175,-182.5,-182.5,175,502.5,57,Open
5,Adriana Cuta,Single-ply,SBD,F,1986,,Venezuela,56.9,182.5,190,-195,190,-90,-90,90,90,195,-202.5,-202.5,195,475,57,Open
6,Chien-Yu Chou,Single-ply,SBD,F,1982,,Taiwan,56.33,170,175,-177.5,175,90,97.5,-102.5,97.5,185,-192.5,-195,185,457.5,57,Open
7,Sara Gutierrez,Single-ply,SBD,F,1975,,Peru,55.79,175,182.5,187.5,187.5,82.5,-90,90,90,-165,170,177.5,177.5,455,57,Open
8,Maria Lindberg,Single-ply,SBD,F,1973,,Finland,56.2,162.5,170,-175,170,97.5,100,102.5,102.5,165,170,-177.5,170,442.5,57,Open
9,Pamela Bartz,Single-ply,SBD,F,1987,,USA,56,167.5,177.5,185,185,80,-85,-85,80,150,160,165,165,430,57,Open
10,Yukie Terada,Single-ply,SBD,F,1974,,Japan,56.91,-160,160,-170,160,90,-95,-95,90,160,167.5,175,175,425,57,Open
11,Sandra Wildeman,Single-ply,SBD,F,1979,,Netherlands,56.78,135,142.5,145,145,80,87.5,-90,87.5,130,-135,-135,130,362.5,57,Open
12,Jannitzzi Tapia,Single-ply,SBD,F,1994,,Puerto Rico,55.84,125,132.5,-145,132.5,60,65,-70,65,130,140,-147.5,140,337.5,57,Open
DQ,Xeniya Khan,Single-ply,SBD,F,1987,,Kazakhstan,56.93,190,-195,-197.5,190,115,117.5,-122.5,117.5,-187.5,-187.5,-187.5,,,57,Open
1,Larysa Soloviova,Single-ply,SBD,F,1978,,Ukraine,62.87,210,220,227.5,227.5,150,160,165.5,165.5,220,240,-245.5,240,633,63,Open
2,Noviana Sari,Single-ply,SBD,F,1984,,Indonesia,60.4,210,220,-230,220,125,132.5,142.5,142.5,215,225,-230,225,587.5,63,Open
3,Irina Poletaeva,Single-ply,SBD,F,1982,,Russia,62.49,-210,-215,215,215,150,157.5,-162.5,157.5,182.5,195,200,200,572.5,63,Open
4,Tetyana Akhmamyetyeva,Single-ply,SBD,F,1985,,Ukraine,62.8,220,-230.5,-230.5,220,145,150,152.5,152.5,185,197.5,-202.5,197.5,570,63,Open
5,Mayumi Kitamura,Single-ply,SBD,F,1967,,Japan,62.72,185,197.5,207.5,207.5,-150,150,157.5,157.5,180,190,192.5,192.5,557.5,63,Open
6,Alyssa Hitchcock,Single-ply,SBD,F,1984,,USA,62.12,195,205,-212.5,205,105,112.5,-117.5,112.5,205,-220,220,220,537.5,63,Open
7,Annymaryuth Amaya,Single-ply,SBD,F,1980,,Venezuela,62.06,200,210,-220,210,105,110,112.5,112.5,200,210,-212.5,210,532.5,63,Open
8,Cícera Tavares,Single-ply,SBD,F,1976,,Brazil,61.97,-197.5,-197.5,197.5,197.5,95,100,102.5,102.5,205,-210,-210,205,505,63,Open
9,Hege Berge,Single-ply,SBD,F,1982,,Norway,62.87,162.5,170,177.5,177.5,110,115,-117.5,115,-165,172.5,177.5,177.5,470,63,Open
10,Linda Kåda Høiland,Single-ply,SBD,F,1979,,Norway,61.11,165,175,-180,175,85,90,-92.5,90,170,180,185,185,450,63,Open
11,María Guðsteinsdóttir,Single-ply,SBD,F,1970,,Iceland,62.8,160,167.5,172.5,172.5,97.5,-102.5,-102.5,97.5,160,172.5,180,180,450,63,Open
12,Ann Kaczor Mary,Single-ply,SBD,F,1976,,Canada,62.91,160,-170,170,170,92.5,97.5,102.5,102.5,150,160,170,170,442.5,63,Open
13,Jeren Tuylieva,Single-ply,SBD,F,1991,,Turkmenistan,62.01,150,-162.5,162.5,162.5,75,80,,80,130,140,-145,140,382.5,63,Open
14,Rebeca Diaz,Single-ply,SBD,F,1985,,Puerto Rico,60.99,135,145,152.5,152.5,45,52.5,-60,52.5,125,137.5,-145,137.5,342.5,63,Open
1,Yulia Medvedeva,Single-ply,SBD,F,1986,,Russia,66.86,220,-237.5,-242.5,220,160,170,175,175,202.5,215,222.5,222.5,617.5,72,Open
2,Ana Rosa Castellain,Single-ply,SBD,F,1985,,Brazil,70.99,232.5,-248,248,248,150,157.5,-162.5,157.5,195,205,210,210,615.5,72,Open
3,Priscilla Ribic,Single-ply,SBD,F,1972,,USA,71.19,210,225,-235,225,125,-135,-135,125,-215,215,247.5,247.5,597.5,72,Open
4,Yelyzaveta Byruk,Single-ply,SBD,F,1988,,Ukraine,72,-225,225,232.5,232.5,-150,150,157.5,157.5,-207.5,-207.5,207.5,207.5,597.5,72,Open
5,Galina Potselueva,Single-ply,SBD,F,1980,,Russia,69.16,230,-240,-240,230,155,-165,165,165,190,-202.5,-202.5,190,585,72,Open
6,Inger Blikra,Single-ply,SBD,F,1961,,Norway,71.73,200,215,-220,215,130,135,-140,135,195,205,-212.5,205,555,72,Open
7,Rhaea Stinn,Single-ply,SBD,F,1988,,Canada,71.51,200,210,217.5,217.5,-140,140,145,145,177.5,190,-202.5,190,552.5,72,Open
8,Yosleinys Fernández,Single-ply,SBD,F,1984,,Venezuela,71.04,210,217.5,222.5,222.5,120,127.5,-132.5,127.5,200,-205,,200,550,72,Open
9,Annette Pedersen,Single-ply,SBD,F,1968,,Denmark,71.73,195,207.5,-215,207.5,117.5,122.5,-125,122.5,200,210,-215,210,540,72,Open
10,Ankie Timmers,Single-ply,SBD,F,1986,,Netherlands,71.77,-195,195,-200,195,-132.5,132.5,-137.5,132.5,202.5,212.5,-217.5,212.5,540,72,Open
11,Sarah Leighton,Single-ply,SBD,F,1979,,Canada,70.88,180,195,207.5,207.5,115,120,-127.5,120,165,175,187.5,187.5,515,72,Open
12,Nicole Steger,Single-ply,SBD,F,1981,,Germany,68.76,-182.5,182.5,190,190,107.5,-115,-115,107.5,195,202.5,207.5,207.5,505,72,Open
13,Veronica Opdal,Single-ply,SBD,F,1985,,Norway,71.61,187.5,-195,195,195,107.5,-112.5,-112.5,107.5,177.5,187.5,-192.5,187.5,490,72,Open
14,Ladys Burgos,Single-ply,SBD,F,1989,,Puerto Rico,72,-177.5,-177.5,177.5,177.5,85,90,92.5,92.5,175,182.5,-187.5,182.5,452.5,72,Open
15,Mahriban Zhumaniyazova,Single-ply,SBD,F,1988,,Turkmenistan,70.4,150,160,-170,160,100,-110,-110,100,-120,130,-140,130,390,72,Open
DQ,Johanna Kankus,Single-ply,SBD,F,1984,,Finland,71.37,210,-220,225,225,130,137.5,145,145,-180,-180,-180,,,72,Open
1,Olena Kozlova,Single-ply,SBD,F,1990,,Ukraine,78.89,-250,252.5,260,260,140,145,150,150,-230,230,250.5,250.5,660.5,84,Open
2,Ielja Strik,Single-ply,SBD,F,1973,,Netherlands,83.55,245,250,-252.5,250,160,167.5,172.5,172.5,-215,215,-220,215,637.5,84,Open
3,Liane Blyn,Single-ply,SBD,F,1972,,USA,81.71,215,227.5,237.5,237.5,157.5,-167.5,-167.5,157.5,205,215,220,220,615,84,Open
4,Heidi Hille Arnesen,Single-ply,SBD,F,1970,,Norway,81.78,230,235,240,240,137.5,142.5,145,145,205,215,220,220,605,84,Open
5,Svetlana Tsvetkova,Single-ply,SBD,F,1980,,Russia,78.22,225,232.5,-237.5,232.5,135,140,145,145,205,215,-222.5,215,592.5,84,Open
6,Karol Jimenez,Single-ply,SBD,F,1985,,Venezuela,73.11,190,200,210,210,130,135,140,140,200,-205,205,205,555,84,Open
7,Charlie Shotton-Gale,Single-ply,SBD,F,1983,,UK,83.82,-185,185,-195,185,-125,125,130,130,180,187.5,192.5,192.5,507.5,84,Open
8,Min-Chu Hung,Single-ply,SBD,F,1983,,Taiwan,83.75,175,,,175,150,157.5,170,170,130,-150,-150,130,475,84,Open
9,Joan Báez,Single-ply,SBD,F,1986,,Puerto Rico,78.97,-160,160,-170,160,100,110,-120,110,140,-155,155,155,425,84,Open
10,Maria Abarca Elizondo,Single-ply,SBD,F,1981,,Costa Rica,75.73,-150,150,-170,150,60,-75,-75,60,150,160,-175,160,370,84,Open
1,Ya-Wen Chang,Single-ply,SBD,F,1984,,Taiwan,88.17,225,245,255,255,135,142.5,147.5,147.5,205,222.5,235,235,637.5,84+,Open
2,Inna Orobets,Single-ply,SBD,F,1971,,Ukraine,106.72,235,242.5,-250,242.5,160,170,177.5,177.5,190,205,217.5,217.5,637.5,84+,Open
3,Brenda van der Meulen,Single-ply,SBD,F,1978,,Netherlands,112.31,205,220,227.5,227.5,165,175,180,180,180,190,-195,190,597.5,84+,Open
4,Ágnes Szabó,Single-ply,SBD,F,1988,,Hungary,108.23,210,220,230,230,-175,175,-180,175,160,175,-185,175,580,84+,Open
5,Elizabeth West,Single-ply,SBD,F,1986,,USA,98.3,217.5,230,240,240,107.5,-117.5,122.5,122.5,190,200,-210,200,562.5,84+,Open
6,Giselle Costas,Single-ply,SBD,F,1980,,Puerto Rico,99.6,185,-200,210,210,122.5,132.5,140,140,185,200,212.5,212.5,562.5,84+,Open
7,Judith Reitmann,Single-ply,SBD,F,1967,,Uruguay,86.78,-222.5,222.5,-235,222.5,120,125,-130,125,170,180,-190,180,527.5,84+,Open
DQ,Jie-Wen Chen,Single-ply,SBD,F,1990,,Taiwan,123.02,-245,245,-252.5,245,-135,-135,-135,,145,160,-170,160,,84+,Open
