Division,WeightClassKg,Place,Name,Team,BodyweightKg,Best3SquatKg,Best3BenchKg,Best3DeadliftKg,TotalKg,Equipment,Event,Sex,BirthDate
Girls,44.23,1,Brianna Caballero,San Marcos,43.59,108.86,47.63,113.4,269.89,Single-ply,SBD,F,
Girls,44.23,2,Victoria Varela,Port Lavaca Calhoun,43.09,83.91,40.82,99.79,224.53,Single-ply,SBD,F,
Girls,44.23,3,Jenny Navarrete,Kyle Lehman,43.54,81.65,34.02,88.45,204.12,Single-ply,SBD,F,
Girls,44.23,4,Deandra Avalos,Geronimo Navarro,39.46,70.31,47.63,81.65,199.58,Single-ply,SBD,F,
Girls,47.85,1,Jenni Venegas,Dripping Springs,46.45,117.93,56.7,124.74,299.37,Single-ply,SBD,F,
Girls,47.85,2,Miracle Gray,Dripping Springs,45.45,104.33,52.16,108.86,265.35,Single-ply,SBD,F,
Girls,47.85,3,Bella Henry,Geronimo Navarro,46.63,95.25,54.43,90.72,240.4,Single-ply,SBD,F,
Girls,47.85,4,Quiana Green,San Marcos,47.08,79.38,36.29,104.33,219.99,Single-ply,SBD,F,
Girls,51.94,1,Salma Anaya-Martinez,Port Lavaca Calhoun,51.62,136.08,74.84,138.35,349.27,Single-ply,SBD,F,
Girls,51.94,2,Payton Cox,Port Lavaca Calhoun,51.85,111.13,54.43,124.74,290.3,Single-ply,SBD,F,
Girls,51.94,3,Kamaryn Hernandez,Port Lavaca Calhoun,50.08,113.4,45.36,113.4,272.16,Single-ply,SBD,F,
Girls,51.94,4,Brianna Vega,Dripping Springs,49.99,81.65,43.09,99.79,224.53,Single-ply,SBD,F,
Girls,51.94,5,Anjanette Garcia,Kyle Lehman,50.8,88.45,36.29,90.72,215.46,Single-ply,SBD,F,
Girls,51.94,6,Kendall Gutierrez,Kyle Lehman,50.26,79.38,43.09,86.18,208.65,Single-ply,SBD,F,
Girls,51.94,7,Alyssa Mendez,Kyle Lehman,49.9,83.91,38.56,81.65,204.12,Single-ply,SBD,F,
Girls,51.94,DQ,Gia Ross,Seguin,51.71,,,,,Single-ply,SBD,F,
Girls,51.94,DQ,Kinley Rhodes,Seguin,51.62,97.52,,,,Single-ply,SBD,F,
Girls,56.02,1,Eh Nay Gay Hso,Port Lavaca Calhoun,55.16,163.29,68.04,145.15,376.48,Single-ply,SBD,F,
Girls,56.02,2,Kylie Yoemans,Seguin,54.98,97.52,49.9,113.4,260.82,Single-ply,SBD,F,
Girls,56.02,3,Leni Cruces-Rios,Dripping Springs,55.52,90.72,40.82,102.06,233.6,Single-ply,SBD,F,
Girls,56.02,DQ,Hannah Semlinger,Geronimo Navarro,55.79,,,,,Single-ply,SBD,F,
Girls,56.02,DQ,Rosie Orta,Port Lavaca Calhoun,55.79,,,,,Single-ply,SBD,F,
Girls,56.02,DQ,Criselda Facundo,San Marcos,55.79,,,,,Single-ply,SBD,F,
Girls,60.1,1,Halle Lanham,Geronimo Navarro,56.25,99.79,58.97,111.13,269.89,Single-ply,SBD,F,
Girls,60.1,2,Jessica Preslock,Seguin,59.06,97.52,49.9,106.59,254.01,Single-ply,SBD,F,
Girls,60.1,3,Itzel Riquejo,Kyle Lehman,56.79,92.99,38.56,108.86,240.4,Single-ply,SBD,F,
Girls,60.1,4,Abbie Leonard,Kyle Lehman,58.24,95.25,36.29,106.59,238.14,Single-ply,SBD,F,
Girls,60.1,5,Alex Avalos,Geronimo Navarro,59.6,86.18,45.36,88.45,219.99,Single-ply,SBD,F,
Girls,60.1,6,Luz Zuniga,Kyle Lehman,59.87,63.5,34.02,90.72,188.24,Single-ply,SBD,F,
Girls,60.1,DQ,Juliet Calderon,San Marcos,58.06,138.35,,,,Single-ply,SBD,F,
Girls,67.36,1,Katya Garza-Rodriguez,Port Lavaca Calhoun,62.01,145.15,58.97,131.54,335.66,Single-ply,SBD,F,
Girls,67.36,2,Brooke Carle,Geronimo Navarro,66.22,127.01,70.31,138.35,335.66,Single-ply,SBD,F,
Girls,67.36,3,Amasti Canales,Seguin,65.5,127.01,47.63,142.88,317.51,Single-ply,SBD,F,
Girls,67.36,4,Miriam Venegas,Dripping Springs,63,113.4,56.7,127.01,297.1,Single-ply,SBD,F,
Girls,67.36,5,Dana Kennedy,Dripping Springs,66.86,111.13,58.97,120.2,290.3,Single-ply,SBD,F,
Girls,67.36,6,Adyson Trevino,Seguin,64.5,111.13,47.63,129.27,288.03,Single-ply,SBD,F,
Girls,67.36,7,Sara Delgado,San Marcos,65.05,108.86,47.63,129.27,285.76,Single-ply,SBD,F,
Girls,67.36,8,Sarah Howard,Geronimo Navarro,65.59,108.86,70.31,99.79,278.96,Single-ply,SBD,F,
Girls,67.36,9,Kylie Yardas,Dripping Springs,64.32,113.4,52.16,111.13,276.69,Single-ply,SBD,F,
Girls,67.36,10,Rylie Flores,Dripping Springs,63.5,104.33,54.43,115.67,274.42,Single-ply,SBD,F,
Girls,67.36,11,Victoria Gutierrez,San Marcos,61.69,104.33,54.43,113.4,272.16,Single-ply,SBD,F,
Girls,67.36,12,Hailey Garner,Geronimo Navarro,64.5,99.79,61.23,92.99,254.01,Single-ply,SBD,F,
Girls,67.36,13,Anicia Lechuga,San Marcos,64.05,81.65,43.09,102.06,226.8,Single-ply,SBD,F,
Girls,67.36,14,Haley Pizzini,Seguin,63.59,68.04,34.02,83.91,185.97,Single-ply,SBD,F,
Girls,67.36,DQ,Madison Stringo,Port Lavaca Calhoun,67.13,,,,,Single-ply,SBD,F,
Girls,75.07,1,Vivian Galindo,Port Lavaca Calhoun,75.02,151.95,68.04,136.08,356.07,Single-ply,SBD,F,
Girls,75.07,2,Kaitlin Menchaca,Geronimo Navarro,70.76,122.47,81.65,124.74,328.85,Single-ply,SBD,F,
Girls,75.07,3,Alivia Avila,Seguin,74.3,113.4,58.97,124.74,297.1,Single-ply,SBD,F,
Girls,75.07,4,Arianna Prill,Kyle Lehman,73.53,129.27,52.16,111.13,292.57,Single-ply,SBD,F,
Girls,75.07,5,Riley Brittain,Seguin,68.86,106.59,52.16,120.2,278.96,Single-ply,SBD,F,
Girls,75.07,6,Ainsly Orme,Elgin,73.03,117.93,52.16,104.33,274.42,Single-ply,SBD,F,
Girls,75.07,7,Yuliana Navarro,Dripping Springs,73.39,97.52,38.56,124.74,260.82,Single-ply,SBD,F,
Girls,75.07,8,Dayla Palacios,Elgin,70.31,95.25,58.97,104.33,258.55,Single-ply,SBD,F,
Girls,75.07,9,Laisha Perez,Kyle Lehman,71.76,92.99,47.63,113.4,254.01,Single-ply,SBD,F,
Girls,75.07,10,Briana Craighead,Kyle Lehman,70.76,92.99,43.09,108.86,244.94,Single-ply,SBD,F,
Girls,75.07,DQ,Kayla DeLeon,Geronimo Navarro,74.84,,,,,Single-ply,SBD,F,
Girls,82.33,1,Noelia Rodas,Port Lavaca Calhoun,81.92,156.49,79.38,149.69,385.55,Single-ply,SBD,F,
Girls,82.33,2,Emilee Delarosa,Seguin,81.92,138.35,68.04,129.27,335.66,Single-ply,SBD,F,
Girls,82.33,3,Larissa Acosta,Kyle Lehman,82.28,140.61,47.63,138.35,326.59,Single-ply,SBD,F,
Girls,82.33,4,Marina Ramirez,Elgin,77.75,120.2,68.04,133.81,322.05,Single-ply,SBD,F,
Girls,82.33,5,Myckaela Patterson,Elgin,80.1,106.59,56.7,122.47,285.76,Single-ply,SBD,F,
Girls,82.33,6,Marcie Morales,Elgin,78.02,120.2,58.97,104.33,283.5,Single-ply,SBD,F,
Girls,82.33,7,Ezra Mendez,San Marcos,82.01,104.33,40.82,136.08,281.23,Single-ply,SBD,F,
Girls,82.33,8,Simone Swanson,Dripping Springs,80.29,113.4,61.23,104.33,278.96,Single-ply,SBD,F,
Girls,90.04,1,Kennedi Butcher,Port Lavaca Calhoun,87.63,185.97,113.4,181.44,480.81,Single-ply,SBD,F,
Girls,90.04,2,J'Lyssa Gonzales,San Marcos,88.72,156.49,70.31,145.15,371.95,Single-ply,SBD,F,
Girls,90.04,3,Lauryn Robledo,Geronimo Navarro,88.45,111.13,70.31,115.67,297.1,Single-ply,SBD,F,
Girls,90.04,4,Kaelin Earl,Seguin,84.23,120.2,52.16,106.59,278.96,Single-ply,SBD,F,
Girls,90.04,5,Lauren Kolbe,Seguin,88.18,92.99,47.63,111.13,251.74,Single-ply,SBD,F,
Girls,90.04,DQ,Aranza Zuniga-Hernandez,Elgin,89.81,,,,,Single-ply,SBD,F,
Girls,100.02,1,Cate Julius,Kyle Lehman,98.79,129.27,58.97,113.4,301.64,Single-ply,SBD,F,
Girls,100.02,2,Frida Lazcano,Kyle Lehman,97.07,111.13,52.16,115.67,278.96,Single-ply,SBD,F,
Girls,117.71,1,Angelina Calzada,Port Lavaca Calhoun,105.82,154.22,68.04,158.76,381.02,Single-ply,SBD,F,
Girls,117.71+,1,Kerrington Holiday,Elgin,139.8,165.56,77.11,170.1,412.77,Single-ply,SBD,F,
