Division,WeightClassKg,Place,Name,Team,BodyweightKg,Best3SquatKg,Best3BenchKg,Best3DeadliftKg,TotalKg,Equipment,Event,Sex,BirthDate
Boys,51.71,1,Crew Goodson,Lindale,40.73,83.91,40.82,95.25,219.99,Single-ply,SBD,M,
Boys,51.71,DQ,Colby Hardee,Athens,51.62,113.4,52.16,,,Single-ply,SBD,M,
Boys,55.79,1,Jacob Gray,Longview Pine Tree,55.52,161.03,83.91,142.88,387.82,Single-ply,SBD,M,
Boys,55.79,2,Henry Suggs,Frankston,55.52,131.54,65.77,120.2,317.51,Single-ply,SBD,M,
Boys,55.79,3,Joseph Cordova,Longview Pine Tree,55.79,113.4,54.43,127.01,294.84,Single-ply,SBD,M,
Boys,55.79,4,Jared Bickham,Maud,55.7,113.4,52.16,120.2,285.76,Single-ply,SBD,M,
Boys,55.79,DQ,Kadin Daniels,Maud,55.34,138.35,77.11,,,Single-ply,SBD,M,
Boys,59.87,1,Tristan Larson,Tyler Chapel Hill,58.06,158.76,74.84,172.37,405.97,Single-ply,SBD,M,
Boys,59.87,2,Tysen Pierce,Henderson,59.78,131.54,70.31,147.42,349.27,Single-ply,SBD,M,
Boys,59.87,3,Nathaniel Hall,Athens,58.42,138.35,77.11,131.54,347,Single-ply,SBD,M,
Boys,59.87,4,Cash Lee-Brown,Athens,57.97,115.67,70.31,122.47,308.44,Single-ply,SBD,M,
Boys,59.87,5,Isaiah Hardison,Joaquin,57.42,113.4,65.77,124.74,303.91,Single-ply,SBD,M,
Boys,59.87,6,Blazyn Saxson,Athens,58.42,111.13,61.23,129.27,301.64,Single-ply,SBD,M,
Boys,59.87,DQ,Memphis Dorsey,Lindale,59.42,158.76,81.65,,,Single-ply,SBD,M,
Boys,67.13,1,Dj Walton,Lindale,65.14,190.51,102.06,201.85,494.42,Single-ply,SBD,M,
Boys,67.13,2,Greg Kalulu,Longview Pine Tree,67.13,181.44,104.33,199.58,485.34,Single-ply,SBD,M,
Boys,67.13,3,Jeremiah Sheffie,Tyler Lee,66.68,183.7,99.79,170.1,453.59,Single-ply,SBD,M,
Boys,67.13,4,Bryce Gregory,Tyler Lee,64.95,163.29,106.59,172.37,442.25,Single-ply,SBD,M,
Boys,67.13,5,Daniel Cabrera,Tyler Chapel Hill,63.23,163.29,88.45,156.49,408.23,Single-ply,SBD,M,
Boys,67.13,6,Caleb Clemmons,Athens,65.41,165.56,95.25,142.88,403.7,Single-ply,SBD,M,
Boys,67.13,7,Nicholas Rodriguez,Tyler Chapel Hill,66.13,147.42,92.99,158.76,399.16,Single-ply,SBD,M,
Boys,67.13,8,Van Rainer,Tyler Lee,61.33,142.88,65.77,138.35,347,Single-ply,SBD,M,
Boys,67.13,9,Ryan Johnson,Van,64.59,129.27,72.57,136.08,337.93,Single-ply,SBD,M,
Boys,67.13,10,John Huss,Van,65.41,124.74,65.77,140.61,331.12,Single-ply,SBD,M,
Boys,67.13,11,Jacob Walker,Mabank,63.5,120.2,65.77,131.54,317.51,Single-ply,SBD,M,
Boys,67.13,12,Jason Christian,Van,64.5,117.93,61.23,124.74,303.91,Single-ply,SBD,M,
Boys,67.13,13,Jace Bramlett,Maud,62.6,104.33,58.97,106.59,269.89,Single-ply,SBD,M,
Boys,67.13,DQ,Nik Moody,Tyler Chapel Hill,63.96,142.88,,158.76,,Single-ply,SBD,M,
Boys,67.13,DQ,D'Cameron Walker,Henderson,67.04,215.46,138.35,,,Single-ply,SBD,M,
Boys,74.84,1,Jamichael Turman,Tyler Lee,72.3,233.6,131.54,215.46,580.6,Single-ply,SBD,M,
Boys,74.84,2,Keandre Nesbitt,Longview Pine Tree,71.76,213.19,113.4,226.8,553.38,Single-ply,SBD,M,
Boys,74.84,3,Henry Waggoner,Lindale,68.86,192.78,111.13,206.38,510.29,Single-ply,SBD,M,
Boys,74.84,4,JJ Beckfield,Frankston,68.4,165.56,115.67,176.9,458.13,Single-ply,SBD,M,
Boys,74.84,5,Giovanni Morales,Henderson,71.03,156.49,104.33,181.44,442.25,Single-ply,SBD,M,
Boys,74.84,6,Everado Cazares,Tyler Lee,73.3,172.37,83.91,181.44,437.72,Single-ply,SBD,M,
Boys,74.84,7,Nathaniel Sanchez,Longview Pine Tree,72.94,151.95,104.33,172.37,428.64,Single-ply,SBD,M,
Boys,74.84,8,Lucas Mahoney,Tyler Chapel Hill,74.03,170.1,92.99,163.29,426.38,Single-ply,SBD,M,
Boys,74.84,9,Justin Birch,Frankston,71.76,140.61,106.59,165.56,412.77,Single-ply,SBD,M,
Boys,74.84,10,Jory Smith,Mabank,69.94,145.15,104.33,156.49,405.97,Single-ply,SBD,M,
Boys,74.84,11,Reed Johnson,Van,74.21,165.56,86.18,113.4,365.14,Single-ply,SBD,M,
Boys,74.84,12,Seth Gaskin,Frankston,74.66,142.88,72.57,142.88,358.34,Single-ply,SBD,M,
Boys,74.84,13,Timber Crouch,Athens,69.4,142.88,74.84,138.35,356.07,Single-ply,SBD,M,
Boys,74.84,14,Keaton Bohannon,Mabank,68.22,124.74,79.38,136.08,340.19,Single-ply,SBD,M,
Boys,74.84,15,Grayson Smith,Maud,69.13,120.2,74.84,138.35,333.39,Single-ply,SBD,M,
Boys,74.84,16,Tristin Lee,Maud,68.04,115.67,79.38,136.08,331.12,Single-ply,SBD,M,
Boys,74.84,17,Logan Schwering,Athens,72.48,83.91,74.84,136.08,294.84,Single-ply,SBD,M,
Boys,82.1,1,Jayden Smith,Longview Pine Tree,81.92,285.76,145.15,242.67,673.58,Single-ply,SBD,M,
Boys,82.1,2,YaCorus Porter,Henderson,75.11,206.38,133.81,226.8,566.99,Single-ply,SBD,M,
Boys,82.1,3,Jaret Allen,Lindale,80.29,176.9,113.4,219.99,510.29,Single-ply,SBD,M,
Boys,82.1,4,John Cyrus,Henderson,75.3,174.63,113.4,215.46,503.49,Single-ply,SBD,M,
Boys,82.1,5,Gage Goose,Frankston,82.1,181.44,122.47,195.04,498.95,Single-ply,SBD,M,
Boys,82.1,6,Grant Foster,Frankston,79.38,183.7,122.47,165.56,471.74,Single-ply,SBD,M,
Boys,82.1,7,Jared Cook,Frankston,79.47,165.56,99.79,151.95,417.3,Single-ply,SBD,M,
Boys,82.1,8,Landon Bailey,Frankston,80.47,158.76,97.52,161.03,417.3,Single-ply,SBD,M,
Boys,82.1,9,Lukas Branson,Longview Pine Tree,79.92,147.42,92.99,163.29,403.7,Single-ply,SBD,M,
Boys,82.1,10,Caleb Chase,Mabank,77.2,154.22,92.99,142.88,390.09,Single-ply,SBD,M,
Boys,82.1,11,Mason Moffatt,Van,77.29,145.15,97.52,129.27,371.95,Single-ply,SBD,M,
Boys,82.1,12,Billy Hopkins,Mabank,75.57,129.27,77.11,136.08,342.46,Single-ply,SBD,M,
Boys,82.1,13,Brandon Guerrero,Athens,75.48,122.47,68.04,131.54,322.05,Single-ply,SBD,M,
Boys,82.1,14,Cody McMichael,Athens,77.66,102.06,68.04,117.93,288.03,Single-ply,SBD,M,
Boys,89.81,1,Patrick Martinez,Longview Pine Tree,88.09,308.44,163.29,283.5,755.23,Single-ply,SBD,M,
Boys,89.81,2,Klayton House,Athens,88.63,226.8,145.15,210.92,582.87,Single-ply,SBD,M,
Boys,89.81,3,Jacob Taylor,Henderson,88.36,197.31,122.47,201.85,521.63,Single-ply,SBD,M,
Boys,89.81,4,Brandon Browning,Mabank,82.46,151.95,95.25,161.03,408.23,Single-ply,SBD,M,
Boys,99.79,1,Ethan Thornton,Lindale,90.63,272.16,151.95,258.55,682.66,Single-ply,SBD,M,
Boys,99.79,2,Adrian Lacy,Tyler Chapel Hill,96.89,226.8,142.88,233.6,603.28,Single-ply,SBD,M,
Boys,99.79,3,Juan Perez,Frankston,94.08,226.8,124.74,249.48,601.01,Single-ply,SBD,M,
Boys,99.79,4,Colton Munoz,Longview Pine Tree,92.44,192.78,140.61,219.99,553.38,Single-ply,SBD,M,
Boys,99.79,5,Gabe Hart,Lindale,99.79,183.7,97.52,192.78,474,Single-ply,SBD,M,
Boys,99.79,6,John Pope,Mabank,92.26,176.9,117.93,174.63,469.47,Single-ply,SBD,M,
Boys,99.79,7,Sean Minehart,Tyler Lee,98.7,154.22,99.79,170.1,424.11,Single-ply,SBD,M,
Boys,99.79,8,Corey Johnson,Tyler Chapel Hill,92.8,154.22,90.72,147.42,392.36,Single-ply,SBD,M,
Boys,99.79,9,Kolby Smith,Mabank,91.44,138.35,72.57,149.69,360.61,Single-ply,SBD,M,
Boys,99.79,10,Zach Carranza,Athens,98.61,90.72,79.38,102.06,272.16,Single-ply,SBD,M,
Boys,109.77,1,Jd Reazin,Tyler Chapel Hill,107.59,215.46,120.2,219.99,555.65,Single-ply,SBD,M,
Boys,109.77,2,Eujayvion McAllister,Henderson,107.23,210.92,136.08,188.24,535.24,Single-ply,SBD,M,
Boys,109.77,3,Willie Figueroa,Tyler Lee,108.59,208.65,97.52,204.12,510.29,Single-ply,SBD,M,
Boys,109.77,4,Kade Fry,Tyler Lee,109.5,183.7,102.06,165.56,451.32,Single-ply,SBD,M,
Boys,124.74,1,Brayden Price,Tyler Chapel Hill,117.93,303.91,158.76,226.8,689.46,Single-ply,SBD,M,
Boys,124.74,2,Devin Fields,Henderson,118.57,226.8,147.42,226.8,601.01,Single-ply,SBD,M,
Boys,124.74,3,Raul Carrasco,Mabank,120.2,247.21,127.01,217.72,591.94,Single-ply,SBD,M,
Boys,124.74,4,Moses Medrano,Lindale,117.48,233.6,136.08,206.38,576.06,Single-ply,SBD,M,
Boys,124.74,5,Roberto Miranda,Henderson,119.39,226.8,136.08,208.65,571.53,Single-ply,SBD,M,
Boys,124.74,6,Tariq Robinson,Tyler Lee,111.04,226.8,151.95,174.63,553.38,Single-ply,SBD,M,
Boys,124.74,7,Donovon Jordan,Tyler Lee,115.3,208.65,117.93,226.8,553.38,Single-ply,SBD,M,
Boys,124.74,8,Trey Hudson,Tyler Chapel Hill,112.04,224.53,142.88,183.7,551.11,Single-ply,SBD,M,
Boys,124.74,9,Caleb Otten,Van,119.93,183.7,108.86,181.44,474,Single-ply,SBD,M,
Boys,124.74,10,Spencer Shinn,Van,114.49,163.29,122.47,170.1,455.86,Single-ply,SBD,M,
Boys,124.74,DQ,Aj Hill,Athens,119.66,226.8,,,,Single-ply,SBD,M,
Boys,124.74+,1,Matthew Davis,Lindale,180.53,362.87,176.9,276.69,816.47,Single-ply,SBD,M,
Boys,124.74+,2,Jessie Hamelinck,Lindale,127.91,306.17,181.44,256.28,743.89,Single-ply,SBD,M,
Boys,124.74+,3,Luke Sandifer,Lindale,125.19,219.99,131.54,219.99,571.53,Single-ply,SBD,M,
Boys,124.74+,4,Brycelen Phillips,Longview Pine Tree,130.27,181.44,136.08,226.8,544.31,Single-ply,SBD,M,
Boys,124.74+,5,Jadarlon Key,Longview Pine Tree,143.43,195.04,113.4,226.8,535.24,Single-ply,SBD,M,
Boys,124.74+,6,Samuel Quintanilla,Henderson,125.1,210.92,115.67,197.31,523.9,Single-ply,SBD,M,
Boys,124.74+,7,Mason Adams,Henderson,130.27,219.99,115.67,188.24,523.9,Single-ply,SBD,M,
Boys,124.74+,DQ,Garrett Hays,Athens,139.34,,,,,Single-ply,SBD,M,
