Division,WeightClassKg,Place,Name,Team,BodyweightKg,Best3SquatKg,Best3BenchKg,Best3DeadliftKg,TotalKg,Equipment,Event,Sex
Boys,51.71,1,Diego Rivera,Mexia,48.53,140.61,65.77,131.54,337.93,Single-ply,SBD,M
Boys,51.71,2,Marcos Dominguez,Buffalo,51.26,111.13,58.97,124.74,294.84,Single-ply,SBD,M
Boys,51.71,3,Ethan Stack,Scurry-Rosser,48.99,106.59,61.23,124.74,292.57,Single-ply,SBD,M
Boys,51.71,4,Bobby Sanchez,Centerville,51.71,124.74,54.43,111.13,290.3,Single-ply,SBD,M
Boys,51.71,5,Corbin Donoho,Corsicana Mildred,50.8,99.79,52.16,117.93,269.89,Single-ply,SBD,M
Boys,51.71,6,Micah Thompson,Teague,50.35,95.25,54.43,108.86,258.55,Single-ply,SBD,M
Boys,55.79,1,Chase Kirby,Dawson,55.34,145.15,72.57,145.15,362.87,Single-ply,SBD,M
Boys,55.79,2,Alec Bailey,Mexia,53.98,145.15,65.77,138.35,349.27,Single-ply,SBD,M
Boys,55.79,3,Brodie Cantu,Dawson,54.43,124.74,83.91,136.08,344.73,Single-ply,SBD,M
Boys,55.79,4,Juan Sanchez,Mexia,54.43,127.01,70.31,142.88,340.19,Single-ply,SBD,M
Boys,55.79,5,Chris Soria,Buffalo,54.43,136.08,61.23,138.35,335.66,Single-ply,SBD,M
Boys,55.79,6,Jason Zarate,Centerville,53.98,92.99,52.16,102.06,247.21,Single-ply,SBD,M
Boys,59.87,1,Tylor Chandler,Scurry-Rosser,58.06,158.76,70.31,188.24,417.3,Single-ply,SBD,M
Boys,59.87,2,Bryan Sofo,Wolfe City,59.42,149.69,83.91,167.83,401.43,Single-ply,SBD,M
Boys,59.87,3,Jordan Ramirez,Palmer,59.87,140.61,81.65,161.03,383.29,Single-ply,SBD,M
Boys,59.87,4,Cameron Yates,Scurry-Rosser,57.15,147.42,77.11,156.49,381.02,Single-ply,SBD,M
Boys,59.87,5,David McAlpine,Buffalo,59.87,145.15,77.11,156.49,378.75,Single-ply,SBD,M
Boys,59.87,6,Kris Jordan,Trinity,57.61,145.15,79.38,149.69,374.21,Single-ply,SBD,M
Boys,59.87,7,Josh Cota,Trinity,59.42,145.15,83.91,145.15,374.21,Single-ply,SBD,M
Boys,59.87,8,Jose Hinojosa,Moody,58.51,136.08,81.65,145.15,362.87,Single-ply,SBD,M
Boys,59.87,9,Clay Conway,Mabank,58.51,151.95,70.31,138.35,360.61,Single-ply,SBD,M
Boys,59.87,10,Dillon Beshears,Buffalo,58.97,133.81,72.57,136.08,342.46,Single-ply,SBD,M
Boys,59.87,11,Christian Zarate,Centerville,59.87,102.06,70.31,124.74,297.1,Single-ply,SBD,M
Boys,59.87,12,Tristian Bailey,Buffalo,58.97,115.67,61.23,113.4,290.3,Single-ply,SBD,M
Boys,67.13,1,Wesley McCrary,Wolfe City,67.13,190.51,129.27,190.51,510.29,Single-ply,SBD,M
Boys,67.13,2,Adrien Higginbothem,Mabank,64.86,188.24,104.33,183.7,476.27,Single-ply,SBD,M
Boys,67.13,3,Decovan Echols,Mexia,66.22,192.78,90.72,176.9,460.4,Single-ply,SBD,M
Boys,67.13,4,Nick Harris,Madisonville,63.96,179.17,97.52,176.9,453.59,Single-ply,SBD,M
Boys,67.13,5,Jalleen Picket,Madisonville,61.69,174.63,88.45,170.1,433.18,Single-ply,SBD,M
Boys,67.13,6,Trey Minefee,Corsicana Mildred,65.77,161.03,99.79,163.29,424.11,Single-ply,SBD,M
Boys,67.13,7,Ellis Reyes,Madisonville,63.96,156.49,106.59,158.76,421.84,Single-ply,SBD,M
Boys,67.13,8,Dylan Walker,Moody,67.13,154.22,86.18,161.03,401.43,Single-ply,SBD,M
Boys,67.13,9,Brandon Blond,Mansfield Timberview,62.14,161.03,77.11,156.49,394.63,Single-ply,SBD,M
Boys,67.13,10,Nick Snodgrass,Blooming Grove,64.86,145.15,65.77,163.29,374.21,Single-ply,SBD,M
Boys,67.13,11,Garridan Henderson,Fairfield,65.77,127.01,63.5,136.08,326.59,Single-ply,SBD,M
Boys,67.13,DQ,Daniel Camarillo,Blooming Grove,66.68,,,,,Single-ply,SBD,M
Boys,67.13,DQ,David Dilbeck,Blooming Grove,65.32,,,,,Single-ply,SBD,M
Boys,74.84,1,Leo Guerro,Trinity,73.94,183.7,124.74,199.58,508.02,Single-ply,SBD,M
Boys,74.84,2,Jacob McLean,Scurry-Rosser,70.31,201.85,111.13,188.24,501.22,Single-ply,SBD,M
Boys,74.84,3,John Botello,Lorena,72.12,185.97,95.25,204.12,485.34,Single-ply,SBD,M
Boys,74.84,4,Abraham Sanchez,Centerville,73.03,165.56,120.2,192.78,478.54,Single-ply,SBD,M
Boys,74.84,5,Brysien Cross,Tyler Chapel Hill,73.03,147.42,97.52,215.46,460.4,Single-ply,SBD,M
Boys,74.84,6,Sergio Villareal,Centerville,68.04,183.7,102.06,167.83,453.59,Single-ply,SBD,M
Boys,74.84,7,Thomas Wright,Moody,73.48,147.42,92.99,165.56,405.97,Single-ply,SBD,M
Boys,82.1,1,Tavion Hall,Kerens,81.65,272.16,149.69,249.48,671.32,Single-ply,SBD,M
Boys,82.1,2,Haiden Zarate,Centerville,78.02,210.92,124.74,210.92,546.58,Single-ply,SBD,M
Boys,82.1,3,Donovan Roper,Mansfield Timberview,78.47,210.92,136.08,195.04,542.04,Single-ply,SBD,M
Boys,82.1,4,Eric Shaw,Lone Oak,75.3,199.58,133.81,183.7,517.1,Single-ply,SBD,M
Boys,82.1,5,Brett Ramsey,Moody,80.74,213.19,102.06,199.58,514.83,Single-ply,SBD,M
Boys,82.1,6,DeAndre Hordge,Tyler Chapel Hill,81.19,204.12,106.59,183.7,494.42,Single-ply,SBD,M
Boys,82.1,7,Trey Williams,Centerville,78.02,165.56,120.2,185.97,471.74,Single-ply,SBD,M
Boys,82.1,8,Tyler Parker,Centerville,78.93,154.22,111.13,154.22,419.57,Single-ply,SBD,M
Boys,82.1,9,Owen Awalt,Fairfield,80.74,136.08,70.31,136.08,342.46,Single-ply,SBD,M
Boys,82.1,10,Chris Henson,Moody,79.83,145.15,,136.08,281.23,Single-ply,SD,M
Boys,82.1,DQ,Mason Alcaraz,Red Oak Life,79.83,,,,,Single-ply,SD,M
Boys,89.81,1,Daniel Ramos,Mansfield Timberview,89.36,258.55,142.88,240.4,641.83,Single-ply,SBD,M
Boys,89.81,2,Michael Coleman #6,Mansfield Timberview,88.9,213.19,136.08,229.06,578.33,Single-ply,SBD,M
Boys,89.81,3,Blake Mitchell,Lorena,88.45,199.58,113.4,213.19,526.17,Single-ply,SBD,M
Boys,89.81,4,Jesse Landess,Scurry-Rosser,83.91,195.04,120.2,190.51,505.76,Single-ply,SBD,M
Boys,89.81,5,Rodrigo Morales,Teague,88.9,204.12,92.99,204.12,501.22,Single-ply,SBD,M
Boys,89.81,6,Derian Graham,Centerville,82.37,170.1,111.13,183.7,464.93,Single-ply,SBD,M
Boys,89.81,7,Tucker Davis,Fairfield,89.27,158.76,106.59,149.69,415.04,Single-ply,SBD,M
Boys,99.79,1,Reggie King,Tyler Chapel Hill,97.07,251.74,165.56,222.26,639.57,Single-ply,SBD,M
Boys,99.79,2,Valentine Odidi,Mansfield Timberview,97.07,242.67,142.88,231.33,616.89,Single-ply,SBD,M
Boys,99.79,3,Keanu Fathal,Corsicana Mildred,95.25,233.6,140.61,215.46,589.67,Single-ply,SBD,M
Boys,99.79,4,Arkeil Winn,Mexia,98.88,247.21,113.4,217.72,578.33,Single-ply,SBD,M
Boys,99.79,5,Cooper Haigood,Lorena,94.8,238.14,113.4,213.19,564.72,Single-ply,SBD,M
Boys,99.79,6,Ricky Zamora,Corsicana Mildred,96.62,217.72,115.67,210.92,544.31,Single-ply,SBD,M
Boys,99.79,7,Eli Crawford,Kerens,97.07,210.92,108.86,222.26,542.04,Single-ply,SBD,M
Boys,99.79,8,Jacob Gomez,Teague,97.07,204.12,127.01,206.38,537.51,Single-ply,SBD,M
Boys,99.79,9,Arron Pfleeger,Fairfield,96.62,226.8,104.33,195.04,526.17,Single-ply,SBD,M
Boys,99.79,10,Josh Wiggins,Blooming Grove,97.07,192.78,111.13,195.04,498.95,Single-ply,SBD,M
Boys,99.79,11,Xavier Cole,Blooming Grove,95.71,192.78,90.72,181.44,464.93,Single-ply,SBD,M
Boys,99.79,12,Tracer Largent,Centerville,97.98,172.37,104.33,167.83,444.52,Single-ply,SBD,M
Boys,99.79,13,Jacob Allred,Fairfield,92.99,158.76,90.72,181.44,430.91,Single-ply,SBD,M
Boys,109.77,1,Victor Mejia,Palmer,107.95,274.42,142.88,254.01,671.32,Single-ply,SBD,M
Boys,109.77,2,Reagan Cloud,Corsicana Mildred,108.41,260.82,154.22,219.99,635.03,Single-ply,SBD,M
Boys,109.77,3,Jose Reyes,Mexia,107.95,251.74,145.15,229.06,625.96,Single-ply,SBD,M
Boys,109.77,4,Andrew Dawson,Tyler Chapel Hill,105.87,238.14,131.54,215.46,585.13,Single-ply,SBD,M
Boys,109.77,5,Jimmy Landess,Scurry-Rosser,109.77,215.46,120.2,226.8,562.45,Single-ply,SBD,M
Boys,109.77,6,Jeremy Wood,Fairfield,102.97,240.4,136.08,181.44,557.92,Single-ply,SBD,M
Boys,109.77,7,Cole Schick,Fairfield,102.97,226.8,113.4,158.76,498.95,Single-ply,SBD,M
Boys,109.77,8,Ricky Linton,Blooming Grove,106.14,190.51,113.4,172.37,476.27,Single-ply,SBD,M
Boys,109.77,9,Austin Hale,Fairfield,104.33,195.04,97.52,181.44,474,Single-ply,SBD,M
Boys,109.77,10,Cj Denman,Centerville,102.69,183.7,108.86,156.49,449.06,Single-ply,SBD,M
Boys,109.77,11,Gonzalo Arreguin,Tyler Chapel Hill,109.68,226.8,185.97,,412.77,Single-ply,SB,M
Boys,109.77,12,Joey Maltos,Buffalo,108.23,226.8,138.35,,365.14,Single-ply,SB,M
Boys,124.74,1,Ryan Mitchell #2,Teague,122.02,362.87,204.12,265.35,832.34,Single-ply,SBD,M
Boys,124.74,2,Leal Sample,Scurry-Rosser,111.58,260.82,185.97,265.35,712.14,Single-ply,SBD,M
Boys,124.74,3,Colton Robinett,Groesbeck,116.57,240.4,145.15,231.33,616.89,Single-ply,SBD,M
Boys,124.74,4,Ja'Coby Paul,Terrell,118.84,233.6,165.56,215.46,614.62,Single-ply,SBD,M
Boys,124.74,5,Lane Michna,Lorena,112.94,249.48,127.01,235.87,612.35,Single-ply,SBD,M
Boys,124.74,6,Benito Rivas,Buffalo,112.94,204.12,127.01,195.04,526.17,Single-ply,SBD,M
Boys,124.74+,1,Michael Williams,Dawson,165.11,272.16,136.08,215.46,623.69,Single-ply,SBD,M
Boys,124.74+,2,Brandon Brumbelow,Kerens,130.63,254.01,136.08,208.65,598.74,Single-ply,SBD,M
Boys,,NS,Trederek Anglin,Mexia,,,,,,Single-ply,SBD,M
Boys,,NS,Rahi Patel,Mexia,,,,,,Single-ply,SBD,M
Boys,,NS,Darius Dorsey,Mexia,,,,,,Single-ply,SBD,M
Boys,,NS,Corley Crouch,Madisonville,,,,,,Single-ply,SBD,M
