Division,WeightClassKg,Place,Name,Team,BodyweightKg,Best3SquatKg,Best3BenchKg,Best3DeadliftKg,TotalKg,Equipment,Event,Sex
Boys,51.71,1,Jacques Spikes,Jasper,50.8,104.33,72.57,111.13,288.03,Single-ply,SBD,M
Boys,55.79,1,Cody Antilley,Pineland West Sabine,54.43,113.4,65.77,124.74,303.91,Single-ply,SBD,M
Boys,55.79,DQ,Jonavon Limbrick,Jasper,54.88,,,,,Single-ply,SBD,M
Boys,59.87,1,Cayle Bickham,Jasper,59.87,92.99,61.23,113.4,267.62,Single-ply,SBD,M
Boys,59.87,2,Casey Cox,Hemphill,59.87,86.18,68.04,106.59,260.82,Single-ply,SBD,M
Boys,59.87,DQ,William Norman,Jasper,58.97,,,,,Single-ply,SBD,M
Boys,67.13,1,Chance Mays,Jasper,61.23,106.59,70.31,156.49,333.39,Single-ply,SBD,M
Boys,67.13,2,Sam McFarland,Jasper,61.23,102.06,83.91,142.88,328.85,Single-ply,SBD,M
Boys,67.13,DQ,Thomas Deleon,Hemphill,61.69,,,,,Single-ply,SBD,M
Boys,67.13,DQ,Blake Hardwick,Hemphill,67.13,,45.36,90.72,,Single-ply,SBD,M
Boys,74.84,1,Jordan Jones,Pineland West Sabine,74.84,197.31,147.42,204.12,548.85,Single-ply,SBD,M
Boys,74.84,2,Deion Sharp,Newton,73.48,165.56,102.06,204.12,471.74,Single-ply,SBD,M
Boys,74.84,3,Stephon Johnson,Newton,71.21,147.42,108.86,181.44,437.72,Single-ply,SBD,M
Boys,74.84,4,Michael Byerly,Newton,72.57,142.88,102.06,163.29,408.23,Single-ply,SBD,M
Boys,74.84,5,Danny Davis,Hemphill,68.04,129.27,99.79,154.22,383.29,Single-ply,SBD,M
Boys,74.84,6,Mack Wagner,Newton,68.95,124.74,92.99,145.15,362.87,Single-ply,SBD,M
Boys,74.84,7,Chester Bell,Hemphill,68.04,102.06,90.72,163.29,356.07,Single-ply,SBD,M
Boys,74.84,8,Christopher Fowler,Jasper,73.03,83.91,65.77,142.88,292.57,Single-ply,SBD,M
Boys,74.84,9,Clint Ellis,Jasper,74.84,92.99,63.5,124.74,281.23,Single-ply,SBD,M
Boys,74.84,DQ,Dante Brooks,Jasper,68.04,,,,,Single-ply,SBD,M
Boys,74.84,DQ,G Morrow,Newton,71.67,,,,,Single-ply,SBD,M
Boys,74.84,DQ,C. Williams,Newton,73.03,,,,,Single-ply,SBD,M
Boys,74.84,DQ,D. Simmons,Newton,68.49,,,,,Single-ply,SBD,M
Boys,74.84,DQ,Jesse Cain,Pineland West Sabine,74.84,,99.79,183.7,,Single-ply,SBD,M
Boys,82.1,1,Karrion Morrisey,Jasper,75.75,161.03,120.2,188.24,469.47,Single-ply,SBD,M
Boys,82.1,2,Kevin Clark,Newton,78.02,149.69,83.91,195.04,428.64,Single-ply,SBD,M
Boys,82.1,3,Aj Cupps,Jasper,81.65,172.37,83.91,145.15,401.43,Single-ply,SBD,M
Boys,82.1,4,Dillon LeBlanc,Hemphill,81.65,97.52,83.91,145.15,326.59,Single-ply,SBD,M
Boys,82.1,DQ,Matt Thomas,Hemphill,81.65,,104.33,206.38,,Single-ply,SBD,M
Boys,89.81,1,Matt Glenn,Newton,83.91,190.51,142.88,229.06,562.45,Single-ply,SBD,M
Boys,89.81,2,Chris Pegues,Newton,85.28,179.17,106.59,199.58,485.34,Single-ply,SBD,M
Boys,89.81,3,Mike Larkin,Newton,88.45,174.63,111.13,183.7,469.47,Single-ply,SBD,M
Boys,89.81,4,Justin Mays,Jasper,88,165.56,102.06,188.24,455.86,Single-ply,SBD,M
Boys,89.81,5,Michael Moore #7,Hemphill,88,124.74,92.99,181.44,399.16,Single-ply,SBD,M
Boys,89.81,6,Jaimoy Cratic,Jasper,88.45,147.42,92.99,142.88,383.29,Single-ply,SBD,M
Boys,89.81,7,Aaron Smith,Pineland West Sabine,83.91,136.08,83.91,154.22,374.21,Single-ply,SBD,M
Boys,89.81,DQ,B. Watson,Newton,86.64,,,,,Single-ply,SBD,M
Boys,89.81,DQ,J. Hunter,Newton,84.82,,,,,Single-ply,SBD,M
Boys,89.81,DQ,Robert Irving,Hemphill,88,172.37,,210.92,,Single-ply,SBD,M
Boys,99.79,1,Blake Edminson,Pineland West Sabine,97.52,183.7,122.47,188.24,494.42,Single-ply,SBD,M
Boys,99.79,2,Evan Fuller,Newton,97.07,170.1,115.67,188.24,474,Single-ply,SBD,M
Boys,99.79,3,Justin Tillman,Jasper,97.98,190.51,115.67,165.56,471.74,Single-ply,SBD,M
Boys,99.79,4,Daniel Benjamin,Newton,97.52,170.1,113.4,158.76,442.25,Single-ply,SBD,M
Boys,99.79,5,Zack Bronson,Jasper,90.72,142.88,120.2,165.56,428.64,Single-ply,SBD,M
Boys,99.79,6,Brady Duffy,Pineland West Sabine,90.72,142.88,92.99,149.69,385.55,Single-ply,SBD,M
Boys,99.79,DQ,Jonathan Verdin,Pineland West Sabine,92.99,,104.33,151.95,,Single-ply,SBD,M
Boys,99.79,DQ,Taylhr Miller,Jasper,92.53,102.06,,151.95,,Single-ply,SBD,M
Boys,99.79,DQ,Bryce Edwards,Jasper,96.62,,,,,Single-ply,SBD,M
Boys,109.77,1,David Burnet,Hemphill,104.33,174.63,142.88,210.92,528.44,Single-ply,SBD,M
Boys,109.77,2,Anthony Grisby,Hemphill,104.33,174.63,113.4,188.24,476.27,Single-ply,SBD,M
Boys,109.77,3,Devante Green,Newton,101.6,161.03,102.06,163.29,426.38,Single-ply,SBD,M
Boys,109.77,4,Kevin Diggles,Newton,105.23,176.9,97.52,142.88,417.3,Single-ply,SBD,M
Boys,109.77,5,Anthony Wade,Jasper,105.69,156.49,95.25,136.08,387.82,Single-ply,SBD,M
Boys,109.77,6,Taylor Sowell,Hemphill,103.87,79.38,61.23,120.2,260.82,Single-ply,SBD,M
Boys,124.74,1,Krishon Seastrunk,Newton,116.12,294.84,120.2,272.16,687.19,Single-ply,SBD,M
Boys,124.74,2,Garrett Bellamy,Jasper,112.49,172.37,124.74,192.78,489.88,Single-ply,SBD,M
Boys,124.74,3,Brett Childs,Newton,124.28,183.7,106.59,176.9,467.2,Single-ply,SBD,M
Boys,124.74,DQ,Keegan Preston,Jasper,117.03,133.81,,142.88,,Single-ply,SBD,M
Boys,124.74+,1,Redrick Adams,Newton,129.27,206.38,102.06,192.78,501.22,Single-ply,SBD,M
Boys,124.74+,DQ,Jaruis Adams,Jasper,147.42,158.76,,226.8,,Single-ply,SBD,M
