Sex,Division,WeightClassKg,Name,BirthYear,BodyweightKg,Squat1Kg,Squat2Kg,Squat3Kg,Best3SquatKg,Bench1Kg,Bench2Kg,Bench3Kg,Best3BenchKg,Deadlift1Kg,Deadlift2Kg,Deadlift3Kg,Best3DeadliftKg,TotalKg,Place,Event,Equipment
M,Open,74,Alberto Bettarel,1993,72.77,195,202.5,210,210,147.5,155,160,160,200,212.5,-222.5,212.5,582.5,6,SBD,Raw
F,Open,63,Alessandra Quaranta,1993,62.69,115,122.5,127.5,127.5,62.5,67.5,-70,67.5,137.5,150,-170,150,345,6,SBD,Raw
M,Open,120,Alessandro Lo Grieco,1986,110.53,220,235,-242.5,235,152.5,160,165,165,265,282.5,292.5,292.5,692.5,5,SBD,Raw
F,Open,57,Alessia Leugio,1990,55.47,122.5,127.5,-130,127.5,67.5,70,72.5,72.5,152.5,162.5,167.5,167.5,367.5,1,SBD,Raw
M,Junior,93,Andrea Angella,1995,93,215,230,235,235,150,160,-162.5,160,260,272.5,-277.5,272.5,667.5,1,SBD,Raw
M,Open,120,Andrea Avico,1993,115.05,245,257.5,262.5,262.5,-157.5,160,-167.5,160,245,265,-272.5,265,687.5,6,SBD,Raw
M,Junior,66,Andrea Castello,1995,65.44,187.5,195,205,205,-117.5,122.5,-127.5,122.5,215,-227.5,241.5,241.5,569,2,SBD,Raw
M,Open,74,Andrea Di Matteo,1989,72.07,185,195,205,205,130,135,-140,135,210,220,-232.5,220,560,8,SBD,Raw
M,Junior,66,Andrea Drusin,1996,65.44,180,192.5,200,200,112.5,120,-122.5,120,205,215,222.5,222.5,542.5,3,SBD,Raw
M,Open,74,Antimo Cembalo,1989,73.06,190,197.5,-200,197.5,122.5,130,132.5,132.5,230,250,267.5,267.5,597.5,2,SBD,Raw
M,Open,105,Antonino De Pasquale,1989,101.06,230,-245,245,245,170,-177.5,-177.5,170,250,270,277.5,277.5,692.5,4,SBD,Raw
M,Junior,83,Antonio Gorga,1995,81.93,222.5,237,-240,237,150,155,157.5,157.5,265,280,-285,280,674.5,3,SBD,Raw
M,Open,74,Antonio Tarantino,1989,71.65,200,215,220,220,122.5,130,137.5,137.5,220,240,-250,240,597.5,1,SBD,Raw
F,Open,57,Barbara Cicchinè,1987,56.87,115,117.5,120,120,57.5,-60,60,60,127.5,137.5,145,145,325,3,SBD,Raw
F,Junior,57,Benedetta Squillante,1995,56.87,117.5,125,130,130,85,90,93.5,93.5,132.5,142.5,-147.5,142.5,366,1,SBD,Raw
F,Open,63,Carola Garra,1994,62.45,160,170,,170,115,122.5,130,130,160,175,182.5,182.5,482.5,1,SBD,Raw
F,Open,63,Chiara De Marco,1986,60.92,112.5,117.5,120,120,55,-60,-60,55,145,-155,-155,145,320,9,SBD,Raw
F,Open,52,Chiara Volpato,1994,50.62,85,90,-92.5,90,-57.5,-57.5,-57.5,,-130,-130,,,,DQ,SBD,Raw
M,Open,74,Claudio Forti,1983,72.49,200,207.5,-212.5,207.5,117.5,122.5,125,125,240,250,-257.5,250,582.5,5,SBD,Raw
M,Junior,83,Cometti Emilio Cotti,1995,82.68,230,238,243,243,150,-160,160,160,270,290,-295,290,693,1,SBD,Raw
M,Open,83,Cristiano Zanotelli,1989,82.68,200,210,-215,210,150,-155,-155,150,250,-260,265,265,625,7,SBD,Raw
F,Open,52,Dalida Mari,1987,52,125,132.5,-137.5,132.5,75,80,-82,80,-125,135,-142.5,135,347.5,2,SBD,Raw
M,Junior,93,Daniele Dal Boni,1996,92.96,200,210,-215,210,145,-152.5,-152.5,145,260,275,293,293,648,3,SBD,Raw
M,Open,105,Daniele Miggiano,1991,101.65,-212.5,230,242.5,242.5,130,140,-145,140,260,275,282.5,282.5,665,8,SBD,Raw
M,Open,74,Daniele Rusconi,1985,72.6,202.5,-212.5,-212.5,202.5,115,120,-122.5,120,210,220,230,230,552.5,9,SBD,Raw
M,Junior,83,David Carer,1997,80.72,222.5,232.5,-240,232.5,-140,-145,145,145,240,-255,-265,240,617.5,4,SBD,Raw
M,Open,93,Davide Balconi,1990,92.34,200,215,-225,215,130,140,142.5,142.5,240,260,-270,260,617.5,10,SBD,Raw
M,Open,93,Davide Bartolone,1991,92.15,-220,230,240,240,150,160,-170,160,250,265,-275,265,665,6,SBD,Raw
M,Open,105,Davide Bettiol,1986,101.58,220,230,237.5,237.5,130,-135,-135,130,-290,300,305,305,672.5,6,SBD,Raw
M,Open,93,Davide Degrati,1995,91.37,220,230,-240,230,155,160,-165,160,245,260,267.5,267.5,657.5,7,SBD,Raw
M,Open,93,Domingo Poliandri,1983,92.23,240,247.5,252.5,252.5,167.5,177.5,180,180,255,267.5,277.5,277.5,710,3,SBD,Raw
F,Sub-Junior,72,Drusilla Coan,2001,63.22,110,115,120,120,83,88,90.5,90.5,-135,135,152.5,152.5,363,1,SBD,Raw
M,Open,74,Eder Piccinin,1993,73.02,200,-210,-215,200,115,120,-125,120,225,232.5,-237.5,232.5,552.5,10,SBD,Raw
F,Master I,47,Elena Borgatti,1969,45.83,105,-110,-110,105,50,52.5,-55,52.5,127.5,132.5,137.5,137.5,295,1,SBD,Raw
F,Open,84,Elisa Bellini,1988,78.59,140,145,150,150,92.5,-97.5,-100,92.5,140,150,157.5,157.5,400,2,SBD,Raw
F,Junior,57,Elisa Gozzi,1997,54.82,110,115,117.5,117.5,60,62.5,-65,62.5,125,130,-137.5,130,310,2,SBD,Raw
M,Junior,83,Enrico Scarcia,1996,82.56,210,220,230,230,137.5,145,-150,145,272.5,292.5,302.5,302.5,677.5,2,SBD,Raw
M,Open,120,Enzo Falvo,1988,118.49,270,282.5,287.5,287.5,172.5,-177.5,177.5,177.5,272.5,277.5,-282.5,277.5,742.5,1,SBD,Raw
F,Open,63,Eugenia Orlando,1989,62.42,135,-145,145,145,80,85,-87.5,85,150,162.5,-170,162.5,392.5,3,SBD,Raw
M,Open,93,Fabrizio Posca,1991,92.75,240,260,275,275,170,180,-185,180,280,300,320.5,320.5,775.5,1,SBD,Raw
M,Open,120,Federico Andreon,1994,109.47,-245,250,260,260,155,165,-170,165,270,-290,-290,270,695,3,SBD,Raw
M,Open,74,Federico Martella,1990,72.5,205,212.5,-217.5,212.5,137.5,142.5,-147.5,142.5,225,235,240,240,595,3,SBD,Raw
M,Junior,66,Federico Murru,1995,64.34,185,195,204,204,152.5,156.5,158.5,158.5,205,212.5,-220,212.5,575,1,SBD,Raw
M,Open,120+,Francesco Pelizza,1986,123.99,240,255,260,260,160,172.5,180,180,255,270,275,275,715,1,SBD,Raw
M,Open,93,Gabriele Baccaglini,1983,91.54,250,265,272.5,272.5,147.5,155,160,160,260,272.5,-280,272.5,705,4,SBD,Raw
M,Junior,105,Gabriele Schiavo,1998,100.91,215,225,-235,225,140,145,150,150,265,285,-300.5,285,660,2,SBD,Raw
M,Open,105,Gabriele Verga,1994,99.32,235,250,260,260,175,185,-190,185,285,310,325,325,770,3,SBD,Raw
M,Open,83,George Lupas,1993,81.46,227.5,235,240,240,142.5,147.5,152.5,152.5,-280,290,302,302,694.5,1,SBD,Raw
M,Open,93,Gianluca D'Antonio,1991,92.4,235,245,250,250,132.5,140,145,145,220,240,260,260,655,8,SBD,Raw
M,Junior,120,Gianluca Galletto,1995,117.61,250,-260.5,265,265,175,180.5,183,183,285,295,315,315,763,1,SBD,Raw
M,Open,93,Gianluca Martino,1991,91.63,230,240,250,250,157.5,165,-170,165,270,-290,-295,270,685,5,SBD,Raw
M,Junior,93,Gianmarco Corrà,1995,91.6,240,252.5,-260,252.5,130,137.5,-145,137.5,245,265,-280,265,655,2,SBD,Raw
M,Junior,59,Giosuè Filippini,1996,58.56,135,-145,-153,135,90,-95,-95,90,180,190,-200,190,415,1,SBD,Raw
M,Open,74,Giovannino Pinna,1987,73.33,170,180,-185,180,137.5,145,150,150,215,-227.5,-230,215,545,11,SBD,Raw
F,Open,63,Giulia Collerone,1992,60.82,117.5,125,130,130,72.5,77.5,80,80,132.5,140,147.5,147.5,357.5,5,SBD,Raw
F,Open,63,Giulia Cominotti,1994,61.31,105,112.5,-120,112.5,65,-70,70,70,145,152.5,-162.5,152.5,335,7,SBD,Raw
F,Sub-Junior,63,Giulia Zandavali,2000,60.38,100,107.5,112.5,112.5,70,72.5,-75,72.5,120,130,-135,130,315,1,SBD,Raw
M,Open,83,Giuseppe Manca,1990,81.44,245,260.5,265.5,265.5,145,152.5,-155,152.5,255,275,-287.5,275,693,2,SBD,Raw
F,Open,63,Ilaria Del Rio,1992,60.03,117.5,125,-132.5,125,70,72.5,-75,72.5,157.5,162.5,165,165,362.5,4,SBD,Raw
M,Open,93,Jacopo Cavanna,1994,90.63,190,202.5,-210,202.5,160,167.5,-172.5,167.5,220,235,-245,235,605,11,SBD,Raw
F,Junior,57,Laura Selita,1999,55.05,-90,90,-97.5,90,57.5,60,62.5,62.5,-140,-145,-151.5,,,DQ,SBD,Raw
F,Open,72,Lorena Gambaretto,1985,71.52,122.5,130,137.5,137.5,-67.5,-67.5,67.5,67.5,157.5,167.5,172.5,172.5,377.5,2,SBD,Raw
M,Junior,105,Lorenzo Cerveri,1995,103.19,225,240,-242.5,240,150,160,-165,160,240,260,-272.5,260,660,3,SBD,Raw
M,Open,83,Lorenzo Lupo,1993,81.94,230,240,-250,240,155,162.5,167.5,167.5,245,257.5,262.5,262.5,670,5,SBD,Raw
M,Master I,120,Luigi Brivio,1976,114.74,245,260,266,266,160,165,-170,165,225,240,-250,240,671,1,SBD,Raw
F,Open,72,Luisa Torrisi,1982,69.91,130,140,-145,140,72.5,-77.5,-77.5,72.5,140,150,155,155,367.5,3,SBD,Raw
M,Open,74,Marco Dantone,1992,73.4,170,-180,180,180,150,155,-160,155,215,230,-240,230,565,7,SBD,Raw
M,Junior,74,Marco Poda,1995,72.78,180,-192.5,-195,180,127.5,135,140,140,217.5,230,-237.5,230,550,2,SBD,Raw
F,Open,52,Maruska Bertoli,1979,51.11,115,122.5,130,130,65,72.5,-77.5,72.5,135,145,150,150,352.5,1,SBD,Raw
M,Master I,83,Massimiliano Buccioni,1976,82.47,215,225,230.5,230.5,137.5,142.5,-145.5,142.5,240,250,-260,250,623,1,SBD,Raw
M,Master I,120+,Massimo Sgaramella,1977,183.4,255,272.5,280,280,190,200,208,208,255,265,275,275,763,1,SBD,Raw
M,Sub-Junior,93,Matteo Masciarelli,2000,88.54,215,225,235,235,120,127.5,-132.5,127.5,235,255,-262.5,255,617.5,1,SBD,Raw
M,Open,83,Matteo Moretto,1988,81.39,240,250,255,255,162.5,170,172.5,172.5,230,250,-270,250,677.5,3,SBD,Raw
M,Open,120,Matteo Recchia,1987,110.33,250,260,267.5,267.5,135,140,-145,140,290,305,-310,305,712.5,2,SBD,Raw
M,Open,120+,Mattia Cravedi,1994,127.57,-240,240,252.5,252.5,150,-160,160,160,250,270,-297.5,270,682.5,3,SBD,Raw
M,Open,93,Mattia Perazzuolo,1992,90.78,230,245,255,255,145,152.5,155,155,270,290,300,300,710,2,SBD,Raw
M,Open,120,Mattia Tenerelli,1994,115.74,-220,230,240,240,147.5,-155,155,155,260,280,300,300,695,4,SBD,Raw
M,Junior,105,Mauro Oldani,1995,99.93,230,240,250,250,155,-162.5,-162.5,155,250,265,-275,265,670,1,SBD,Raw
M,Open,120+,Michele Peluso,1979,141.93,255,270,280,280,175,182.5,190,190,240,-260,-260,240,710,2,SBD,Raw
M,Open,83,Mirko Zecchinati,1989,81.75,200,210,217.5,217.5,140,-145,-145,140,230,240,-245,240,597.5,8,SBD,Raw
M,Open,59,Moris Redini,1990,58.18,172.5,182.5,191.5,191.5,117.5,125,130.5,130.5,210,221.5,-232,221.5,543.5,1,SBD,Raw
F,Open,47,Rachele Randone,1985,45.91,95,97.5,102.5,102.5,45,47.5,50,50,125,132.5,142.5,142.5,295,1,SBD,Raw
F,Master I,63,Raffaella Cachia,1977,62.14,105,112.5,-120,112.5,57.5,-60,-60,57.5,135,142.5,150,150,320,2,SBD,Raw
M,Junior,74,Riccardo Angelini,1997,72.51,225,235,-245,235,150,157.5,162.5,162.5,240,255,270.5,270.5,668,1,SBD,Raw
M,Open,105,Riccardo Zanti,1992,105,240,250,-260,250,150,157.5,162.5,162.5,270,280,-282.5,280,692.5,5,SBD,Raw
F,Master I,52,Roberta Monaco,1975,51.67,105,110,-115.5,110,65,67.5,68,68,140,150,156,156,334,1,SBD,Raw
M,Open,105,Rocco Grillo,1994,103.18,275,290,300,300,175,185,-190,185,280,300,305,305,790,2,SBD,Raw
F,Open,72,Sara Mazzantini,1990,68.52,150,160,-167.5,160,100,-107.5,-107.5,100,190,200,205.5,205.5,465.5,1,SBD,Raw
F,Open,63,Sara Naldi,1998,61.92,140,147.5,150,150,72.5,75,77.5,77.5,162.5,170.5,175.5,175.5,403,2,SBD,Raw
F,Open,84,Silvia Gobbi,1992,75.9,120,-127.5,127.5,127.5,75,77.5,80,80,152.5,160,-165,160,367.5,3,SBD,Raw
F,Open,57,Silvia Prosperi,1992,55.29,122.5,127.5,132.5,132.5,70,75,-77.5,75,140,150,-155,150,357.5,2,SBD,Raw
F,Master I,63,Simona Lapustea,1977,62.14,125,130.5,135,135,57.5,-60,62.5,62.5,135,142.5,145.5,145.5,343,1,SBD,Raw
M,Open,105,Simone Calabretto,1992,98.74,237.5,250,260,260,147.5,155,160,160,235,250,-260,250,670,7,SBD,Raw
M,Open,93,Simone Vito Belsanti,1983,88.78,215,-222.5,227.5,227.5,140,150,-155,150,240,250,255,255,632.5,9,SBD,Raw
F,Junior,52,Sonia Berengan,1995,51.4,95,-100,100,100,60,62.5,-65,62.5,-120,-120,120,120,282.5,1,SBD,Raw
M,Open,83,Stefano Turnone,1990,82.4,217.5,230,237.5,237.5,160,170,-175,170,250,267.5,-277.5,267.5,675,4,SBD,Raw
M,Open,66,Thomas Gambella,1985,65.52,170,177.5,182.5,182.5,115,-120,-120,115,185,192.5,-197.5,192.5,490,1,SBD,Raw
M,Open,105,Umberto Fava,1992,104.23,-215,215,227.5,227.5,155,160,165,165,235,250,-262.5,250,642.5,9,SBD,Raw
F,Open,84,Valentina Barbieri,1989,82.35,175,182.5,190,190,92.5,97.5,100,100,190,200,-210,200,490,1,SBD,Raw
M,Open,105,Valentino Durastanti,1992,103.46,275,290,-300,290,157.5,162.5,-167.5,162.5,292.5,310,338,338,790.5,1,SBD,Raw
M,Open,74,Vasco Artino,1986,73.6,190,202.5,210,210,122.5,130,-135,130,230,245,-257.5,245,585,4,SBD,Raw
F,Open,63,Verdiana Mineo,1991,62.07,115,122.5,130,130,60,-67.5,-67.5,60,125,132.5,-137.5,132.5,322.5,8,SBD,Raw
M,Open,83,Vittorio Matichecchia,1992,81.57,220,230,-235,230,130,137.5,145,145,250,267.5,275,275,650,6,SBD,Raw
