Division,WeightClassKg,Place,Name,Team,BodyweightKg,Best3SquatKg,Best3BenchKg,Best3DeadliftKg,TotalKg,Equipment,Event,Sex
Boys,51.71,1,Davious Murrelle,Greenville,48.08,174.63,68.04,151.95,394.63,Single-ply,SBD,M
Boys,55.79,1,Bryan Rodriguez,Greenville,53.07,151.95,70.31,136.08,358.34,Single-ply,SBD,M
Boys,55.79,2,Kyle Stewart,Greenville,54.43,131.54,72.57,127.01,331.12,Single-ply,SBD,M
Boys,67.13,1,Austin Helton,Caddo Mills,66.5,167.83,92.99,170.1,430.91,Single-ply,SBD,M
Boys,67.13,2,Ahmad Johnson,Greenville,63.05,181.44,83.91,158.76,424.11,Single-ply,SBD,M
Boys,67.13,3,Willie Crawford,Lancaster,67.13,142.88,92.99,158.76,394.63,Single-ply,SBD,M
Boys,67.13,4,Alejandro Vasquez,Greenville,61.23,158.76,79.38,154.22,392.36,Single-ply,SBD,M
Boys,67.13,5,Stephen Sikes,Caddo Mills,66.68,142.88,81.65,136.08,360.61,Single-ply,SBD,M
Boys,74.84,1,Jacob Jenkins #3,Caddo Mills,69.85,181.44,97.52,219.99,498.95,Single-ply,SBD,M
Boys,74.84,2,Michael Williams,Lancaster,72.57,124.74,102.06,174.63,401.43,Single-ply,SBD,M
Boys,74.84,3,Joe Moreno,Greenville,73.48,142.88,95.25,156.49,394.63,Single-ply,SBD,M
Boys,82.1,1,Lester Turner,Greenville,82.1,238.14,106.59,226.8,571.53,Single-ply,SBD,M
Boys,82.1,2,Nick Butler,Caddo Mills,80.74,208.65,122.47,235.87,566.99,Single-ply,SBD,M
Boys,82.1,3,Armando Aguilar,Caddo Mills,81.83,217.72,127.01,208.65,553.38,Single-ply,SBD,M
Boys,82.1,DQ,Zach Tippett,Caddo Mills,81.83,156.49,,,,Single-ply,SBD,M
Boys,82.1,DQ,Giancarlo Belteton,Greenville,75.3,163.29,92.99,,,Single-ply,SBD,M
Boys,89.81,1,Chris Taylor,Caddo Mills,89.63,263.08,140.61,238.14,641.83,Single-ply,SBD,M
Boys,89.81,2,Colt Cooper,Caddo Mills,86.18,195.04,117.93,190.51,503.49,Single-ply,SBD,M
Boys,89.81,3,Daniel Bueno,Greenville,83.91,192.78,95.25,183.7,471.74,Single-ply,SBD,M
Boys,89.81,4,Jaylon Estelle,Lancaster,89.36,158.76,111.13,192.78,462.66,Single-ply,SBD,M
Boys,89.81,5,Kalvin Gordon,Lancaster,86.18,151.95,102.06,185.97,439.98,Single-ply,SBD,M
Boys,99.79,1,Justin Pate,Caddo Mills,90.72,226.8,115.67,222.26,564.72,Single-ply,SBD,M
Boys,99.79,2,Xavier Newman,Lancaster,99.34,181.44,140.61,206.38,528.44,Single-ply,SBD,M
Boys,99.79,3,Brett Harrington,Caddo Mills,92.26,197.31,113.4,204.12,514.83,Single-ply,SBD,M
Boys,99.79,4,Chaucey Hamilton,Lancaster,97.07,192.78,120.2,188.24,501.22,Single-ply,SBD,M
Boys,109.77,1,Hazma Hanan,Lancaster,104.33,204.12,120.2,197.31,521.63,Single-ply,SBD,M
Boys,109.77,2,Tyler Menard,Caddo Mills,108.86,210.92,117.93,181.44,510.29,Single-ply,SBD,M
Boys,124.74,1,Jacob McCain,Caddo Mills,112.94,226.8,129.27,226.8,582.87,Single-ply,SBD,M
Boys,124.74,2,Wisdom Sapan,Lancaster,121.56,192.78,136.08,231.33,560.19,Single-ply,SBD,M
Boys,124.74+,1,Matt Kelley,Caddo Mills,138.35,344.73,170.1,249.48,764.3,Single-ply,SBD,M
Boys,124.74+,2,Jacob Pulley,Caddo Mills,136.98,226.8,120.2,208.65,555.65,Single-ply,SBD,M
Boys,124.74+,3,Brenden Lewis,Lancaster,158.76,181.44,145.15,226.8,553.38,Single-ply,SBD,M
Boys,124.74+,4,Jonathan Govan,Lancaster,133.81,197.31,133.81,197.31,528.44,Single-ply,SBD,M
