Division,WeightClassKg,Place,Name,Team,BodyweightKg,Best3SquatKg,Best3BenchKg,Best3DeadliftKg,TotalKg,Equipment,Event,Sex,BirthDate
Boys,51.71,1,Kirstin Dana,Kirbyville,51.71,127.01,72.57,136.08,335.66,Single-ply,SBD,M,
Boys,51.71,2,Jose Ruiz,Diboll,49.26,129.27,,136.08,265.35,Single-ply,SD,M,
Boys,55.79,1,Lukthaddeus Collins,Jasper,55.43,190.51,102.06,199.58,492.15,Single-ply,SBD,M,
Boys,55.79,2,Jaydan Flemmons,Jasper,52.16,142.88,86.18,167.83,396.89,Single-ply,SBD,M,
Boys,55.79,3,Shmar Garrett,Carthage,55.16,147.42,88.45,158.76,394.63,Single-ply,SBD,M,
Boys,55.79,4,Henry Suggs,Frankston,55.61,131.54,70.31,136.08,337.93,Single-ply,SBD,M,
Boys,59.87,1,Jacob Stephens,Nacogdoches,57.97,108.86,63.5,124.74,297.1,Single-ply,SBD,M,
Boys,67.13,1,Andre Thomas,Jasper,63.87,174.63,129.27,179.17,483.08,Single-ply,SBD,M,
Boys,67.13,2,Ja'khiryon Whitaker,Nacogdoches,62.32,154.22,88.45,195.04,437.72,Single-ply,SBD,M,
Boys,67.13,3,Daniel White,Huntington,66.68,165.56,97.52,170.1,433.18,Single-ply,SBD,M,
Boys,67.13,4,Creshawn Larkin,Jasper,61.14,142.88,70.31,154.22,367.41,Single-ply,SBD,M,
Boys,67.13,5,Taylor Pride,Huntington,65.86,58.97,36.29,81.65,176.9,Single-ply,SBD,M,
Boys,74.84,1,James Pulliam,Jasper,74.3,206.38,131.54,229.06,566.99,Single-ply,SBD,M,
Boys,74.84,2,Hunter Mayes,Huntington,72.21,188.24,113.4,192.78,494.42,Single-ply,SBD,M,
Boys,74.84,3,John Cunyus,Henderson,74.21,163.29,111.13,204.12,478.54,Single-ply,SBD,M,
Boys,74.84,4,Byrone Grant,Jasper,73.03,170.1,120.2,183.7,474,Single-ply,SBD,M,
Boys,74.84,5,Marcus Parnell,Jasper,70.94,167.83,117.93,183.7,469.47,Single-ply,SBD,M,
Boys,74.84,6,Giovanni Morales,Henderson,71.4,170.1,111.13,181.44,462.66,Single-ply,SBD,M,
Boys,74.84,7,Justin Birch,Frankston,71.94,158.76,111.13,165.56,435.45,Single-ply,SBD,M,
Boys,74.84,8,Jacob Smith,Huntington,74.03,140.61,83.91,161.03,385.55,Single-ply,SBD,M,
Boys,74.84,9,Leo Sanchez,Diboll,68.13,149.69,79.38,151.95,381.02,Single-ply,SBD,M,
Boys,74.84,10,Seth Gaskin,Frankston,73.48,151.95,70.31,158.76,381.02,Single-ply,SBD,M,
Boys,74.84,11,Perrin Teer,Huntington,69.31,90.72,72.57,149.69,312.98,Single-ply,SBD,M,
Boys,82.1,1,Cason Chandler,Jasper,79.83,226.8,142.88,222.26,591.94,Single-ply,SBD,M,
Boys,82.1,2,Nikiethen Hafford,Jasper,81.1,201.85,108.86,183.7,494.42,Single-ply,SBD,M,
Boys,82.1,3,Nick Moore #3,Lufkin,81.56,183.7,95.25,204.12,483.08,Single-ply,SBD,M,
Boys,82.1,4,Devin St Cyr,Kirbyville,79.2,161.03,106.59,172.37,439.98,Single-ply,SBD,M,
Boys,82.1,5,Kayden Caraway,Jasper,77.47,156.49,72.57,181.44,410.5,Single-ply,SBD,M,
Boys,82.1,6,Karson Smith,Diboll,76.57,156.49,83.91,154.22,394.63,Single-ply,SBD,M,
Boys,89.81,1,Khaden Maxie,Lufkin,88.36,181.44,120.2,233.6,535.24,Single-ply,SBD,M,
Boys,89.81,2,Jacob Taylor,Henderson,88.18,197.31,120.2,215.46,532.97,Single-ply,SBD,M,
Boys,89.81,3,LonDariuos Pleasant,Nacogdoches,84.37,183.7,102.06,197.31,483.08,Single-ply,SBD,M,
Boys,89.81,4,Devin Dempsey,Kirbyville,89.27,185.97,108.86,188.24,483.08,Single-ply,SBD,M,
Boys,89.81,5,Jaylon Jackson,Diboll,84.91,197.31,99.79,183.7,480.81,Single-ply,SBD,M,
Boys,89.81,6,Parker O'Bannion,Kirbyville,87.63,199.58,95.25,163.29,458.13,Single-ply,SBD,M,
Boys,89.81,7,Tyler Fridinger,Frankston,83.1,151.95,99.79,204.12,455.86,Single-ply,SBD,M,
Boys,89.81,8,Bladden Troquille,Carthage,88.9,165.56,79.38,174.63,419.57,Single-ply,SBD,M,
Boys,89.81,9,Trenton Hamilton,Diboll,87.27,154.22,106.59,156.49,417.3,Single-ply,SBD,M,
Boys,89.81,10,Jackson Warden,Lufkin,84.37,149.69,92.99,170.1,412.77,Single-ply,SBD,M,
Boys,89.81,11,Camorian Thacker,Nacogdoches,89.63,,,183.7,183.7,Single-ply,D,M,
Boys,99.79,1,Juan D Perez,Frankston,95.53,233.6,136.08,258.55,628.23,Single-ply,SBD,M,
Boys,99.79,2,Hayden McLeroy,Diboll,98.34,247.21,133.81,235.87,616.89,Single-ply,SBD,M,
Boys,99.79,3,Bryce Owens,Lufkin,99.61,229.06,140.61,242.67,612.35,Single-ply,SBD,M,
Boys,99.79,4,Stacey Whitaker,Nacogdoches,99.43,215.46,136.08,183.7,535.24,Single-ply,SBD,M,
Boys,99.79,5,Landon Dodge,Diboll,93.89,197.31,117.93,206.38,521.63,Single-ply,SBD,M,
Boys,99.79,6,Enrique Contreras,Lufkin,94.17,181.44,120.2,183.7,485.34,Single-ply,SBD,M,
Boys,99.79,7,Javeris Riley-Hafford,Jasper,93.17,151.95,117.93,188.24,458.13,Single-ply,SBD,M,
Boys,99.79,8,Evan Ehrlich,Lufkin,91.17,158.76,95.25,183.7,437.72,Single-ply,SBD,M,
Boys,99.79,9,Tim Lancaster,Kirbyville,92.71,176.9,83.91,167.83,428.64,Single-ply,SBD,M,
Boys,99.79,10,Zane Reynolds,Huntington,93.44,149.69,88.45,181.44,419.57,Single-ply,SBD,M,
Boys,99.79,11,Trent Mosby,Lufkin,91.17,151.95,90.72,165.56,408.23,Single-ply,SBD,M,
Boys,99.79,12,Sinh An,Nacogdoches,90.72,138.35,83.91,165.56,387.82,Single-ply,SBD,M,
Boys,99.79,13,Colby Kniepp,Carthage,94.08,142.88,99.79,142.88,385.55,Single-ply,SBD,M,
Boys,99.79,14,Sam Flack,Lufkin,97.2,,113.4,201.85,315.25,Single-ply,BD,M,
Boys,109.77,1,Kayson Elijah,Lufkin,109.59,226.8,154.22,247.21,628.23,Single-ply,SBD,M,
Boys,109.77,2,Chase Calhoun,Huntington,101.7,240.4,108.86,226.8,576.06,Single-ply,SBD,M,
Boys,109.77,3,Aidan Henson,Huntington,102.51,222.26,136.08,215.46,573.79,Single-ply,SBD,M,
Boys,109.77,4,Eujayvion McAlister,Henderson,109.13,238.14,138.35,197.31,573.79,Single-ply,SBD,M,
Boys,109.77,5,Wilburn Smallwood,Lufkin,103.28,192.78,117.93,226.8,537.51,Single-ply,SBD,M,
Boys,109.77,6,Devin Luker,Huntington,105.32,208.65,111.13,204.12,523.9,Single-ply,SBD,M,
Boys,109.77,7,Damorian Thacker,Nacogdoches,107.41,222.26,102.06,199.58,523.9,Single-ply,SBD,M,
Boys,109.77,8,Grant Wilson,Huntington,104.87,208.65,90.72,215.46,514.83,Single-ply,SBD,M,
Boys,109.77,9,Damyan Rojas,Diboll,106.87,195.04,115.67,183.7,494.42,Single-ply,SBD,M,
Boys,109.77,10,Cody Stafford,Lufkin,102.51,165.56,90.72,183.7,439.98,Single-ply,SBD,M,
Boys,109.77,11,Kylon Lister,Carthage,105.69,165.56,111.13,163.29,439.98,Single-ply,SBD,M,
Boys,109.77,12,Larson Kay,Lufkin,101.15,142.88,111.13,151.95,405.97,Single-ply,SBD,M,
Boys,109.77,13,Juan Perez,Carthage,100.43,158.76,97.52,147.42,403.7,Single-ply,SBD,M,
Boys,109.77,14,Austin Grimes,Carthage,105.78,174.63,,136.08,310.71,Single-ply,SD,M,
Boys,124.74,1,Jimmy Soto,Nacogdoches,112.85,206.38,138.35,179.17,523.9,Single-ply,SBD,M,
Boys,124.74,2,Jamarion Johnson,Lufkin,115.94,192.78,95.25,219.99,508.02,Single-ply,SBD,M,
Boys,124.74,3,Quincy Coleman,Diboll,123.65,190.51,113.4,190.51,494.42,Single-ply,SBD,M,
Boys,124.74,4,Jermaine Thomas,Jasper,115.03,170.1,97.52,183.7,451.32,Single-ply,SBD,M,
Boys,124.74,5,Ethan Mendoza,Diboll,116.12,,127.01,210.92,337.93,Single-ply,BD,M,
Boys,124.74+,1,Shunmarkus Adams,Jasper,146.87,265.35,174.63,260.82,700.8,Single-ply,SBD,M,
Boys,124.74+,2,Andrew Culpepper,Huntington,146.24,244.94,142.88,240.4,628.23,Single-ply,SBD,M,
Boys,124.74+,3,Joshua Rigsby,Jasper,130.27,226.8,138.35,242.67,607.81,Single-ply,SBD,M,
Boys,124.74+,4,Riley Self,Lufkin,138.3,229.06,133.81,238.14,601.01,Single-ply,SBD,M,
Boys,124.74+,5,Karston Williams,Carthage,157.08,235.87,138.35,217.72,591.94,Single-ply,SBD,M,
Boys,124.74+,6,Kedaren Holman,Lufkin,130.18,208.65,115.67,258.55,582.87,Single-ply,SBD,M,
Boys,124.74+,7,Samuel Quintanilla,Henderson,126.01,238.14,124.74,217.72,580.6,Single-ply,SBD,M,
Boys,124.74+,8,Aaron Smith,Lufkin,152.09,231.33,142.88,195.04,569.26,Single-ply,SBD,M,
Boys,124.74+,9,Tre Jenkins,Lufkin,127.19,219.99,131.54,174.63,526.17,Single-ply,SBD,M,
Boys,124.74+,DQ,Tee Kellum,Carthage,147.78,,,,,Single-ply,SBD,M,
Boys,,NS,Kamazjay Deckard,Nacogdoches,,,,,,Single-ply,SBD,M,
