Division,WeightClassKg,Place,Name,Team,BodyweightKg,Best3SquatKg,Best3BenchKg,Best3DeadliftKg,TotalKg,Equipment,Event,Sex,BirthDate
Girls,44.23,1,Tory Fuller,Montgomery,43.91,70.31,45.36,81.65,197.31,Single-ply,SBD,F,
Girls,44.23,2,Kissa Hussian,New Caney Porter,44.09,86.18,40.82,70.31,197.31,Single-ply,SBD,F,
Girls,44.23,3,Peyton Payne,Willis,43.91,56.7,31.75,72.57,161.03,Single-ply,SBD,F,
Girls,44.23,4,Lairscey Griffin,Montgomery,42.73,52.16,29.48,61.23,142.88,Single-ply,SBD,F,
Girls,47.85,1,Mara Mather,New Caney,46.36,83.91,52.16,106.59,242.67,Single-ply,SBD,F,
Girls,47.85,2,Aniya Mitchell,Port Arthur Memorial,47.72,83.91,45.36,99.79,229.06,Single-ply,SBD,F,
Girls,47.85,3,Sadie Cary,Liberty,46.45,83.91,34.02,97.52,215.46,Single-ply,SBD,F,
Girls,47.85,4,Kamryn Vasquez,Conroe,47.81,83.91,31.75,79.38,195.04,Single-ply,SBD,F,
Girls,47.85,DQ,Jackie Ruiz,Houston Northbrook,46.72,,,,,Single-ply,SBD,F,
Girls,51.94,1,Yitzi Sosa,New Caney Porter,51.89,102.06,49.9,102.06,254.01,Single-ply,SBD,F,
Girls,51.94,2,Brianna Steichen,New Caney Porter,51.44,90.72,52.16,102.06,244.94,Single-ply,SBD,F,
Girls,51.94,3,Laine McDonald,Willis,48.63,90.72,36.29,88.45,215.46,Single-ply,SBD,F,
Girls,51.94,DQ,Melanie Villarreal,Crosby,48.44,,,,,Single-ply,SBD,F,
Girls,51.94,DQ,Leslie Torres,New Caney Porter,48.99,,,,,Single-ply,SBD,F,
Girls,51.94,DQ,Evelyn Mariles,Pasadena,50.44,72.57,27.22,,,Single-ply,SBD,F,
Girls,56.02,1,Celeste Grana,Liberty,55.43,104.33,47.63,106.59,258.55,Single-ply,SBD,F,
Girls,56.02,2,Macayla Edwards,Liberty,55.97,99.79,43.09,104.33,247.21,Single-ply,SBD,F,
Girls,56.02,3,Jenn Khuu,Port Arthur Memorial,54.34,104.33,38.56,102.06,244.94,Single-ply,SBD,F,
Girls,56.02,4,Hope Tousha,Liberty,53.07,95.25,49.9,88.45,233.6,Single-ply,SBD,F,
Girls,56.02,5,Emily Oaks-Thorower,Montgomery,53.3,83.91,40.82,92.99,217.72,Single-ply,SBD,F,
Girls,56.02,6,Cheyenne Cox,Huffman Hargrave,53.61,72.57,34.02,79.38,185.97,Single-ply,SBD,F,
Girls,56.02,DQ,Maddie Chappell,Montgomery,54.61,,,,,Single-ply,SBD,F,
Girls,56.02,DQ,Ja'Noria Harrell,Livingston,53.43,99.79,47.63,,,Single-ply,SBD,F,
Girls,56.02,DQ,A'Tiana Naville,Port Arthur Memorial,52.07,,,,,Single-ply,SBD,F,
Girls,60.1,1,Brooke Smalley,Montgomery,59.15,122.47,54.43,122.47,299.37,Single-ply,SBD,F,
Girls,60.1,2,Samantha Rogers,New Caney Porter,59.96,115.67,63.5,111.13,290.3,Single-ply,SBD,F,
Girls,60.1,3,Peyton Wood,Willis,58.79,113.4,56.7,115.67,285.76,Single-ply,SBD,F,
Girls,60.1,4,Jordan Barton,Montgomery,59.15,111.13,58.97,113.4,283.5,Single-ply,SBD,F,
Girls,60.1,5,Kayler Horak,Conroe,59.06,102.06,61.23,115.67,278.96,Single-ply,SBD,F,
Girls,60.1,6,Alexis Sanchez,Willis,58.69,74.84,36.29,97.52,208.65,Single-ply,SBD,F,
Girls,60.1,7,Melody Medina,Willis,59.24,79.38,34.02,92.99,206.38,Single-ply,SBD,F,
Girls,60.1,8,Brooke Friday,Crosby,59.33,43.09,29.48,79.38,151.95,Single-ply,SBD,F,
Girls,60.1,DQ,Jaqueline Alarcon,New Caney Porter,59.33,,,,,Single-ply,SBD,F,
Girls,60.1,DQ,Maria Gutierrez,Livingston,58.69,,,,,Single-ply,SBD,F,
Girls,67.36,1,Allie Botello,Livingston,67.13,142.88,68.04,136.08,347,Single-ply,SBD,F,
Girls,67.36,2,Natalie Hasselmeire,Montgomery,63.59,124.74,74.84,129.27,328.85,Single-ply,SBD,F,
Girls,67.36,3,Madison Faith,Conroe Woodlands College Park,62.51,122.47,72.57,129.27,324.32,Single-ply,SBD,F,
Girls,67.36,4,Rhylee Shaw,Conroe,65.95,113.4,61.23,111.13,285.76,Single-ply,SBD,F,
Girls,67.36,5,Kenson Alton,Splendora,67.22,108.86,58.97,117.93,285.76,Single-ply,SBD,F,
Girls,67.36,6,Miranda Munoz,Livingston,65.14,113.4,45.36,113.4,272.16,Single-ply,SBD,F,
Girls,67.36,7,Maddi Smith,Huffman Hargrave,65.41,117.93,40.82,111.13,269.89,Single-ply,SBD,F,
Girls,67.36,8,Aurora Mo,Waller,65.5,102.06,54.43,113.4,269.89,Single-ply,SBD,F,
Girls,67.36,9,Grace Burman,Waller,62.05,102.06,47.63,104.33,254.01,Single-ply,SBD,F,
Girls,67.36,10,Valeria Cantu,Baytown Goose Creek Memorial,66.5,102.06,43.09,104.33,249.48,Single-ply,SBD,F,
Girls,67.36,11,Cindy Ramirez,Nacogdoches,67.13,106.59,38.56,102.06,247.21,Single-ply,SBD,F,
Girls,67.36,12,Khalia Dankins,Port Arthur Memorial,63.14,90.72,47.63,92.99,231.33,Single-ply,SBD,F,
Girls,67.36,DQ,Gabrielle Beckwith,Nacogdoches,66.41,99.79,,,,Single-ply,SBD,F,
Girls,67.36,DQ,Kaitlin Chaffin,Willis,66.59,,,,,Single-ply,SBD,F,
Girls,75.07,1,Katheryn Padgett,Montgomery,72.21,124.74,72.57,122.47,319.78,Single-ply,SBD,F,
Girls,75.07,2,Janice Maldonado,Willis,70.03,113.4,56.7,113.4,283.5,Single-ply,SBD,F,
Girls,75.07,3,Maria Martinez,Houston Northbrook,74.75,113.4,45.36,111.13,269.89,Single-ply,SBD,F,
Girls,75.07,4,Cynthia Alvarez,Baytown Goose Creek Memorial,67.95,108.86,38.56,108.86,256.28,Single-ply,SBD,F,
Girls,75.07,5,Shardria Johnson,Willis,74.57,106.59,45.36,104.33,256.28,Single-ply,SBD,F,
Girls,75.07,6,Taylor Byron,Huffman Hargrave,72.12,106.59,36.29,104.33,247.21,Single-ply,SBD,F,
Girls,75.07,7,Analise Alfard,Baytown Goose Creek Memorial,68.31,97.52,38.56,108.86,244.94,Single-ply,SBD,F,
Girls,75.07,8,Makeniz Tullos,Splendora,71.94,92.99,49.9,92.99,235.87,Single-ply,SBD,F,
Girls,75.07,9,Samantha Arredondo,Pasadena Rayburn,68.04,83.91,31.75,102.06,217.72,Single-ply,SBD,F,
Girls,75.07,10,Kylee Frischenmeyer,Saratoga West Hardin,72.3,74.84,38.56,77.11,190.51,Single-ply,SBD,F,
Girls,75.07,11,Kaylee Davis,Crosby,70.49,65.77,31.75,90.72,188.24,Single-ply,SBD,F,
Girls,75.07,DQ,Layla White,Crosby,71.76,,,,,Single-ply,SBD,F,
Girls,82.33,1,Kathryn Glover,Waller,78.74,122.47,54.43,133.81,310.71,Single-ply,SBD,F,
Girls,82.33,2,Alexa Antunez,Houston Northbrook,75.84,111.13,43.09,120.2,274.42,Single-ply,SBD,F,
Girls,82.33,3,Rachel Smith #6,Willis,81.92,122.47,43.09,102.06,267.62,Single-ply,SBD,F,
Girls,82.33,4,Destiny Johnson,Waller,80.56,106.59,43.09,113.4,263.08,Single-ply,SBD,F,
Girls,82.33,5,Genevieve Gipson,New Caney Porter,81.92,92.99,47.63,79.38,219.99,Single-ply,SBD,F,
Girls,82.33,DQ,Marinda Dunham,Livingston,81.47,,,,,Single-ply,SBD,F,
Girls,90.04,1,Baily Barrett,Livingston,86,154.22,63.5,129.27,347,Single-ply,SBD,F,
Girls,90.04,2,Gabby Kratzer,Livingston,87.36,133.81,58.97,131.54,324.32,Single-ply,SBD,F,
Girls,100.02,1,Mallorie Brown,Saratoga West Hardin,91.81,149.69,72.57,127.01,349.27,Single-ply,SBD,F,
Girls,100.02,2,Jennifer Galarza,New Caney Porter,97.07,127.01,70.31,127.01,324.32,Single-ply,SBD,F,
Girls,100.02,3,Heidi Strait,Splendora,98.7,124.74,65.77,124.74,315.25,Single-ply,SBD,F,
Girls,100.02,4,Kaylin Davalos,Livingston,93.8,136.08,49.9,102.06,288.03,Single-ply,SBD,F,
Girls,100.02,5,Chey Baudat,New Caney,93.89,120.2,63.5,104.33,288.03,Single-ply,SBD,F,
Girls,100.02,6,Leighanna Thrower,Montgomery,92.35,99.79,68.04,117.93,285.76,Single-ply,SBD,F,
Girls,100.02,7,Cheyenne Bowden,Crosby,99.97,83.91,52.16,102.06,238.14,Single-ply,SBD,F,
Girls,117.71,1,Payton Olivier,La Marque,100.61,136.08,68.04,151.95,356.07,Single-ply,SBD,F,
Girls,117.71,2,Yulissa Bass,Saratoga West Hardin,114.03,120.2,61.23,115.67,297.1,Single-ply,SBD,F,
Girls,117.71+,1,Shi'Ya Toson,Port Arthur Memorial,145.6,99.79,58.97,104.33,263.08,Single-ply,SBD,F,
Girls,117.71+,DQ,Alexis Love,Saratoga West Hardin,122.38,81.65,,,,Single-ply,SBD,F,
