Division,WeightClassKg,Place,Name,Team,BodyweightKg,Best3SquatKg,Best3BenchKg,Best3DeadliftKg,TotalKg,Equipment,Event,Sex
Boys,51.71,1,Callum Hurst,Coahoma,48.81,120.2,70.31,115.67,306.17,Single-ply,SBD,M
Boys,51.71,2,Joseph Martinez,Colorado City Colorado,50.26,95.25,56.7,117.93,269.89,Single-ply,SBD,M
Boys,51.71,3,Brady Robbins,Midland Greenwood,49.35,104.33,61.23,102.06,267.62,Single-ply,SBD,M
Boys,51.71,4,Connor Steel,Forsan,49.99,97.52,52.16,102.06,251.74,Single-ply,SBD,M
Boys,51.71,5,Aaron Carroll,Big Spring,38.1,61.23,31.75,77.11,170.1,Single-ply,SBD,M
Boys,55.79,1,Tyler Nairn,Big Spring,55.25,167.83,95.25,167.83,430.91,Single-ply,SBD,M
Boys,55.79,2,Viator Gomez,Mertzon Irion County,52.53,154.22,79.38,142.88,376.48,Single-ply,SBD,M
Boys,59.87,3,Daniel Sánchez,Midland Greenwood,55.88,129.27,83.91,145.15,358.34,Single-ply,SBD,M
Boys,55.79,4,Jacob Zepeda,Sterling City,55.16,104.33,65.77,122.47,292.57,Single-ply,SBD,M
Boys,59.87,1,Reid Clanton,Midland Greenwood,59.69,183.7,113.4,183.7,480.81,Single-ply,SBD,M
Boys,59.87,2,Trenton Crenshaw,Coahoma,59.78,151.95,97.52,161.03,410.5,Single-ply,SBD,M
Boys,59.87,3,Dillon Hughes,Sterling City,59.24,133.81,88.45,149.69,371.95,Single-ply,SBD,M
Boys,59.87,4,Andrew Martinez,Coahoma,59.33,138.35,81.65,147.42,367.41,Single-ply,SBD,M
Boys,59.87,5,Dillon Daniel,Forsan,57.7,142.88,70.31,142.88,356.07,Single-ply,SBD,M
Boys,59.87,6,Blaze Yeater,Forsan,59.78,138.35,72.57,145.15,356.07,Single-ply,SBD,M
Boys,59.87,7,Britton Heath,Coahoma,57.7,124.74,65.77,136.08,326.59,Single-ply,SBD,M
Boys,59.87,8,Jared Everett,Sterling City,59.87,102.06,65.77,108.86,276.69,Single-ply,SBD,M
Boys,59.87,9,Jake Everett,Sterling City,58.06,102.06,52.16,111.13,265.35,Single-ply,SBD,M
Boys,67.13,1,Robert Martinez,Big Spring,66.59,174.63,104.33,188.24,467.2,Single-ply,SBD,M
Boys,67.13,2,Mario Manquero,Garden City,64.32,167.83,102.06,181.44,451.32,Single-ply,SBD,M
Boys,67.13,3,Jose Hernandez,Midland Greenwood,67.13,158.76,99.79,183.7,442.25,Single-ply,SBD,M
Boys,67.13,4,Ismael Ramirez,Garden City,66.77,158.76,88.45,165.56,412.77,Single-ply,SBD,M
Boys,67.13,5,Paul Cortez,Coahoma,65.91,145.15,104.33,147.42,396.89,Single-ply,SBD,M
Boys,67.13,6,Brock Vasquez,Hermleigh,65.5,115.67,74.84,142.88,333.39,Single-ply,SBD,M
Boys,67.13,7,Mitchell McGuire,Sterling City,64.41,102.06,81.65,136.08,319.78,Single-ply,SBD,M
Boys,67.13,8,Travis Ballard,Forsan,64.05,111.13,70.31,131.54,312.98,Single-ply,SBD,M
Boys,67.13,9,Kade Warren,Sterling City,65.41,111.13,61.23,136.08,308.44,Single-ply,SBD,M
Boys,67.13,10,Jonathon Rankin,Colorado City Colorado,60.15,113.4,65.77,122.47,301.64,Single-ply,SBD,M
Boys,67.13,11,Lorenzo Jones,Big Spring,66.13,104.33,65.77,122.47,292.57,Single-ply,SBD,M
Boys,67.13,12,Brent Glasco,Forsan,66.68,95.25,43.09,111.13,249.48,Single-ply,SBD,M
Boys,67.13,DQ,Oscar Narvaez,Mertzon Irion County,64.77,170.1,90.72,,,Single-ply,SBD,M
Boys,74.84,1,Aaron Castillo,Rankin,74.84,197.31,142.88,222.26,562.45,Single-ply,SBD,M
Boys,74.84,2,Austin Grantham,Forsan,74.21,174.63,115.67,199.58,489.88,Single-ply,SBD,M
Boys,74.84,3,Logan Kilpatrick,Sterling City,74.12,172.37,90.72,170.1,433.18,Single-ply,SBD,M
Boys,74.84,4,Jack Lehman,Midland Classical Academy,74.48,138.35,83.91,165.56,387.82,Single-ply,SBD,M
Boys,74.84,5,Ashton Voight,Forsan,68.86,138.35,77.11,136.08,351.53,Single-ply,SBD,M
Boys,74.84,6,Ty Wilson,Mertzon Irion County,71.49,145.15,61.23,140.61,347,Single-ply,SBD,M
Boys,74.84,7,Darian Espinoza,Colorado City Colorado,74.21,113.4,65.77,115.67,294.84,Single-ply,SBD,M
Boys,74.84,8,Seth Myers,Colorado City Colorado,70.94,102.06,68.04,120.2,290.3,Single-ply,SBD,M
Boys,89.81,1,Blake Osborn,Midland Greenwood,82.19,188.24,131.54,181.44,501.22,Single-ply,SBD,M
Boys,82.1,2,Tate Richards,Rankin,80.1,172.37,129.27,181.44,483.08,Single-ply,SBD,M
Boys,82.1,3,Herman Tena,Midland Greenwood,75.93,154.22,102.06,165.56,421.84,Single-ply,SBD,M
Boys,82.1,4,Chris Amador,Mertzon Irion County,80.2,181.44,83.91,156.49,421.84,Single-ply,SBD,M
Boys,82.1,5,Jamen Sanchez,Coahoma,76.38,156.49,77.11,163.29,396.89,Single-ply,SBD,M
Boys,82.1,6,Ashton Bourgious,Midland Greenwood,79.47,140.61,90.72,149.69,381.02,Single-ply,SBD,M
Boys,82.1,7,Juan Reyes,Colorado City Colorado,76.2,145.15,90.72,142.88,378.75,Single-ply,SBD,M
Boys,82.1,8,Tyler Mitchell,Hermleigh,76.75,127.01,88.45,120.2,335.66,Single-ply,SBD,M
Boys,82.1,DQ,Jacob Guzman,Hermleigh,79.83,172.37,108.86,,,Single-ply,SBD,M
Boys,89.81,1,Joe Melendez,Coahoma,88.09,256.28,138.35,224.53,619.15,Single-ply,SBD,M
Boys,89.81,2,Dustin Rea,Midland Greenwood,86.27,226.8,140.61,204.12,571.53,Single-ply,SBD,M
Boys,89.81,3,Jason Haddock,Midland Greenwood,83.19,161.03,111.13,174.63,446.79,Single-ply,SBD,M
Boys,89.81,4,Cody Phillips,Rankin,87.18,142.88,97.52,165.56,405.97,Single-ply,SBD,M
Boys,89.81,5,Matt Sanders,Midland Greenwood,82.64,142.88,102.06,158.76,403.7,Single-ply,SBD,M
Boys,89.81,6,Taylon Kincaid,Coahoma,84.64,138.35,83.91,147.42,369.68,Single-ply,SBD,M
Boys,89.81,7,Logan Elsey,Midland Greenwood,87.72,145.15,83.91,138.35,367.41,Single-ply,SBD,M
Boys,89.81,8,Jorge Salais,Garden City,83.01,136.08,68.04,149.69,353.8,Single-ply,SBD,M
Boys,89.81,9,Christopher Mims,Forsan,88.54,106.59,63.5,136.08,306.17,Single-ply,SBD,M
Boys,89.81,DQ,Douglas Gilbert,Hermleigh,88.09,,,,,Single-ply,SBD,M
Boys,89.81,DQ,Matt Cisneros,Coahoma,84.46,,,,,Single-ply,SBD,M
Boys,99.79,1,Zak Walton,Coahoma,99.38,244.94,154.22,210.92,610.08,Single-ply,SBD,M
Boys,99.79,2,Shawn Walker,Garden City,93.62,222.26,142.88,208.65,573.79,Single-ply,SBD,M
Boys,99.79,3,Matt Garcia,Mertzon Irion County,97.07,213.19,154.22,204.12,571.53,Single-ply,SBD,M
Boys,99.79,4,Sean Strickland,Midland Greenwood,91.99,185.97,120.2,199.58,505.76,Single-ply,SBD,M
Boys,99.79,5,Anthony Williams,Big Spring,98.43,174.63,115.67,136.08,426.38,Single-ply,SBD,M
Boys,99.79,6,Gabriel Reynoza,Hermleigh,91.53,142.88,104.33,170.1,417.3,Single-ply,SBD,M
Boys,99.79,7,Alex Johnson #7,Big Spring,93.98,158.76,97.52,154.22,410.5,Single-ply,SBD,M
Boys,99.79,8,Oden Yanez,Big Spring,96.07,158.76,95.25,151.95,405.97,Single-ply,SBD,M
Boys,99.79,9,Colin Sutton,Big Spring,97.07,158.76,83.91,158.76,401.43,Single-ply,SBD,M
Boys,99.79,10,Orean Pineda,Colorado City Colorado,95.71,136.08,81.65,181.44,399.16,Single-ply,SBD,M
Boys,109.77,1,Rudy Brito,Coahoma,108.82,244.94,136.08,192.78,573.79,Single-ply,SBD,M
Boys,109.77,2,Nathan Schneider,Big Spring,101.7,215.46,117.93,204.12,537.51,Single-ply,SBD,M
Boys,109.77,3,Taylor Morin,Forsan,102.06,222.26,111.13,199.58,532.97,Single-ply,SBD,M
Boys,109.77,4,Charlie Boling,Big Spring,106.59,201.85,129.27,195.04,526.17,Single-ply,SBD,M
Boys,109.77,5,Shayne Compton,Midland Greenwood,105.87,174.63,124.74,176.9,476.27,Single-ply,SBD,M
Boys,109.77,6,Justin Trawick,Colorado City Colorado,109.41,170.1,86.18,181.44,437.72,Single-ply,SBD,M
Boys,109.77,7,Devin Kimmey,Mertzon Irion County,107.5,158.76,102.06,163.29,424.11,Single-ply,SBD,M
Boys,109.77,8,Levi Molina,Big Spring,108.32,149.69,92.99,145.15,387.82,Single-ply,SBD,M
Boys,124.74,1,Eldon Niblett,Midland Greenwood,114.31,272.16,140.61,226.8,639.57,Single-ply,SBD,M
Boys,124.74,2,Ausden Medrano,Forsan,116.03,240.4,129.27,208.65,578.33,Single-ply,SBD,M
Boys,124.74,3,Phillip Bacon,Coahoma,124.42,226.8,133.81,208.65,569.26,Single-ply,SBD,M
Boys,124.74,4,Aaron Enriquez,Garden City,113.31,181.44,108.86,188.24,478.54,Single-ply,SBD,M
Boys,124.74+,1,David Mejia,Coahoma,143.79,222.26,131.54,229.06,582.87,Single-ply,SBD,M
Boys,124.74+,2,Tom Rivera,Colorado City Colorado,177.81,201.85,136.08,174.63,512.56,Single-ply,SBD,M
Boys,124.74+,3,Blantyn Gusman,Big Spring,128.09,122.47,70.31,145.15,337.93,Single-ply,SBD,M
