WeightClassKg,Name,CyrillicName,BirthDate,Event,Equipment,Sex,Tested,Division,BodyweightKg,Squat1Kg,Squat2Kg,Squat3Kg,Best3SquatKg,Bench1Kg,Bench2Kg,Bench3Kg,Best3BenchKg,Deadlift1Kg,Deadlift2Kg,Deadlift3Kg,Best3DeadliftKg,TotalKg,Place
44,Vseslav Mosunov,Всеслав Мосунов,,B,Raw,M,Yes,Amateur Teen 13,39.6,,,,,20,22.5,25,25,,,,,25,1
44,Anastasiya Popova,Анастасия Попова,1984-04-17,B,Raw,F,Yes,Amateur Open,43.8,,,,,45,50,-52.5,50,,,,,50,1
67.5,Natalya Syuzeva,Наталья Сюзева,1984-07-03,B,Raw,F,Yes,Amateur Open,65.6,,,,,65,72.5,-75,72.5,,,,,72.5,1
60,Lev Volkov,Лев Волков,2002-02-05,B,Raw,M,Yes,Amateur Teen 16-17,57.5,,,,,77.5,82.5,-85,82.5,,,,,82.5,1
67.5,Anton Sizov,Антон Сизов,1996-03-12,B,Raw,M,Yes,Amateur Juniors 20-23,67,,,,,100,105,-110,105,,,,,105,1
82.5,Mikhail Snilin,Михаил Снилин,1989-08-28,B,Raw,M,Yes,Amateur Open,82,,,,,120,130,132.5,132.5,,,,,132.5,2
90,Andrey Kramarev,Андрей Крамарев,1975-12-29,B,Raw,M,Yes,Amateur Masters 40-44,88.9,,,,,150,155,160,160,,,,,160,1
90,Evgeniy Mosunov,Евгений Мосунов,,B,Raw,M,Yes,Amateur Open,87.4,,,,,135,155,,155,,,,,155,2
100,Aleksandr Mukhachev,Александр Мухачев,1981-06-27,B,Raw,M,Yes,Amateur Open,94.2,,,,,135,140,-142.5,140,,,,,140,2
82.5,Igor Kynkurogov,Игорь Кынкурогов,1988-03-26,B,Raw,M,Yes,Amateur Open,80.4,,,,,137.5,142.5,-147.5,142.5,,,,,142.5,1
67.5,Vladimir Plyaskin,Владимир Пляскин,,B,Raw,M,Yes,Amateur Open,66.3,,,,,100,110,-112.5,110,,,,,110,1
60,Mikhail Titov,Михаил Титов,1982-01-23,B,Raw,M,Yes,Amateur Open,58.7,,,,,110,117.5,-120,117.5,,,,,117.5,1
100,Evgeniy Duganov,Евгений Дуганов,1981-03-01,B,Raw,M,Yes,Amateur Open,92,,,,,170,175,-180,175,,,,,175,1
90,Ramil Gasanov,Рамил Гасанов,1994-06-02,B,Raw,M,Yes,Amateur Open,85.9,,,,,180,-185,-185,180,,,,,180,1
67.5,Anatoliy Sizikov,Анатолий Сизиков,,SBD,Wraps,M,Yes,Amateur Teen 16-17,65.5,135,140,-156,140,85,-90,90,90,140,-150,-150,140,370,1
75,Semen Shay,Семен Шай,,SBD,Wraps,M,Yes,Amateur Teen 18-19,71.4,90,100,115,115,75,-80,-80,75,130,140,150,150,340,1
56,Elizaveta Oparova,Елизавета Опарова,,S,Wraps,F,Yes,Amateur Open,55.5,70,75,-80,75,,,,,,,,,75,1
75,Lev Knyazev,Лев Князев,,D,Raw,M,Yes,Amateur Open,70.1,,,,,,,,,-175,-175,175,175,175,1
82.5,Ivan Luginin,Иван Лугинин,,D,Raw,M,Yes,Amateur Open,82.1,,,,,,,,,190,-210,210,210,210,1
100,Andrey Vasilev,Андрей Васильев,1983-05-10,D,Raw,M,Yes,Amateur Open,99.6,,,,,,,,,235,252.5,,252.5,252.5,1
67.5,Vladimir Prokhorov,Владимир Прохоров,,D,Raw,M,Yes,Amateur Open,64.8,,,,,,,,,120,125,,125,125,1
67.5,Andrey Panchenkov,Андрей Панченков,,SBD,Wraps,M,Yes,Amateur Open,66.91,-145,150,155,155,90,97.5,105,105,150,160,175,175,435,1
90,Andrey Vasilev,Андрей Васильев,1983-05-10,B,Raw,M,No,Pro Open,89.6,,,,,150,160,165,165,,,,,165,1
44,Diana Benera,Диана Бенера,,B,Raw,F,No,Pro Teen 13,41.9,,,,,20,-22.5,-22.5,20,,,,,20,1
67.5,Natalya Nizamova,Наталья Низамова,1980-08-02,B,Raw,F,No,Disabled Open,67,,,,,47.5,50,52.5,52.5,,,,,52.5,1
67.5,Anastasiya Tsybizova,Анастасия Цыбизова,,B,Raw,F,No,Disabled Open,61,,,,,50,55,60,60,,,,,60,1
44,Vseslav Mosunov,Всеслав Мосунов,,B,Raw,M,No,Pro Teen 13,39.6,,,,,25,-27.5,-27.5,25,,,,,25,1
100,Pavel Dyukanov,Павел Дюканов,,B,Raw,M,No,Pro Teen 16-17,93.8,,,,,115,120,-125,120,,,,,120,1
75,Aleksandr Pozharskiy,Александр Пожарский,,B,Raw,M,No,Disabled Open,68.4,,,,,62.5,65,67.5,67.5,,,,,67.5,1
100,Vladimir Vaulin,Владимир Ваулин,1988-02-10,B,Raw,M,No,Pro Open,99.6,,,,,140,-150,150,150,,,,,150,2
