Division,WeightClassKg,Place,Name,Team,BodyweightKg,Best3SquatKg,Best3BenchKg,Best3DeadliftKg,TotalKg,Equipment,Event,Sex,BirthDate
Girls,44.23,1,Emily Forner,Maypearl,44.18,92.99,38.56,97.52,229.06,Single-ply,SBD,F,
Girls,44.23,DQ,Johnna Edwards,Malakoff Cross Roads,43.91,,,,,Single-ply,SBD,F,
Girls,47.85,1,Jozalyn Sewell,Blooming Grove,47.72,129.27,72.57,122.47,324.32,Single-ply,SBD,F,
Girls,47.85,2,Chesney Richards,Corsicana Mildred,45.9,122.47,68.04,120.2,310.71,Single-ply,SBD,F,
Girls,47.85,3,Myldred Viguerias,Kemp,47.81,72.57,36.29,86.18,195.04,Single-ply,SBD,F,
Girls,47.85,4,Breeana Echols,Mabank,46.27,68.04,38.56,72.57,179.17,Single-ply,SBD,F,
Girls,47.85,5,Reagan Tucker,Palmer,46.63,68.04,24.95,72.57,165.56,Single-ply,SBD,F,
Girls,47.85,6,Alexis Keniston,Malakoff Cross Roads,47.08,63.5,29.48,63.5,156.49,Single-ply,SBD,F,
Girls,51.94,1,Jamisha Fields,Fairfield,51.07,136.08,54.43,147.42,337.93,Single-ply,SBD,F,
Girls,51.94,2,Tristian Dykes,Brownsboro,51.26,106.59,61.23,102.06,269.89,Single-ply,SBD,F,
Girls,51.94,3,Kate Hernandez,Malakoff Cross Roads,51.71,86.18,38.56,104.33,229.06,Single-ply,SBD,F,
Girls,56.02,1,Abby Coleman,Fairfield,54.07,117.93,63.5,120.2,301.64,Single-ply,SBD,F,
Girls,56.02,2,Nikki Turner,Corsicana Mildred,55.16,108.86,61.23,127.01,297.1,Single-ply,SBD,F,
Girls,56.02,3,Whitney Stansell,Maypearl,55.25,102.06,47.63,108.86,258.55,Single-ply,SBD,F,
Girls,56.02,4,Payton Dickerson,Corsicana Mildred,54.61,99.79,43.09,108.86,251.74,Single-ply,SBD,F,
Girls,56.02,5,Ellie Grissett,Fairfield,55.79,102.06,54.43,95.25,251.74,Single-ply,SBD,F,
Girls,56.02,6,Brooklyn Corley,Maypearl,54.7,92.99,36.29,99.79,229.06,Single-ply,SBD,F,
Girls,56.02,7,Abigale Elkin,Blooming Grove,54.98,95.25,43.09,90.72,229.06,Single-ply,SBD,F,
Girls,56.02,8,Molly Zagala,Palmer,52.8,86.18,36.29,102.06,224.53,Single-ply,SBD,F,
Girls,56.02,9,Tatem Dodson,Maypearl,53.89,81.65,34.02,95.25,210.92,Single-ply,SBD,F,
Girls,56.02,10,Sandy Guajardo,Corsicana,52.16,77.11,29.48,79.38,185.97,Single-ply,SBD,F,
Girls,56.02,11,Olivia Sullivan,Mabank,55.97,102.06,,,102.06,Single-ply,S,F,
Girls,56.02,12,Anna Dominey,Dawson,52.8,90.72,,,90.72,Single-ply,S,F,
Girls,56.02,DQ,Alondra Dominguez,Buffalo,55.88,113.4,52.16,117.93,,Single-ply,SBD,F,
Girls,60.1,1,Natasha Ward,Dawson,59.15,102.06,54.43,117.93,274.42,Single-ply,SBD,F,
Girls,60.1,2,Hawkins Trinity,Brownsboro,59.96,90.72,65.77,111.13,267.62,Single-ply,SBD,F,
Girls,60.1,3,Jalie Romo,Kemp,56.88,104.33,45.36,97.52,247.21,Single-ply,SBD,F,
Girls,60.1,4,Preslie Penix,Malakoff Cross Roads,58.79,90.72,49.9,104.33,244.94,Single-ply,SBD,F,
Girls,60.1,5,Shanthal Blancas,Corsicana,56.79,92.99,38.56,111.13,242.67,Single-ply,SBD,F,
Girls,60.1,6,Allie Elkin,Blooming Grove,58.29,92.99,43.09,97.52,233.6,Single-ply,SBD,F,
Girls,60.1,7,Karina Estrada,Corsicana,60.1,90.72,29.48,90.72,210.92,Single-ply,SBD,F,
Girls,67.36,1,Haley Lee,Brownsboro,62.69,147.42,74.84,140.61,362.87,Single-ply,SBD,F,
Girls,67.36,2,Claire Barham,Blooming Grove,66.36,154.22,81.65,127.01,362.87,Single-ply,SBD,F,
Girls,67.36,3,Courtney Parker,Kemp,66.41,138.35,65.77,147.42,351.53,Single-ply,SBD,F,
Girls,67.36,4,Daisy Garcia,Dawson,60.69,113.4,61.23,122.47,297.1,Single-ply,SBD,F,
Girls,67.36,5,Tamaia Henry,Dawson,66.5,106.59,65.77,117.93,290.3,Single-ply,SBD,F,
Girls,67.36,6,Louren Hall,Fairfield,66.13,113.4,52.16,122.47,288.03,Single-ply,SBD,F,
Girls,67.36,7,Barbara Valencia,Mabank,66.77,122.47,47.63,115.67,285.76,Single-ply,SBD,F,
Girls,67.36,8,Vaneza Dominguez,Buffalo,63.05,111.13,52.16,115.67,278.96,Single-ply,SBD,F,
Girls,67.36,9,Savanna Rhea,Blooming Grove,65.41,115.67,54.43,106.59,276.69,Single-ply,SBD,F,
Girls,67.36,10,Kelli Joe Richardson,Fairfield,64.68,113.4,54.43,99.79,267.62,Single-ply,SBD,F,
Girls,67.36,11,Samantha Mendoza,Corsicana,60.87,95.25,29.48,102.06,226.8,Single-ply,SBD,F,
Girls,67.36,12,Aubree Carpenter,Maypearl,60.24,81.65,34.02,95.25,210.92,Single-ply,SBD,F,
Girls,67.36,13,Tayler Greeley,Maypearl,62.23,81.65,38.56,90.72,210.92,Single-ply,SBD,F,
Girls,67.36,14,Olivia Armstrong,Hubbard,61.78,74.84,49.9,65.77,190.51,Single-ply,SBD,F,
Girls,67.36,DQ,Elena Lopez,Buffalo,67.13,47.63,,,,Single-ply,SBD,F,
Girls,75.07,1,Mae Lee,Brownsboro,70.85,138.35,68.04,140.61,347,Single-ply,SBD,F,
Girls,75.07,2,Leah Harris,Ennis,74.12,133.81,70.31,136.08,340.19,Single-ply,SBD,F,
Girls,75.07,3,Chesley Kirkland,Mabank,70.76,140.61,58.97,127.01,326.59,Single-ply,SBD,F,
Girls,75.07,4,Cheyenne Rhea,Blooming Grove,69.99,136.08,68.04,120.2,324.32,Single-ply,SBD,F,
Girls,75.07,5,Briann Warner,Palmer,73.66,120.2,63.5,120.2,303.91,Single-ply,SBD,F,
Girls,75.07,6,Sydny Blanchard,Kemp,71.58,124.74,56.7,117.93,299.37,Single-ply,SBD,F,
Girls,75.07,7,Paula Fuentes,Blooming Grove,74.25,108.86,58.97,115.67,283.5,Single-ply,SBD,F,
Girls,75.07,8,Toviyah Williams,Corsicana,70.03,115.67,38.56,122.47,276.69,Single-ply,SBD,F,
Girls,75.07,9,Emma Laseter,Hubbard,70.13,106.59,61.23,108.86,276.69,Single-ply,SBD,F,
Girls,75.07,10,Chasity Starr,Fairfield,70.58,113.4,47.63,113.4,274.42,Single-ply,SBD,F,
Girls,75.07,11,Heidi Torres,Malakoff Cross Roads,71.58,115.67,49.9,104.33,269.89,Single-ply,SBD,F,
Girls,75.07,12,Makayla Miller,Palmer,74.21,90.72,72.57,106.59,269.89,Single-ply,SBD,F,
Girls,75.07,13,Teela Polk,Corsicana,74.84,104.33,56.7,108.86,269.89,Single-ply,SBD,F,
Girls,75.07,14,Brooke Smith,Mabank,74.84,106.59,56.7,104.33,267.62,Single-ply,SBD,F,
Girls,75.07,15,Elizabeth Laseter,Hubbard,68.58,90.72,58.97,102.06,251.74,Single-ply,SBD,F,
Girls,75.07,16,Reyna Loya,Blooming Grove,70.13,90.72,29.48,106.59,226.8,Single-ply,SBD,F,
Girls,75.07,17,Anna Gonzalez,Corsicana,68.49,79.38,31.75,97.52,208.65,Single-ply,SBD,F,
Girls,75.07,18,Gracee Morris,Mabank,72.94,65.77,38.56,79.38,183.7,Single-ply,SBD,F,
Girls,82.33,1,Jacey Coston,Dawson,80.29,147.42,72.57,138.35,358.34,Single-ply,SBD,F,
Girls,82.33,2,Bailey Jones #3,Fairfield,76.57,142.88,74.84,138.35,356.07,Single-ply,SBD,F,
Girls,82.33,3,Nadia McClatchey,Fairfield,82.28,140.61,54.43,127.01,322.05,Single-ply,SBD,F,
Girls,82.33,4,Keiandrea Jones,Corsicana,79.56,124.74,47.63,147.42,319.78,Single-ply,SBD,F,
Girls,82.33,5,Guadalupe Garcia,Eustace,75.48,136.08,54.43,124.74,315.25,Single-ply,SBD,F,
Girls,82.33,6,Vicky Romo,Eustace,80.47,124.74,63.5,108.86,297.1,Single-ply,SBD,F,
Girls,82.33,7,Lindsey Parker,Brownsboro,78.11,102.06,56.7,90.72,249.48,Single-ply,SBD,F,
Girls,82.33,8,Jaycee Jobe,Fairfield,77.84,81.65,56.7,108.86,247.21,Single-ply,SBD,F,
Girls,82.33,9,Kylie Clamon,Mabank,78.74,102.06,45.36,81.65,229.06,Single-ply,SBD,F,
Girls,82.33,10,Summer Settlemyer,Wortham,82.01,90.72,38.56,95.25,224.53,Single-ply,SBD,F,
Girls,82.33,11,Alexis O'Daniel,Buffalo,79.02,83.91,52.16,77.11,213.19,Single-ply,SBD,F,
Girls,82.33,DQ,Emma Green,Corsicana,79.47,97.52,,,,Single-ply,SBD,F,
Girls,82.33,DQ,Maddy Howell,Buffalo,80.83,122.47,,113.4,,Single-ply,SBD,F,
Girls,90.04,1,Junie Harry,Corsicana,89.36,136.08,68.04,149.69,353.8,Single-ply,SBD,F,
Girls,90.04,2,Laura Walters,Mabank,87.09,145.15,61.23,140.61,347,Single-ply,SBD,F,
Girls,90.04,3,Miranda Hays,Kemp,85.46,136.08,54.43,120.2,310.71,Single-ply,SBD,F,
Girls,90.04,4,Lauren Moses,Corsicana,89.99,108.86,61.23,122.47,292.57,Single-ply,SBD,F,
Girls,90.04,5,Lindsay McManus,Ennis,88.99,115.67,47.63,108.86,272.16,Single-ply,SBD,F,
Girls,90.04,6,Maddi Griffith,Mabank,84.01,102.06,65.77,99.79,267.62,Single-ply,SBD,F,
Girls,90.04,7,Karsyn Moore,Buffalo,87.09,88.45,56.7,99.79,244.94,Single-ply,SBD,F,
Girls,90.04,DQ,Jackie Yanez,Rice,89.09,127.01,,,,Single-ply,SBD,F,
Girls,100.02,1,Charity Starr,Fairfield,98.16,149.69,81.65,158.76,390.09,Single-ply,SBD,F,
Girls,100.02,2,Kim Soto,Dawson,93.08,151.95,68.04,127.01,347,Single-ply,SBD,F,
Girls,100.02,3,Jacinda Williams,Blooming Grove,96.89,124.74,83.91,102.06,310.71,Single-ply,SBD,F,
Girls,100.02,4,Courtney Botkin,Corsicana,98.43,104.33,63.5,124.74,292.57,Single-ply,SBD,F,
Girls,100.02,5,Tori Sanders,Kemp,94.71,102.06,61.23,117.93,281.23,Single-ply,SBD,F,
Girls,117.71,1,Katarina Cassel,Rice,105.87,192.78,113.4,136.08,442.25,Single-ply,SBD,F,
Girls,117.71,2,Emily Turney,Palmer,107.05,145.15,77.11,136.08,358.34,Single-ply,SBD,F,
Girls,117.71,3,Delanie Spakes,Kemp,115.39,140.61,79.38,127.01,347,Single-ply,SBD,F,
Girls,117.71,4,Maria Ruiz,Corsicana,117.66,138.35,61.23,124.74,324.32,Single-ply,SBD,F,
Girls,117.71,5,Tedi Rene Blassingame,Fairfield,104.78,117.93,61.23,117.93,297.1,Single-ply,SBD,F,
Girls,117.71,6,Ashleigh Harris,Fairfield,111.13,106.59,56.7,108.86,272.16,Single-ply,SBD,F,
Girls,117.71,7,Sierra Baldree,Blooming Grove,102.01,79.38,43.09,104.33,226.8,Single-ply,SBD,F,
Girls,117.71+,1,Lori Gutierrez,Corsicana,126.19,185.97,83.91,151.95,421.84,Single-ply,SBD,F,
Girls,117.71+,2,Courtney Bayer,Blooming Grove,126.6,183.7,92.99,145.15,421.84,Single-ply,SBD,F,
Girls,117.71+,3,Madison Sykes,Corsicana,122.97,161.03,77.11,154.22,392.36,Single-ply,SBD,F,
Girls,117.71+,4,Kelly Denton,Buffalo,131.81,88.45,45.36,106.59,240.4,Single-ply,SBD,F,
Girls,,NS,Breyunna Dowell,Fairfield,,,,,,Single-ply,SBD,F,
