Name,WeightClassKg,Division,AgeRange,Sex,Best3SquatKg,Best3BenchKg,Best3DeadliftKg,TotalKg,Event,Equipment,Place
B. Walton,52,High School,13-19,M,113.4,56.7,117.93,288.03,SBD,Single-ply,1
J. Scott,52,High School,13-19,M,99.79,45.36,113.4,258.55,SBD,Single-ply,2
H. Garcia,52,High School,13-19,M,74.84,58.97,104.33,238.14,SBD,Single-ply,3
Kelvin Jones,52,High School,13-19,M,77.11,47.63,77.11,201.85,SBD,Single-ply,4
K. Leverette,52,High School,13-19,M,45.36,47.63,74.84,167.83,SBD,Single-ply,5
P. Hunt,56,High School,13-19,M,176.9,90.72,176.9,444.52,SBD,Single-ply,1
D. More,56,High School,13-19,M,145.15,81.65,156.49,383.29,SBD,Single-ply,2
D. Martinez,56,High School,13-19,M,129.27,83.91,136.08,349.27,SBD,Single-ply,3
D. Glenn,56,High School,13-19,M,136.08,74.84,133.81,344.73,SBD,Single-ply,4
Grady Collins,56,High School,13-19,M,120.2,92.99,131.54,344.73,SBD,Single-ply,5
Mike Fitzhugh,56,High School,13-19,M,117.93,74.84,145.15,337.93,SBD,Single-ply,6
C. Lankford,56,High School,13-19,M,108.86,74.84,136.08,319.78,SBD,Single-ply,7
C. Williams,56,High School,13-19,M,104.33,74.84,127.01,306.18,SBD,Single-ply,8
Mark Spurgin,56,High School,13-19,M,95.25,79.38,129.27,303.91,SBD,Single-ply,9
G. Gonzales,56,High School,13-19,M,99.79,63.5,133.81,297.1,SBD,Single-ply,10
J. Richards,56,High School,13-19,M,92.99,68.04,117.93,278.96,SBD,Single-ply,11
J. Gonzales,56,High School,13-19,M,88.45,74.84,102.06,265.35,SBD,Single-ply,12
Todd Condiff,60,High School,13-19,M,181.44,99.79,181.44,462.66,SBD,Single-ply,1
Doug Fadel,60,High School,13-19,M,156.49,81.65,181.44,419.57,SBD,Single-ply,2
S. Asher,60,High School,13-19,M,140.61,95.25,158.76,394.63,SBD,Single-ply,3
K. Zellmer,60,High School,13-19,M,158.76,70.31,161.03,390.09,SBD,Single-ply,4
T. Graves,60,High School,13-19,M,149.69,79.38,161.03,390.09,SBD,Single-ply,5
T. Simpson,60,High School,13-19,M,127.01,72.57,151.95,351.53,SBD,Single-ply,6
C. Cowan,60,High School,13-19,M,138.35,68.04,140.61,347,SBD,Single-ply,7
C. Czaranecki,60,High School,13-19,M,108.86,70.31,136.08,315.25,SBD,Single-ply,8
M. Zmalik,60,High School,13-19,M,90.72,83.91,138.35,312.98,SBD,Single-ply,9
B. Haddad,67.5,High School,13-19,M,195.04,92.99,192.78,480.81,SBD,Single-ply,1
Richard Poindexter,67.5,High School,13-19,M,179.17,120.2,176.9,476.27,SBD,Single-ply,2
B. Bollinger,67.5,High School,13-19,M,158.76,120.2,174.63,453.59,SBD,Single-ply,3
R. Cowan,67.5,High School,13-19,M,174.63,86.18,185.97,446.79,SBD,Single-ply,4
B. Bennett,67.5,High School,13-19,M,149.69,104.33,185.97,439.99,SBD,Single-ply,5
Scott Gardner,67.5,High School,13-19,M,149.69,113.4,154.22,417.31,SBD,Single-ply,6
M. Nelson,67.5,High School,13-19,M,140.61,113.4,158.76,412.77,SBD,Single-ply,7
V. Massey,67.5,High School,13-19,M,145.15,104.33,158.76,408.23,SBD,Single-ply,8
M. Webb,67.5,High School,13-19,M,145.15,81.65,181.44,408.23,SBD,Single-ply,9
B. Schronk,67.5,High School,13-19,M,142.88,81.65,176.9,401.43,SBD,Single-ply,10
Steve Stanford,67.5,High School,13-19,M,136.08,95.25,170.1,401.43,SBD,Single-ply,11
S. Sanden,67.5,High School,13-19,M,136.08,86.18,172.37,394.63,SBD,Single-ply,12
B. Berrera,67.5,High School,13-19,M,154.22,72.57,165.56,392.36,SBD,Single-ply,13
T. Brugfield,67.5,High School,13-19,M,136.08,77.11,176.9,390.09,SBD,Single-ply,14
G. Hall,67.5,High School,13-19,M,140.61,92.99,149.69,383.29,SBD,Single-ply,15
J. Durrand,67.5,High School,13-19,M,124.74,104.33,149.69,378.75,SBD,Single-ply,16
D. Allen,67.5,High School,13-19,M,122.47,92.99,158.76,374.21,SBD,Single-ply,17
K. Velasquez,67.5,High School,13-19,M,124.74,83.91,156.49,365.14,SBD,Single-ply,18
J. Bridges,67.5,High School,13-19,M,108.86,90.72,145.15,344.73,SBD,Single-ply,19
S. Lindsay,67.5,High School,13-19,M,127.01,72.57,145.15,344.73,SBD,Single-ply,20
G. Garrett,67.5,High School,13-19,M,83.91,77.11,172.37,333.39,SBD,Single-ply,21
S. Dolive,67.5,High School,13-19,M,108.86,68.04,154.22,331.12,SBD,Single-ply,22
B. Brook,67.5,High School,13-19,M,113.4,81.65,136.08,331.12,SBD,Single-ply,23
K. Tatum,67.5,High School,13-19,M,108.86,72.57,147.42,328.85,SBD,Single-ply,24
P. Elrod,67.5,High School,13-19,M,99.79,86.18,136.08,322.05,SBD,Single-ply,25
R. Weishner,67.5,High School,13-19,M,102.06,90.72,129.27,322.05,SBD,Single-ply,26
R. Davis,67.5,High School,13-19,M,102.06,81.65,127.01,310.71,SBD,Single-ply,27
P. Tallant,67.5,High School,13-19,M,90.72,68.04,113.4,272.16,SBD,Single-ply,28
Rex Calvert,75,High School,13-19,M,204.12,115.67,215.46,535.24,SBD,Single-ply,1
B. Hooks,75,High School,13-19,M,192.78,108.86,190.51,492.15,SBD,Single-ply,2
J. Adair,75,High School,13-19,M,156.49,99.79,217.72,474,SBD,Single-ply,3
M. Kindricks,75,High School,13-19,M,154.22,113.4,204.12,471.74,SBD,Single-ply,4
M. Hutyra,75,High School,13-19,M,185.97,95.25,181.44,462.66,SBD,Single-ply,5
W. Moore,75,High School,13-19,M,158.76,115.67,181.44,455.86,SBD,Single-ply,6
M. Shepard,75,High School,13-19,M,140.61,99.79,208.65,449.06,SBD,Single-ply,7
Mike Williams,75,High School,13-19,M,158.76,97.52,188.24,444.52,SBD,Single-ply,8
K. Tatum,75,High School,13-19,M,145.15,92.99,197.31,435.45,SBD,Single-ply,9
O. Daniel,75,High School,13-19,M,149.69,104.33,181.44,435.45,SBD,Single-ply,10
D. Williams,75,High School,13-19,M,167.83,79.38,181.44,428.65,SBD,Single-ply,11
C. Baier,75,High School,13-19,M,163.29,86.18,176.9,426.38,SBD,Single-ply,12
J. North,75,High School,13-19,M,149.69,111.13,163.29,424.11,SBD,Single-ply,13
M. Elos,75,High School,13-19,M,136.08,86.18,183.71,405.97,SBD,Single-ply,14
E. Gonzales,75,High School,13-19,M,140.61,99.79,161.03,401.43,SBD,Single-ply,15
E. Matlock,75,High School,13-19,M,136.08,104.33,151.95,392.36,SBD,Single-ply,16
J. Mendez,75,High School,13-19,M,133.81,102.06,145.15,381.02,SBD,Single-ply,17
G. Tittle,75,High School,13-19,M,127.01,83.91,163.29,374.21,SBD,Single-ply,18
D. Clark,75,High School,13-19,M,115.67,81.65,165.56,362.87,SBD,Single-ply,19
M. Thatcher,75,High School,13-19,M,106.59,90.72,147.42,344.73,SBD,Single-ply,20
L. Robertson,75,High School,13-19,M,90.72,74.84,163.29,328.85,SBD,Single-ply,21
J. Gore,75,High School,13-19,M,72.57,68.04,124.74,265.35,SBD,Single-ply,22
Harry Everett,82.5,High School,13-19,M,213.19,138.35,272.16,623.69,SBD,Single-ply,1
R. Kettler,82.5,High School,13-19,M,231.33,113.4,226.8,571.53,SBD,Single-ply,2
D. Clements,82.5,High School,13-19,M,195.04,117.93,195.04,508.02,SBD,Single-ply,3
K. Marshall,82.5,High School,13-19,M,181.44,113.4,213.19,508.02,SBD,Single-ply,4
D. Sanders,82.5,High School,13-19,M,181.44,102.06,204.12,487.61,SBD,Single-ply,5
V. Keaton,82.5,High School,13-19,M,154.22,108.86,206.38,469.47,SBD,Single-ply,6
B. Christian,82.5,High School,13-19,M,165.56,115.67,188.24,469.47,SBD,Single-ply,7
J. Hayes,82.5,High School,13-19,M,158.76,95.25,204.12,458.13,SBD,Single-ply,8
F. Rodriguez,82.5,High School,13-19,M,183.71,77.11,195.04,455.86,SBD,Single-ply,9
T. Kennard,82.5,High School,13-19,M,142.88,117.93,181.44,442.25,SBD,Single-ply,10
M. Ryan,82.5,High School,13-19,M,154.22,97.52,190.51,442.25,SBD,Single-ply,11
D. Robbins,82.5,High School,13-19,M,147.42,90.72,195.04,433.18,SBD,Single-ply,12
R. Ellis,82.5,High School,13-19,M,145.15,86.18,195.04,426.38,SBD,Single-ply,13
R. Kennon,82.5,High School,13-19,M,129.27,104.33,185.97,419.57,SBD,Single-ply,14
C. Wohleb,82.5,High School,13-19,M,127.01,111.13,181.44,419.57,SBD,Single-ply,15
Jeff Davis,82.5,High School,13-19,M,163.29,81.65,172.37,417.31,SBD,Single-ply,16
Y. Beitia,82.5,High School,13-19,M,145.15,99.79,163.29,408.23,SBD,Single-ply,17
M. Garvin,82.5,High School,13-19,M,136.08,81.65,181.44,399.16,SBD,Single-ply,18
R. Cruz,82.5,High School,13-19,M,124.74,95.25,174.63,394.63,SBD,Single-ply,19
C. Grisham,82.5,High School,13-19,M,131.54,86.18,158.76,376.48,SBD,Single-ply,21
D. Chalaile,82.5,High School,13-19,M,136.08,81.65,154.22,371.95,SBD,Single-ply,22
J. Lester,82.5,High School,13-19,M,129.27,77.11,174.63,381.02,SBD,Single-ply,20
Chris Caviness,82.5,High School,13-19,M,127.01,90.72,140.61,358.34,SBD,Single-ply,23
F. Trevino,82.5,High School,13-19,M,86.18,77.11,136.08,299.37,SBD,Single-ply,24
P. Nix,82.5,High School,13-19,M,56.7,72.57,104.33,233.6,SBD,Single-ply,25
E. Whitted,90,High School,13-19,M,204.12,140.61,226.8,571.53,SBD,Single-ply,1
Tony Schell,90,High School,13-19,M,210.92,129.27,217.72,557.92,SBD,Single-ply,2
B. Kinder,90,High School,13-19,M,217.72,120.2,208.65,546.58,SBD,Single-ply,3
John Erwin,90,High School,13-19,M,226.8,99.79,199.58,526.17,SBD,Single-ply,4
D. Picha,90,High School,13-19,M,190.51,115.67,204.12,510.29,SBD,Single-ply,5
L. Jones,90,High School,13-19,M,181.44,120.2,181.44,483.08,SBD,Single-ply,6
R. Spencer,90,High School,13-19,M,195.04,90.72,195.04,480.81,SBD,Single-ply,7
D. Roberts,90,High School,13-19,M,147.42,115.67,181.44,444.52,SBD,Single-ply,8
T. Byler,90,High School,13-19,M,161.03,102.06,172.37,435.45,SBD,Single-ply,9
J. Przybylski,90,High School,13-19,M,129.27,99.79,163.29,392.36,SBD,Single-ply,10
W. Shelton,90,High School,13-19,M,117.93,86.18,185.97,390.09,SBD,Single-ply,11
P. Garrett,90,High School,13-19,M,133.81,102.06,151.95,387.82,SBD,Single-ply,12
P. Hendren,90,High School,13-19,M,111.13,90.72,158.76,360.61,SBD,Single-ply,13
L. Cannon,90,High School,13-19,M,136.08,61.24,145.15,342.46,SBD,Single-ply,14
B. Phipp,90,High School,13-19,M,104.33,79.38,142.88,326.59,SBD,Single-ply,15
P. Combest,90,High School,13-19,M,102.06,95.25,124.74,322.05,SBD,Single-ply,16
M. Markle,100,High School,13-19,M,240.4,131.54,231.33,603.28,SBD,Single-ply,1
D. Harvey,100,High School,13-19,M,231.33,136.08,215.46,582.87,SBD,Single-ply,2
J. Mitchell,100,High School,13-19,M,231.33,90.72,181.44,503.49,SBD,Single-ply,3
J. Brooks,100,High School,13-19,M,149.69,117.93,204.12,471.74,SBD,Single-ply,4
R. Perry,100,High School,13-19,M,158.76,117.93,190.51,467.2,SBD,Single-ply,5
K. Connolly,100,High School,13-19,M,149.69,99.79,208.65,458.13,SBD,Single-ply,6
D. McDonald,100,High School,13-19,M,165.56,90.72,195.04,451.32,SBD,Single-ply,7
S. Peyton,100,High School,13-19,M,145.15,99.79,190.51,435.45,SBD,Single-ply,8
J. Richardson,100,High School,13-19,M,142.88,102.06,185.97,430.91,SBD,Single-ply,9
D. Hughes,100,High School,13-19,M,102.06,102.06,147.42,351.53,SBD,Single-ply,10
G. Frank,100,High School,13-19,M,120.2,72.57,120.2,312.98,SBD,Single-ply,11
R. Miller,110,High School,13-19,M,249.48,138.35,249.48,637.3,SBD,Single-ply,1
Matt Gregory,110,High School,13-19,M,197.31,151.95,238.14,587.4,SBD,Single-ply,2
C. Herring,110,High School,13-19,M,181.44,97.52,183.71,462.66,SBD,Single-ply,3
Desmond Royal,110,High School,13-19,M,145.15,99.79,208.65,453.59,SBD,Single-ply,4
M. Hall,110,High School,13-19,M,145.15,95.25,181.44,421.84,SBD,Single-ply,5
C. Wilson,110+,High School,13-19,M,217.72,124.74,231.33,573.8,SBD,Single-ply,1
J. Palmer,110+,High School,13-19,M,197.31,142.88,226.8,566.99,SBD,Single-ply,2
J. Davis,110+,High School,13-19,M,249.48,108.86,208.65,566.99,SBD,Single-ply,3
C. Allen,110+,High School,13-19,M,217.72,95.25,181.44,494.42,SBD,Single-ply,4
B. Bonner,110+,High School,13-19,M,167.83,95.25,185.97,449.06,SBD,Single-ply,5
S. McCracken,110+,High School,13-19,M,136.08,108.86,181.44,426.38,SBD,Single-ply,6
D. Moss,110+,High School,13-19,M,136.08,81.65,181.44,399.16,SBD,Single-ply,7
M. Miracle,110+,High School,13-19,M,108.86,83.91,154.22,347,SBD,Single-ply,9
R. Featherston,110+,High School,13-19,M,136.08,81.65,158.76,376.48,SBD,Single-ply,8
