Division,WeightClassKg,Place,Name,Team,BodyweightKg,Best3SquatKg,Best3BenchKg,Best3DeadliftKg,TotalKg,Equipment,Event,Sex
Boys,51.71,1,Daniel Wilde,Jacksonville,51.71,113.4,52.16,97.52,263.08,Single-ply,SBD,M
Boys,55.79,1,Evelio Mendoza,Gilmer,54.66,136.08,65.77,140.61,342.46,Single-ply,SBD,M
Boys,55.79,2,Nate Mendoza,Kemp,52.84,127.01,61.23,136.08,324.32,Single-ply,SBD,M
Boys,59.87,1,Bobby Jackson,Jacksonville,57.38,124.74,68.04,124.74,317.51,Single-ply,SBD,M
Boys,59.87,2,Cayden Taylor,Jacksonville,57.15,88.45,49.9,111.13,249.48,Single-ply,SBD,M
Boys,59.87,DQ,Langdon Bautista,Quitman,57.92,108.86,65.77,,,Single-ply,SBD,M
Boys,67.13,1,Fabin Roman,Quitman,66.72,192.78,88.45,195.04,476.27,Single-ply,SBD,M
Boys,67.13,2,Cesar Colunga,Emory Rains,66.9,179.17,86.18,181.44,446.79,Single-ply,SBD,M
Boys,67.13,3,Sean Collins,Gilmer,64.86,165.56,83.91,158.76,408.23,Single-ply,SBD,M
Boys,67.13,4,Christian Garcia,Emory Rains,65.54,145.15,77.11,167.83,390.09,Single-ply,SBD,M
Boys,67.13,5,Lucas Enloe,Gilmer,66.68,140.61,79.38,142.88,362.87,Single-ply,SBD,M
Boys,74.84,1,Deverick Tatum,Jacksonville,74.84,190.51,99.79,226.8,517.1,Single-ply,SBD,M
Boys,74.84,2,Jax Tobias,Van,73.94,176.9,111.13,206.38,494.42,Single-ply,SBD,M
Boys,74.84,3,Nick Poppenhusen,Quitman,74.66,142.88,99.79,149.69,392.36,Single-ply,SBD,M
Boys,74.84,4,Taylor Jackson,Cushing,71.67,140.61,83.91,145.15,369.68,Single-ply,SBD,M
Boys,74.84,5,Josh Provost,Cushing,71.67,136.08,74.84,142.88,353.8,Single-ply,SBD,M
Boys,74.84,6,Stephen Hawthorne,Palestine Westwood,69.85,122.47,72.57,127.01,322.05,Single-ply,SBD,M
Boys,74.84,7,Timothy Block,Grand Saline,68.95,122.47,63.5,115.67,301.64,Single-ply,SBD,M
Boys,82.1,1,Alan Quezada,Kemp,81.65,224.53,140.61,197.31,562.45,Single-ply,SBD,M
Boys,82.1,2,Redhorse Warren,Palestine Westwood,76.66,210.92,111.13,208.65,530.7,Single-ply,SBD,M
Boys,82.1,3,Orlando Gonzalez,Palestine Westwood,79.38,192.78,111.13,192.78,496.68,Single-ply,SBD,M
Boys,82.1,4,Nathan Mize,Gilmer,81.65,188.24,90.72,210.92,489.88,Single-ply,SBD,M
Boys,82.1,5,Adrian Martinez #9,Grand Saline,78.47,170.1,124.74,185.97,480.81,Single-ply,SBD,M
Boys,82.1,6,Neal Davenport,Quitman,79.65,181.44,115.67,183.7,480.81,Single-ply,SBD,M
Boys,82.1,7,Isaiah Velasquez,Cushing,79.38,185.97,106.59,185.97,478.54,Single-ply,SBD,M
Boys,82.1,8,Tyler Garrett,Kemp,81.19,181.44,102.06,185.97,469.47,Single-ply,SBD,M
Boys,82.1,9,Beale Micah,Jacksonville,75.52,165.56,104.33,174.63,444.52,Single-ply,SBD,M
Boys,82.1,10,Dylon Gilpin,Grapeland,79.83,136.08,81.65,158.76,376.48,Single-ply,SBD,M
Boys,82.1,11,LaJuan Davis,Palestine Westwood,78.02,124.74,81.65,158.76,365.14,Single-ply,SBD,M
Boys,89.81,1,Jake Hibdon,Kemp,84.37,197.31,142.88,201.85,542.04,Single-ply,SBD,M
Boys,89.81,2,Taylor Little,Kemp,83.46,226.8,113.4,199.58,539.77,Single-ply,SBD,M
Boys,89.81,3,Derek Mayhugh,Grand Saline,83.23,176.9,106.59,183.7,467.2,Single-ply,SBD,M
Boys,89.81,4,Ashton Henry,Grapeland,87.54,185.97,95.25,181.44,462.66,Single-ply,SBD,M
Boys,89.81,5,Brad Davenport,Quitman,82.33,172.37,108.86,176.9,458.13,Single-ply,SBD,M
Boys,89.81,6,Kasey Cockrell,Kemp,86.18,163.29,108.86,181.44,453.59,Single-ply,SBD,M
Boys,89.81,7,Jon Paye,Gilmer,87.09,170.1,97.52,181.44,449.06,Single-ply,SBD,M
Boys,89.81,8,Cash Nations,Grand Saline,86.64,142.88,108.86,163.29,415.04,Single-ply,SBD,M
Boys,89.81,9,Drake Willis,Cushing,87.09,140.61,86.18,147.42,374.21,Single-ply,SBD,M
Boys,89.81,10,Buddy Teichman,Cushing,84.37,140.61,74.84,136.08,351.53,Single-ply,SBD,M
Boys,99.79,1,Eli Britt,Emory Rains,91.63,235.87,136.08,219.99,591.94,Single-ply,SBD,M
Boys,99.79,2,Rowdy Teaff,Quitman,98.07,222.26,127.01,226.8,576.06,Single-ply,SBD,M
Boys,99.79,3,Jose Rodriguez,Gilmer,99.34,231.33,106.59,226.8,564.72,Single-ply,SBD,M
Boys,99.79,4,Christian Lemus,Van,98.88,226.8,140.61,185.97,553.38,Single-ply,SBD,M
Boys,99.79,5,Sammy Palma,Grand Saline,99.79,204.12,127.01,219.99,551.11,Single-ply,SBD,M
Boys,99.79,6,Emmitt Eckler,Jacksonville,99.56,185.97,145.15,188.24,519.36,Single-ply,SBD,M
Boys,99.79,7,Flavio Hernandez,Jacksonville,93.44,188.24,129.27,199.58,517.1,Single-ply,SBD,M
Boys,99.79,8,Wacey Warren,Quitman,97.98,206.38,124.74,163.29,494.42,Single-ply,SBD,M
Boys,99.79,9,Jason White,Emory Rains,98.43,167.83,113.4,167.83,449.06,Single-ply,SBD,M
Boys,99.79,10,Maurice Calhoun,Palestine Westwood,98.66,161.03,120.2,158.76,439.98,Single-ply,SBD,M
Boys,99.79,11,Dustin Wallace,Emory Rains,95.03,158.76,86.18,158.76,403.7,Single-ply,SBD,M
Boys,109.77,1,Wooda Johnson,Jacksonville,102.51,210.92,147.42,240.4,598.74,Single-ply,SBD,M
Boys,109.77,2,David Delgado,Kemp,104.33,240.4,158.76,199.58,598.74,Single-ply,SBD,M
Boys,109.77,3,Caleb York,Van,109.32,206.38,147.42,192.78,546.58,Single-ply,SBD,M
Boys,109.77,4,Landon Green,Gilmer,108.86,217.72,102.06,204.12,523.9,Single-ply,SBD,M
Boys,109.77,5,Zandrick Morrow,Jacksonville,103.42,183.7,113.4,219.99,517.1,Single-ply,SBD,M
Boys,124.74,1,Malik Benson,Palestine Westwood,113.85,272.16,140.61,233.6,646.37,Single-ply,SBD,M
Boys,124.74,2,Luke Linebaugh,Kemp,115.89,260.82,136.08,226.8,623.69,Single-ply,SBD,M
Boys,124.74,3,Jamaal Wheeler,Gilmer,112.04,249.48,131.54,238.14,619.15,Single-ply,SBD,M
Boys,124.74,4,Grant Farley,Quinlan Boles,121.56,242.67,131.54,231.33,605.55,Single-ply,SBD,M
Boys,124.74,5,Roland Stevens,Grand Saline,119.75,238.14,129.27,222.26,589.67,Single-ply,SBD,M
Boys,124.74,6,Sergio Cabrera,Jacksonville,120.66,229.06,147.42,210.92,587.4,Single-ply,SBD,M
Boys,124.74,7,Keevon Jackson,Palestine Westwood,120.2,170.1,72.57,156.49,399.16,Single-ply,SBD,M
Boys,124.74+,1,Taylor McBride,Cushing,145.15,324.32,158.76,265.35,748.43,Single-ply,SBD,M
Boys,124.74+,2,Joseph Lopez,Kemp,154.67,240.4,129.27,208.65,578.33,Single-ply,SBD,M
Boys,124.74+,3,Isaac Sims,Quitman,131.9,176.9,111.13,199.58,487.61,Single-ply,SBD,M
Boys,124.74+,4,Noah Leweling,Quitman,131.36,183.7,104.33,167.83,455.86,Single-ply,SBD,M
Boys,124.74+,DQ,Garrett Barnes,Grand Saline,135.17,,,,,Single-ply,SBD,M
