Division,WeightClassKg,Place,Name,Team,BodyweightKg,Best3SquatKg,Best3BenchKg,Best3DeadliftKg,TotalKg,Equipment,Event,Sex
Boys,55.79,1,Andrew Paredez,Big Spring,51.8,156.49,81.65,181.44,419.57,Single-ply,SBD,M
Boys,51.71,2,Brady Robbins,Midland Greenwood,48.72,136.08,79.38,136.08,351.53,Single-ply,SBD,M
Boys,51.71,3,Seth Barton,Midland Greenwood,50.62,124.74,77.11,145.15,347,Single-ply,SBD,M
Boys,51.71,4,Joseph Martinez,Colorado City Colorado,50.98,122.47,68.04,136.08,326.59,Single-ply,SBD,M
Boys,55.79,5,Anthony Lara,Colorado City Colorado,51.94,120.2,65.77,140.61,326.59,Single-ply,SBD,M
Boys,51.71,6,Omar Alonso,Snyder,49.53,104.33,72.57,124.74,301.64,Single-ply,SBD,M
Boys,51.71,7,Aaron Carroll,Big Spring,45.9,74.84,43.09,102.06,219.99,Single-ply,SBD,M
Boys,51.71,8,Jose de Leon,Sterling City,46.72,74.84,52.16,92.99,219.99,Single-ply,SBD,M
Boys,55.79,1,Tyler Nairn,Big Spring,55.07,192.78,92.99,161.03,446.79,Single-ply,SBD,M
Boys,59.87,2,Luke Krueger,Snyder,56.02,127.01,61.23,140.61,328.85,Single-ply,SBD,M
Boys,55.79,3,Tyler McFall,Coahoma,54.98,111.13,54.43,122.47,288.03,Single-ply,SBD,M
Boys,55.79,4,Julian Murrillo,Snyder,54.98,99.79,63.5,122.47,285.76,Single-ply,SBD,M
Boys,59.87,1,Dillon Hughes,Sterling City,58.42,165.56,99.79,183.7,449.06,Single-ply,SBD,M
Boys,59.87,2,Daniel Sánchez,Midland Greenwood,57.06,147.42,90.72,154.22,392.36,Single-ply,SBD,M
Boys,59.87,3,Zach Holmes,Coahoma,58.33,138.35,83.91,140.61,362.87,Single-ply,SBD,M
Boys,59.87,4,Justin Ormsby,Big Spring,59.65,127.01,65.77,142.88,335.66,Single-ply,SBD,M
Boys,59.87,5,Adam Brito,Coahoma,59.15,99.79,70.31,122.47,292.57,Single-ply,SBD,M
Boys,67.13,1,Aj Martinez,Coahoma,63.59,163.29,97.52,176.9,437.72,Single-ply,SBD,M
Boys,67.13,2,Dillon Daniel,Forsan,62.96,172.37,90.72,170.1,433.18,Single-ply,SBD,M
Boys,67.13,3,Trenton Crenshaw,Coahoma,66.22,149.69,102.06,181.44,433.18,Single-ply,SBD,M
Boys,67.13,4,Josue Rodriguez,Sterling City,61.14,142.88,90.72,142.88,376.48,Single-ply,SBD,M
Boys,67.13,5,Travis Ballard,Forsan,65.5,140.61,79.38,151.95,371.95,Single-ply,SBD,M
Boys,67.13,6,Johnathan Rankin,Colorado City Colorado,61.05,145.15,68.04,151.95,365.14,Single-ply,SBD,M
Boys,67.13,7,Jake Everett,Sterling City,63.68,124.74,74.84,145.15,344.73,Single-ply,SBD,M
Boys,67.13,8,Joe Isaac Escobedo-Gonzales,Coahoma,61.87,122.47,72.57,122.47,317.51,Single-ply,SBD,M
Boys,74.84,9,Gunnar Holcomb,Midland Greenwood,67.31,106.59,79.38,108.86,294.84,Single-ply,SBD,M
Boys,67.13,10,Josh Grimsley,Coahoma,63.14,102.06,65.77,117.93,285.76,Single-ply,SBD,M
Boys,74.84,11,Adam Gonzales,Big Spring,67.36,81.65,68.04,133.81,283.5,Single-ply,SBD,M
Boys,67.13,DQ,Brendan Garza,Snyder,66.68,,,,,Single-ply,SBD,M
Boys,67.13,DQ,Stephen Fuentes,Sterling City,65.23,,,,,Single-ply,SBD,M
Boys,82.1,1,Christian Van Wey,Coahoma,75.02,181.44,92.99,181.44,455.86,Single-ply,SBD,M
Boys,74.84,2,Enrique Barron,Snyder,72.3,154.22,90.72,188.24,433.18,Single-ply,SBD,M
Boys,74.84,3,Kade Wallrath,Midland Greenwood,69.76,151.95,104.33,161.03,417.3,Single-ply,SBD,M
Boys,74.84,4,Zach Luera,Colorado City Colorado,70.13,154.22,106.59,149.69,410.5,Single-ply,SBD,M
Boys,74.84,5,Brian Ramos,Midland Greenwood,73.48,145.15,97.52,158.76,401.43,Single-ply,SBD,M
Boys,74.84,6,Jared Everett,Sterling City,67.68,147.42,79.38,158.76,385.55,Single-ply,SBD,M
Boys,74.84,7,Ryan Billingsley,Coahoma,71.12,142.88,88.45,154.22,385.55,Single-ply,SBD,M
Boys,74.84,8,Candon Green,Sterling City,69.76,145.15,68.04,154.22,367.41,Single-ply,SBD,M
Boys,74.84,9,Tj Ellis,Forsan,73.12,136.08,77.11,140.61,353.8,Single-ply,SBD,M
Boys,74.84,10,Hulen Hubbard,Midland Lee,74.57,102.06,61.23,124.74,288.03,Single-ply,SBD,M
Boys,82.1,11,Kelan Carr,Midland Lee,74.93,74.84,68.04,115.67,258.55,Single-ply,SBD,M
Boys,82.1,1,Blake Osborn,Midland Greenwood,80.01,204.12,142.88,190.51,537.51,Single-ply,SBD,M
Boys,82.1,2,Ashton Voight,Forsan,78.38,176.9,92.99,165.56,435.45,Single-ply,SBD,M
Boys,82.1,3,Darian Espinoza,Colorado City Colorado,77.38,142.88,83.91,151.95,378.75,Single-ply,SBD,M
Boys,82.1,4,Kougar Rodriguez,Midland Lee,81.65,117.93,86.18,124.74,328.85,Single-ply,SBD,M
Boys,89.81,1,Sean Strickland,Midland Greenwood,88.09,201.85,138.35,201.85,542.04,Single-ply,SBD,M
Boys,89.81,2,Mason Lane,Big Spring,85.09,179.17,99.79,201.85,480.81,Single-ply,SBD,M
Boys,89.81,3,Logan Elsey,Midland Greenwood,89.36,174.63,111.13,172.37,458.13,Single-ply,SBD,M
Boys,89.81,4,Davian Moore,Big Spring,82.74,158.76,95.25,172.37,426.38,Single-ply,SBD,M
Boys,89.81,5,Kris Flynn,Midland Greenwood,85.64,156.49,108.86,151.95,417.3,Single-ply,SBD,M
Boys,89.81,6,Taylon Kincaid,Coahoma,88.63,158.76,97.52,147.42,403.7,Single-ply,SBD,M
Boys,89.81,7,Chris Dominguez,Coahoma,86,158.76,92.99,149.69,401.43,Single-ply,SBD,M
Boys,89.81,8,Eddy Sanchez,Sterling City,87.36,145.15,90.72,158.76,394.63,Single-ply,SBD,M
Boys,89.81,9,Dd Spraglin,Midland Lee,83.1,106.59,81.65,147.42,335.66,Single-ply,SBD,M
Boys,99.79,1,Paul Mata,Snyder,99.43,208.65,122.47,190.51,521.63,Single-ply,SBD,M
Boys,99.79,2,Alex Johnson #7,Big Spring,97.52,192.78,127.01,167.83,487.61,Single-ply,SBD,M
Boys,99.79,3,Colin Sutton,Big Spring,92.53,183.7,102.06,170.1,455.86,Single-ply,SBD,M
Boys,99.79,4,Dylan Treadaway,Big Spring,94.8,122.47,61.23,124.74,308.44,Single-ply,SBD,M
Boys,99.79,5,Michael Vandiver,Midland Greenwood,98.88,111.13,79.38,99.79,290.3,Single-ply,SBD,M
Boys,99.79,DQ,Felix Rodriguez,Midland Greenwood,97.16,242.67,,,,Single-ply,SBD,M
Boys,109.77,1,Nathan Schneider,Big Spring,109.68,240.4,145.15,217.72,603.28,Single-ply,SBD,M
Boys,109.77,2,Levi Molina,Big Spring,109.68,206.38,117.93,188.24,512.56,Single-ply,SBD,M
Boys,109.77,3,Matthew Nix,Snyder,103.6,204.12,97.52,199.58,501.22,Single-ply,SBD,M
Boys,109.77,4,Boomer Warren,Midland Lee,105.69,183.7,102.06,163.29,449.06,Single-ply,SBD,M
Boys,109.77,5,Zane Spraglin,Midland Lee,107.73,145.15,106.59,170.1,421.84,Single-ply,SBD,M
Boys,109.77,6,Jordan Dunn,Big Spring,109.04,172.37,88.45,133.81,394.63,Single-ply,SBD,M
Boys,109.77,7,Jarod Rose,Midland Greenwood,102.97,147.42,92.99,147.42,387.82,Single-ply,SBD,M
Boys,109.77,DQ,Taylor Morin,Forsan,104.14,,,,,Single-ply,SBD,M
Boys,124.74,1,Israel Beltran,Colorado City Colorado,111.58,226.8,156.49,201.85,585.13,Single-ply,SBD,M
Boys,124.74,2,Zane Sorrells,Snyder,112.04,226.8,102.06,213.19,542.04,Single-ply,SBD,M
Boys,124.74,3,Justin Trawick,Colorado City Colorado,112.85,208.65,111.13,204.12,523.9,Single-ply,SBD,M
Boys,124.74,4,Brycson Pineda,Forsan,115.67,195.04,97.52,213.19,505.76,Single-ply,SBD,M
Boys,124.74,5,Skylar Dreshman,Sterling City,117.3,170.1,140.61,181.44,492.15,Single-ply,SBD,M
Boys,124.74,DQ,Eldon Niblett,Midland Greenwood,110.59,272.16,,,,Single-ply,SBD,M
Boys,124.74+,1,Jesus Rodriguez,Midland Greenwood,126.1,272.16,151.95,235.87,659.98,Single-ply,SBD,M
Boys,124.74+,2,Trent Cottrell,Snyder,132.9,204.12,129.27,213.19,546.58,Single-ply,SBD,M
Boys,124.74+,3,Francisco Esparza,Snyder,138.07,199.58,120.2,224.53,544.31,Single-ply,SBD,M
Boys,124.74+,4,Derek Gusman,Big Spring,149.96,231.33,113.4,190.51,535.24,Single-ply,SBD,M
Boys,124.74+,5,Jhalil Esters,Colorado City Colorado,134.26,195.04,90.72,219.99,505.76,Single-ply,SBD,M
Boys,124.74+,6,Stephen Quiroz,Midland Lee,126.73,97.52,88.45,158.76,344.73,Single-ply,SBD,M
Boys,124.74+,7,Jaquez Julian,Midland Lee,127.82,108.86,81.65,133.81,324.32,Single-ply,SBD,M
Boys,124.74+,DQ,Nick Conner,Big Spring,130.63,,,,,Single-ply,SBD,M
Boys,124.74+,DQ,Tom Rivera,Colorado City Colorado,210.92,274.42,,,,Single-ply,SBD,M
Boys,,NS,Nathan Vidal,Forsan,,,,,,Single-ply,SBD,M
Boys,,NS,Jose Juarez #4,Snyder,,,,,,Single-ply,SBD,M
Boys,,NS,Isaiah Garza,Midland Lee,,,,,,Single-ply,SBD,M
Boys,,NS,Nacho Rubio,Midland Lee,,,,,,Single-ply,SBD,M
Boys,,NS,Tristan Sage,Midland Greenwood,,,,,,Single-ply,SBD,M
Boys,,NS,Y'Mari Collins,Midland Lee,,,,,,Single-ply,SBD,M
Boys,,NS,Turbo Aguero,Sterling City,,,,,,Single-ply,SBD,M
