Division,WeightClassKg,Place,Name,Team,BodyweightKg,Best3SquatKg,Best3BenchKg,Best3DeadliftKg,TotalKg,Equipment,Event,Sex,BirthDate
Boys,51.71,1,Renier Reyes,Decatur,50.8,138.35,86.18,154.22,378.75,Single-ply,SBD,M,
Boys,55.79,DQ,Daniel Rodriquez,Decatur,55.34,136.08,,,,Single-ply,SBD,M,
Boys,59.87,1,Mathew Salazar,Lake Worth,59.87,145.15,92.99,190.51,428.64,Single-ply,SBD,M,
Boys,59.87,2,Manuel Rodriguez #2,Decatur,59.42,140.61,88.45,154.22,383.29,Single-ply,SBD,M,
Boys,59.87,3,Bryan Gonzalez,Bridgeport,59.87,151.95,79.38,142.88,374.21,Single-ply,SBD,M,
Boys,59.87,4,Michael Ramirez,Lake Worth,58.06,145.15,63.5,163.29,371.95,Single-ply,SBD,M,
Boys,59.87,5,Dalton Gross,Decatur,58.51,138.35,95.25,138.35,371.95,Single-ply,SBD,M,
Boys,67.13,1,Truitt Petty,Weatherford,65.77,181.44,102.06,188.24,471.74,Single-ply,SBD,M,
Boys,67.13,2,Jeremiah Wilton,Weatherford,67.13,181.44,99.79,158.76,439.98,Single-ply,SBD,M,
Boys,67.13,3,Zane White,Bridgeport,65.32,165.56,77.11,158.76,401.43,Single-ply,SBD,M,
Boys,67.13,4,Nathan Orozco,Lake Worth,66.22,138.35,68.04,154.22,360.61,Single-ply,SBD,M,
Boys,74.84,1,Jesus Garcia,Lake Worth,74.84,183.7,117.93,208.65,510.29,Single-ply,SBD,M,
Boys,74.84,2,Anthony Salas #3,Decatur,74.39,192.78,97.52,192.78,483.08,Single-ply,SBD,M,
Boys,74.84,3,Luke Miner,Decatur,68.04,172.37,117.93,188.24,478.54,Single-ply,SBD,M,
Boys,74.84,4,Landon Herring,Bridgeport,72.12,165.56,102.06,183.7,451.32,Single-ply,SBD,M,
Boys,74.84,5,Ryan Carpenter,Bridgeport,73.48,170.1,86.18,185.97,442.25,Single-ply,SBD,M,
Boys,74.84,6,Kevin Salas,Decatur,73.03,170.1,92.99,174.63,437.72,Single-ply,SBD,M,
Boys,74.84,7,Karlos Moctezuma,Lake Worth,74.84,170.1,88.45,165.56,424.11,Single-ply,SBD,M,
Boys,74.84,8,James Vela,Graham,74.84,151.95,92.99,167.83,412.77,Single-ply,SBD,M,
Boys,74.84,9,Kyle Markum,Weatherford,69.85,154.22,86.18,167.83,408.23,Single-ply,SBD,M,
Boys,74.84,10,Anthony Sirianni,Graham,74.84,158.76,65.77,147.42,371.95,Single-ply,SBD,M,
Boys,74.84,DQ,Damarion Polty,Lake Worth,69.4,163.29,,,,Single-ply,SBD,M,
Boys,82.1,1,Javier Huerta,Bridgeport,78.93,199.58,136.08,195.04,530.7,Single-ply,SBD,M,
Boys,82.1,2,Colby White,Bridgeport,80.29,217.72,102.06,210.92,530.7,Single-ply,SBD,M,
Boys,82.1,3,Kris Billingsley,Decatur,80.74,195.04,111.13,170.1,476.27,Single-ply,SBD,M,
Boys,82.1,4,Colton Ligon,Graham,82.1,183.7,108.86,181.44,474,Single-ply,SBD,M,
Boys,82.1,5,Aldo Cerceres,Graham,82.1,188.24,99.79,181.44,469.47,Single-ply,SBD,M,
Boys,82.1,6,Thomas Hatley,Decatur,80.29,181.44,90.72,172.37,444.52,Single-ply,SBD,M,
Boys,89.81,1,Christian Medina,Weatherford,89.81,206.38,149.69,210.92,566.99,Single-ply,SBD,M,
Boys,89.81,2,Bryson Ross,Weatherford,88,156.49,131.54,174.63,462.66,Single-ply,SBD,M,
Boys,89.81,DQ,Devin Salazar,Mineral Wells,83.46,192.78,,,,Single-ply,SBD,M,
Boys,99.79,1,Riley Wrinkle,Weatherford,98.88,238.14,145.15,226.8,610.08,Single-ply,SBD,M,
Boys,99.79,2,Victor Davila,Weatherford,94.35,215.46,154.22,219.99,589.67,Single-ply,SBD,M,
Boys,99.79,3,Karter Houchin,Decatur,95.71,213.19,106.59,192.78,512.56,Single-ply,SBD,M,
Boys,99.79,4,Joashua Salazar,Lake Worth,93.89,188.24,124.74,192.78,505.76,Single-ply,SBD,M,
Boys,99.79,5,Anthony Flores,Mineral Wells,99.79,183.7,102.06,199.58,485.34,Single-ply,SBD,M,
Boys,99.79,6,JW Ethridge,Mineral Wells,94.35,183.7,102.06,174.63,460.4,Single-ply,SBD,M,
Boys,99.79,7,Jacob O'Dell,Bridgeport,95.71,170.1,92.99,163.29,426.38,Single-ply,SBD,M,
Boys,99.79,8,Dylan Rudder,Graham,99.79,163.29,70.31,147.42,381.02,Single-ply,SBD,M,
Boys,109.77,1,Lucas James,Weatherford,104.33,213.19,149.69,208.65,571.53,Single-ply,SBD,M,
Boys,109.77,2,Triston Snyder,Bridgeport,109.32,226.8,115.67,199.58,542.04,Single-ply,SBD,M,
Boys,109.77,3,Logan Marshall,Bridgeport,108.86,208.65,106.59,190.51,505.76,Single-ply,SBD,M,
Boys,109.77,4,Ian Shanchez,Mineral Wells,103.42,183.7,102.06,201.85,487.61,Single-ply,SBD,M,
Boys,109.77,5,Heladio Gonzales,Mineral Wells,103.42,158.76,97.52,181.44,437.72,Single-ply,SBD,M,
Boys,109.77,6,Gordan Taylor,Graham,109.77,170.1,95.25,167.83,433.18,Single-ply,SBD,M,
Boys,109.77,7,Justin Fraizer,Graham,109.77,170.1,86.18,145.15,401.43,Single-ply,SBD,M,
Boys,124.74,1,Julian Casias,Decatur,121.11,290.3,183.7,247.21,721.21,Single-ply,SBD,M,
Boys,124.74,2,Davion Haynes,Lake Worth,112.04,251.74,136.08,272.16,659.98,Single-ply,SBD,M,
Boys,124.74,3,Ayden Mast,Decatur,122.92,235.87,142.88,206.38,585.13,Single-ply,SBD,M,
Boys,124.74,4,Cayden Markus,Weatherford,112.04,208.65,145.15,215.46,569.26,Single-ply,SBD,M,
Boys,124.74,5,Jake O'Harra,Weatherford,123.38,192.78,158.76,185.97,537.51,Single-ply,SBD,M,
Boys,124.74,6,Omar Galvan,Mineral Wells,118.84,231.33,108.86,188.24,528.44,Single-ply,SBD,M,
Boys,124.74,7,Elijah Telfair,Weatherford,124.74,199.58,131.54,195.04,526.17,Single-ply,SBD,M,
Boys,124.74,8,Mathew Welch,Lake Worth,112.04,192.78,106.59,195.04,494.42,Single-ply,SBD,M,
Boys,124.74,9,Mathu Perkins,Bridgeport,119.29,199.58,97.52,192.78,489.88,Single-ply,SBD,M,
Boys,124.74+,1,Hayden Philpot,Decatur,135.17,249.48,167.83,181.44,598.74,Single-ply,SBD,M,
Boys,124.74+,2,Wes Sanders,Lake Worth,146.51,242.67,140.61,213.19,596.47,Single-ply,SBD,M,
Boys,124.74+,3,Ronald Sears,Lake Worth,132.9,240.4,138.35,213.19,591.94,Single-ply,SBD,M,
