Division,WeightClassKg,Place,Name,Team,BodyweightKg,Best3SquatKg,Best3BenchKg,Best3DeadliftKg,TotalKg,Equipment,Event,Sex,BirthDate
Boys,51.71,1,Juan Trejo,Friona,51.71,195.04,97.52,174.63,467.2,Single-ply,SBD,M,
Boys,51.71,2,Nathan Flores,Friona,51.71,142.88,65.77,151.95,360.61,Single-ply,SBD,M,
Boys,51.71,3,Damion Gonzales,Lockney,46.81,127.01,61.23,113.4,301.64,Single-ply,SBD,M,
Boys,51.71,4,Nathan Rendon,Levelland,49.62,90.72,58.97,104.33,254.01,Single-ply,SBD,M,
Boys,51.71,5,Hunter Penrod,Sudan,51.07,97.52,52.16,97.52,247.21,Single-ply,SBD,M,
Boys,51.71,6,Patricio Garcia,Brownfield,50.89,92.99,47.63,88.45,229.06,Single-ply,SBD,M,
Boys,51.71,7,Raul Lopez,Levelland,49.35,77.11,58.97,90.72,226.8,Single-ply,SBD,M,
Boys,51.71,8,Marcos Gonzales,Plains,47.9,52.16,34.02,63.5,149.69,Single-ply,SBD,M,
Boys,55.79,1,Mattox Evans,Big Spring,54.61,131.54,68.04,131.54,331.12,Single-ply,SBD,M,
Boys,55.79,2,Brady Brown,New Home,53.52,90.72,52.16,95.25,238.14,Single-ply,SBD,M,
Boys,55.79,DQ,Sebastian Rios,Ralls,55.79,117.93,,,,Single-ply,SBD,M,
Boys,55.79,DQ,Isaiah Reyes,Lockney,52.25,120.2,,,,Single-ply,SBD,M,
Boys,59.87,1,Dio Ponce,Friona,58.51,154.22,90.72,167.83,412.77,Single-ply,SBD,M,
Boys,59.87,2,Cruz Martinez,Big Spring,59.51,161.03,90.72,158.76,410.5,Single-ply,SBD,M,
Boys,59.87,3,Josiah Rodriguez,Meadow,58.79,147.42,81.65,174.63,403.7,Single-ply,SBD,M,
Boys,59.87,4,Kenny Richardson,Big Spring,59.6,147.42,92.99,149.69,390.09,Single-ply,SBD,M,
Boys,59.87,5,Jaylon Luna,Ropesville Ropes,58.69,136.08,83.91,145.15,365.14,Single-ply,SBD,M,
Boys,59.87,6,Mario Bautista,Friona,59.15,131.54,90.72,142.88,365.14,Single-ply,SBD,M,
Boys,59.87,7,Leroy Johnson,Big Spring,57.7,108.86,65.77,127.01,301.64,Single-ply,SBD,M,
Boys,59.87,8,Nick Martinez,Levelland,59.15,102.06,61.23,129.27,292.57,Single-ply,SBD,M,
Boys,59.87,DQ,Connor Andrae,Big Spring,56.79,111.13,,,,Single-ply,SBD,M,
Boys,67.13,1,Jeremiah Diaz,Friona,66.32,222.26,113.4,183.7,519.36,Single-ply,SBD,M,
Boys,67.13,2,Shawn Mendoza,Big Spring,66.95,197.31,108.86,188.24,494.42,Single-ply,SBD,M,
Boys,67.13,3,Xavier Garcia,Ralls,67.13,197.31,102.06,192.78,492.15,Single-ply,SBD,M,
Boys,67.13,4,Josh Lopez,Big Spring,61.6,179.17,92.99,210.92,483.08,Single-ply,SBD,M,
Boys,67.13,5,Bryson Jones,Ralls,65.86,188.24,97.52,179.17,464.93,Single-ply,SBD,M,
Boys,67.13,6,Daniel Estrada,New Home,66.59,172.37,115.67,174.63,462.66,Single-ply,SBD,M,
Boys,67.13,7,Steven Salazar,Ralls,67.13,174.63,108.86,174.63,458.13,Single-ply,SBD,M,
Boys,67.13,8,Blake Johnson,Hale Center,67.04,172.37,81.65,170.1,424.11,Single-ply,SBD,M,
Boys,67.13,9,Jermiah Collins,Big Spring,67.13,142.88,90.72,188.24,421.84,Single-ply,SBD,M,
Boys,67.13,10,Osiris Flores,Seagraves,66.32,163.29,70.31,183.7,417.3,Single-ply,SBD,M,
Boys,67.13,11,Mauro Moreno,Ralls,64.95,147.42,95.25,167.83,410.5,Single-ply,SBD,M,
Boys,67.13,12,Ramon Zubiate,Denver City,65.5,151.95,104.33,151.95,408.23,Single-ply,SBD,M,
Boys,67.13,13,Elijah Martinez,Seagraves,63.59,140.61,83.91,163.29,387.82,Single-ply,SBD,M,
Boys,67.13,14,Moses Valencia,Hale Center,65.59,129.27,81.65,161.03,371.95,Single-ply,SBD,M,
Boys,67.13,15,Brady Parker,Meadow,64.59,131.54,74.84,158.76,365.14,Single-ply,SBD,M,
Boys,67.13,16,Jose Flores,Seagraves,67.04,136.08,74.84,154.22,365.14,Single-ply,SBD,M,
Boys,67.13,17,Samuel Salinas,Ralls,66.77,120.2,86.18,140.61,347,Single-ply,SBD,M,
Boys,67.13,18,Xuan Garcia,Friona,60.33,122.47,65.77,138.35,326.59,Single-ply,SBD,M,
Boys,67.13,19,Cason Laminack,Ralls,63.59,120.2,68.04,113.4,301.64,Single-ply,SBD,M,
Boys,67.13,20,Austin Gunnels,Brownfield,66.95,99.79,61.23,131.54,292.57,Single-ply,SBD,M,
Boys,67.13,21,Julio Quintero,Denver City,67.13,81.65,47.63,115.67,244.94,Single-ply,SBD,M,
Boys,67.13,DQ,Tristan Ramirez,Levelland,64.68,142.88,,,,Single-ply,SBD,M,
Boys,67.13,DQ,Jose Zavala,Ralls,63.96,142.88,83.91,,,Single-ply,SBD,M,
Boys,67.13,DQ,Adrian Alvarado,Meadow,67.13,,,,,Single-ply,SBD,M,
Boys,67.13,DQ,Braxton Beck,New Home,63.96,113.4,81.65,,,Single-ply,SBD,M,
Boys,67.13,DQ,Dylan Brown,New Home,66.5,129.27,90.72,,,Single-ply,SBD,M,
Boys,74.84,1,Roger Palacios,Friona,74.84,197.31,106.59,190.51,494.42,Single-ply,SBD,M,
Boys,74.84,2,Gabriel Zubiate,Seminole,73.39,199.58,99.79,179.17,478.54,Single-ply,SBD,M,
Boys,74.84,3,Dusty Chavez,Big Spring,68.13,170.1,106.59,176.9,453.59,Single-ply,SBD,M,
Boys,74.84,4,Slade Edwards,Seminole,68.67,174.63,104.33,172.37,451.32,Single-ply,SBD,M,
Boys,74.84,5,Nate Gensler,Brownfield,73.84,158.76,104.33,181.44,444.52,Single-ply,SBD,M,
Boys,74.84,6,Shawn Chavez,Ralls,74.03,156.49,86.18,181.44,424.11,Single-ply,SBD,M,
Boys,74.84,7,Ivan Trinidad,Denver City,71.49,133.81,102.06,158.76,394.63,Single-ply,SBD,M,
Boys,74.84,8,Johnathan Valentine,Meadow,73.21,108.86,97.52,188.24,394.63,Single-ply,SBD,M,
Boys,74.84,9,David Olivas,Andrews,68.04,147.42,86.18,151.95,385.55,Single-ply,SBD,M,
Boys,74.84,10,Matthew Valenzuela,Andrews,72.67,131.54,83.91,149.69,365.14,Single-ply,SBD,M,
Boys,74.84,11,Luke Pompa,Levelland,73.12,129.27,77.11,151.95,358.34,Single-ply,SBD,M,
Boys,74.84,12,Javier Garcia,Andrews,69.31,117.93,81.65,147.42,347,Single-ply,SBD,M,
Boys,74.84,13,Jacob Guy,Andrews,73.48,133.81,63.5,131.54,328.85,Single-ply,SBD,M,
Boys,74.84,14,Sebastian Brown,Plains,67.59,113.4,70.31,133.81,317.51,Single-ply,SBD,M,
Boys,74.84,15,Gabe Abarca,Friona,71.76,104.33,54.43,92.99,251.74,Single-ply,SBD,M,
Boys,74.84,DQ,Aaron Salazar,Seminole,73.57,,,,,Single-ply,SBD,M,
Boys,82.1,1,Kingsley Rodriguez,Seagraves,80.56,235.87,145.15,272.16,653.17,Single-ply,SBD,M,
Boys,82.1,2,Skyler Davis,Levelland,80.01,208.65,127.01,254.01,589.67,Single-ply,SBD,M,
Boys,82.1,3,Devin Doerksen,Seminole,75.48,213.19,111.13,208.65,532.97,Single-ply,SBD,M,
Boys,82.1,4,Sergio Salinas,Ralls,77.47,208.65,108.86,213.19,530.7,Single-ply,SBD,M,
Boys,82.1,5,Rogelio Cervantes,Big Spring,81.92,192.78,115.67,183.7,492.15,Single-ply,SBD,M,
Boys,82.1,6,Alex Reyna,Hale Center,82.01,174.63,86.18,181.44,442.25,Single-ply,SBD,M,
Boys,82.1,7,Rey Carta,Hale Center,78.83,170.1,81.65,179.17,430.91,Single-ply,SBD,M,
Boys,82.1,8,Cade Reynolds,Plains,78.38,120.2,79.38,158.76,358.34,Single-ply,SBD,M,
Boys,82.1,9,Stephen De La Rosa,Plains,77.47,131.54,72.57,140.61,344.73,Single-ply,SBD,M,
Boys,82.1,10,Isiah Espinoza,Sudan,78.38,145.15,56.7,127.01,328.85,Single-ply,SBD,M,
Boys,82.1,11,Ky Collins,Ropesville Ropes,80.74,127.01,70.31,124.74,322.05,Single-ply,SBD,M,
Boys,82.1,12,Landon Longoria,Seagraves,82.1,115.67,68.04,115.67,299.37,Single-ply,SBD,M,
Boys,82.1,13,Ryan Halford,Meadow,80.83,99.79,52.16,102.06,254.01,Single-ply,SBD,M,
Boys,82.1,DQ,Silas Urrurtia,Lockney,81.74,,,,,Single-ply,SBD,M,
Boys,89.81,1,Kaleb Salazar,Ralls,83.55,240.4,131.54,240.4,612.35,Single-ply,SBD,M,
Boys,89.81,2,Damon Casarez,Seminole,86.45,233.6,127.01,208.65,569.26,Single-ply,SBD,M,
Boys,89.81,3,Colby Buckner,Andrews,88.09,181.44,108.86,151.95,442.25,Single-ply,SBD,M,
Boys,89.81,4,Jonah Gonzales,Plains,84.1,154.22,108.86,174.63,437.72,Single-ply,SBD,M,
Boys,89.81,5,Jacob Rando,Friona,87.82,163.29,102.06,167.83,433.18,Single-ply,SBD,M,
Boys,89.81,6,Anthony Diaz,Friona,88.54,111.13,61.23,120.2,292.57,Single-ply,SBD,M,
Boys,89.81,DQ,Caleb Pritchard,Lockney,85.28,,,,,Single-ply,SBD,M,
Boys,99.79,1,Adam Velasco,Denver City,97.61,272.16,195.04,208.65,675.85,Single-ply,SBD,M,
Boys,99.79,2,Isaac Garza,Levelland,90.54,244.94,145.15,247.21,637.3,Single-ply,SBD,M,
Boys,99.79,3,Elias Martinez,Ralls,96.8,233.6,142.88,235.87,612.35,Single-ply,SBD,M,
Boys,99.79,4,Keanu Villarreal,Lockney,90.54,213.19,149.69,195.04,557.92,Single-ply,SBD,M,
Boys,99.79,5,Damian Pena,Denver City,94.08,215.46,136.08,204.12,555.65,Single-ply,SBD,M,
Boys,99.79,6,Petronillo Bustamante,Andrews,91.99,217.72,122.47,210.92,551.11,Single-ply,SBD,M,
Boys,99.79,7,Jaxon Washington,Seminole,96.34,204.12,120.2,199.58,523.9,Single-ply,SBD,M,
Boys,99.79,8,Danny Garza,Brownfield,99.79,197.31,115.67,172.37,485.34,Single-ply,SBD,M,
Boys,99.79,9,Jeremiah Talamantes,Seminole,96.8,197.31,90.72,158.76,446.79,Single-ply,SBD,M,
Boys,99.79,10,Malcolm Mendez,Meadow,90.54,147.42,99.79,185.97,433.18,Single-ply,SBD,M,
Boys,99.79,11,Manny Gonzalez,Denver City,99.79,161.03,108.86,154.22,424.11,Single-ply,SBD,M,
Boys,99.79,12,Elijah Robledo,Friona,96.62,172.37,83.91,136.08,392.36,Single-ply,SBD,M,
Boys,99.79,13,Julian Garcia,Andrews,99.34,158.76,77.11,127.01,362.87,Single-ply,SBD,M,
Boys,99.79,14,Eduardo Juarez,Friona,92.9,163.29,74.84,120.2,358.34,Single-ply,SBD,M,
Boys,99.79,15,Destry Benally,Andrews,91.17,113.4,63.5,142.88,319.78,Single-ply,SBD,M,
Boys,99.79,DQ,Angel Lozano,Plains,96.25,124.74,,,,Single-ply,SBD,M,
Boys,109.77,1,Alan Mendoza,Seagraves,109.41,256.28,142.88,226.8,625.96,Single-ply,SBD,M,
Boys,109.77,2,Irvin Delgado,Seminole,100.24,226.8,122.47,213.19,562.45,Single-ply,SBD,M,
Boys,109.77,3,Jake Padilla,Friona,106.59,210.92,124.74,210.92,546.58,Single-ply,SBD,M,
Boys,109.77,4,Esai Flores,Hale Center,104.42,213.19,104.33,190.51,508.02,Single-ply,SBD,M,
Boys,109.77,5,Cash Caswell,Andrews,106.41,145.15,79.38,154.22,378.75,Single-ply,SBD,M,
Boys,109.77,6,Alejandro Arrando,Brownfield,106.78,124.74,83.91,145.15,353.8,Single-ply,SBD,M,
Boys,124.74,1,Miguel Lara,Lockney,118.48,278.96,158.76,219.99,657.71,Single-ply,SBD,M,
Boys,124.74,2,Andrew Roberts,Big Spring,123.92,233.6,170.1,222.26,625.96,Single-ply,SBD,M,
Boys,124.74,3,Caleb Alexander,Seminole,114.12,226.8,124.74,206.38,557.92,Single-ply,SBD,M,
Boys,124.74,4,Niko Castaneda,Meadow,120.02,215.46,142.88,183.7,542.04,Single-ply,SBD,M,
Boys,124.74,DQ,Jesus Guerra,Sudan,120.56,238.14,124.74,,,Single-ply,SBD,M,
Boys,124.74,DQ,Kyler Nelson,Ropesville Ropes,124.74,158.76,102.06,,,Single-ply,SBD,M,
Boys,124.74+,1,Kwinton Jennings,Seminole,140.98,292.57,154.22,238.14,684.92,Single-ply,SBD,M,
Boys,124.74+,2,Daniel Roberts,Big Spring,131.63,199.58,151.95,201.85,553.38,Single-ply,SBD,M,
Boys,124.74+,3,Sean Castillo,Brownfield,181.16,206.38,142.88,199.58,548.85,Single-ply,SBD,M,
Boys,124.74+,DQ,Hunter Bolton,Ropesville Ropes,137.89,,,,,Single-ply,SBD,M,
