Division,WeightClassKg,Place,Name,Team,BodyweightKg,Best3SquatKg,Best3BenchKg,Best3DeadliftKg,TotalKg,Equipment,Event,Sex
Boys,51.71,1,Shawn Moore,Mineral Wells,50.94,102.06,68.04,124.74,294.84,Single-ply,SBD,M
Boys,51.71,2,Mark Pina,Bridgeport,49.08,83.91,47.63,90.72,222.26,Single-ply,SBD,M
Boys,55.79,1,Korey Grant,Weatherford,52.34,145.15,81.65,161.03,387.82,Single-ply,SBD,M
Boys,55.79,2,Garrett Upshaw,Decatur,55.11,129.27,79.38,136.08,344.73,Single-ply,SBD,M
Boys,55.79,3,Bryan Torres,Bridgeport,55.66,90.72,52.16,102.06,244.94,Single-ply,SBD,M
Boys,59.87,1,Alexis Rodriguez,Decatur,59.87,172.37,92.99,181.44,446.79,Single-ply,SBD,M
Boys,59.87,2,Dominic Gross,Decatur,59.87,129.27,83.91,147.42,360.61,Single-ply,SBD,M
Boys,59.87,3,Manuel Rodriguez #2,Decatur,58.97,133.81,83.91,136.08,353.8,Single-ply,SBD,M
Boys,59.87,4,Isaac Pocheco,Decatur,58.88,133.81,68.04,142.88,344.73,Single-ply,SBD,M
Boys,59.87,5,Zane White,Bridgeport,59.42,129.27,61.23,120.2,310.71,Single-ply,SBD,M
Boys,67.13,1,Xavier Parker,Mineral Wells,60.83,190.51,102.06,199.58,492.15,Single-ply,SBD,M
Boys,67.13,2,Cesar Acosta,Decatur,66.68,172.37,129.27,170.1,471.74,Single-ply,SBD,M
Boys,67.13,3,Landon Herring,Bridgeport,65.73,161.03,83.91,158.76,403.7,Single-ply,SBD,M
Boys,67.13,4,Dalton Gross,Decatur,60.42,133.81,90.72,140.61,365.14,Single-ply,SBD,M
Boys,67.13,5,Ryder Rhodes,Bridgeport,62.6,136.08,74.84,142.88,353.8,Single-ply,SBD,M
Boys,67.13,6,Camden Richards,Mineral Wells,63.82,136.08,65.77,151.95,353.8,Single-ply,SBD,M
Boys,67.13,7,Dayton Lawson,Bridgeport,64.68,124.74,65.77,136.08,326.59,Single-ply,SBD,M
Boys,67.13,DQ,Angel Martinez,Bridgeport,65.45,,,,,Single-ply,SBD,M
Boys,74.84,1,Colby White,Bridgeport,74.57,213.19,102.06,213.19,528.44,Single-ply,SBD,M
Boys,74.84,2,Nick Brown,Weatherford,74.16,165.56,97.52,183.7,446.79,Single-ply,SBD,M
Boys,74.84,3,Bryant Reynolds,Bridgeport,70.76,170.1,83.91,158.76,412.77,Single-ply,SBD,M
Boys,74.84,4,Devin Salazar,Mineral Wells,73.89,156.49,92.99,156.49,405.97,Single-ply,SBD,M
Boys,82.1,1,Tanner Knox,Weatherford,80.42,206.38,147.42,229.06,582.87,Single-ply,SBD,M
Boys,82.1,2,Carlos Amaro,Weatherford,82.1,201.85,136.08,192.78,530.7,Single-ply,SBD,M
Boys,82.1,3,Antonio Cano,Bridgeport,81.92,199.58,111.13,204.12,514.83,Single-ply,SBD,M
Boys,82.1,4,Reese Cannon,Decatur,80.69,190.51,108.86,195.04,494.42,Single-ply,SBD,M
Boys,82.1,5,Tanner Marlett,Bridgeport,78.02,199.58,88.45,199.58,487.61,Single-ply,SBD,M
Boys,82.1,6,Jared Singleton,Mineral Wells,79.92,181.44,102.06,158.76,442.25,Single-ply,SBD,M
Boys,82.1,7,Caleb Bartlett,Bridgeport,77.11,170.1,92.99,165.56,428.64,Single-ply,SBD,M
Boys,82.1,8,Edgar Tejada,Mineral Wells,75.39,158.76,104.33,158.76,421.84,Single-ply,SBD,M
Boys,89.81,1,Nathan Selman,Decatur,85.77,226.8,122.47,204.12,553.38,Single-ply,SBD,M
Boys,89.81,2,Chirstian Medina,Weatherford,82.51,197.31,145.15,192.78,535.24,Single-ply,SBD,M
Boys,89.81,3,Kaymin Flick,Decatur,87.72,217.72,124.74,192.78,535.24,Single-ply,SBD,M
Boys,89.81,4,Isaiah Galvan,Mineral Wells,87,181.44,106.59,188.24,476.27,Single-ply,SBD,M
Boys,99.79,1,Jonah Maston,Mineral Wells,94.39,260.82,151.95,226.8,639.57,Single-ply,SBD,M
Boys,99.79,2,Zeke Baker,Weatherford,97.61,199.58,158.76,208.65,566.99,Single-ply,SBD,M
Boys,99.79,3,Jayden Conner,Weatherford,99.7,219.99,131.54,204.12,555.65,Single-ply,SBD,M
Boys,99.79,4,Victor Davila,Weatherford,97.43,206.38,149.69,195.04,551.11,Single-ply,SBD,M
Boys,99.79,5,Dylan Songer,Weatherford,93.12,208.65,122.47,199.58,530.7,Single-ply,SBD,M
Boys,99.79,6,Logan Marshal,Bridgeport,93.17,165.56,92.99,158.76,417.3,Single-ply,SBD,M
Boys,109.77,1,Angel Esquivel,Weatherford,108.95,240.4,174.63,222.26,637.3,Single-ply,SBD,M
Boys,109.77,2,Cayden Markus,Weatherford,107.41,217.72,149.69,215.46,582.87,Single-ply,SBD,M
Boys,109.77,3,Dylan Choates,Weatherford,104.87,204.12,122.47,183.7,510.29,Single-ply,SBD,M
Boys,109.77,4,Jake O'Hara,Weatherford,109.04,192.78,131.54,170.1,494.42,Single-ply,SBD,M
Boys,109.77,DQ,Quinton Pearson,Weatherford,109.68,,,,,Single-ply,SBD,M
Boys,124.74,1,Julian Casias,Decatur,121.43,297.1,176.9,249.48,723.48,Single-ply,SBD,M
Boys,124.74,2,Aaron Sanchez,Bridgeport,110.81,242.67,124.74,190.51,557.92,Single-ply,SBD,M
Boys,124.74,3,Ayden Mast,Decatur,112.99,226.8,122.47,201.85,551.11,Single-ply,SBD,M
Boys,124.74+,1,Keaton Jordan,Decatur,129.68,272.16,154.22,183.7,610.08,Single-ply,SBD,M
Boys,124.74+,2,Anderson Ramirez,Decatur,142.56,240.4,149.69,213.19,603.28,Single-ply,SBD,M
Boys,124.74+,3,Zander Adams,Mineral Wells,136.94,249.48,120.2,226.8,596.47,Single-ply,SBD,M
Boys,124.74+,4,Chris Thompson,Bridgeport,138.16,233.6,115.67,188.24,537.51,Single-ply,SBD,M
