Place,Name,Division,BodyweightKg,WeightClassKg,BirthDate,BirthYear,Sex,Squat1Kg,Squat2Kg,Squat3Kg,Best3SquatKg,Bench1Kg,Bench2Kg,Bench3Kg,Best3BenchKg,Deadlift1Kg,Deadlift2Kg,Deadlift3Kg,Best3DeadliftKg,TotalKg,Equipment,Event,Country
2,Selin Üsküplü,Juniors,54.16,57,,,F,40,45,-50,45,-25,25,-27.5,25,70,75,80,80,150,Raw,SBD,Belgium
1,Bo Haek,Juniors,69.3,72,,,F,80,-90,-90,80,50,52.5,-55,52.5,90,100,105,105,237.5,Raw,SBD,Belgium
1,Annelies Van De Velde,Juniors,55.98,57,,,F,85,90,91,91,55,57.5,61,61,105,110,115,115,267,Raw,SBD,Belgium
1,Jella Troch,Open,52,52,,,F,95.5,97.5,100.5,100.5,65,67.5,70.5,70.5,110,115,120,120,291,Raw,SBD,Belgium
1,Christophe Ruvolo,Open,57.4,59,,,M,100,110,117.5,117.5,80,85,87.5,87.5,110,115,120,120,325,Raw,SBD,Belgium
1,Kathleen Compagnie,Masters 1,65.3,72,,,F,95,97.5,100,100,67.5,-70,70,70,112.5,120,125,125,295,Raw,SBD,Belgium
2,Lien Van Buggenhout,Open,76.95,84,,,F,107.5,112.5,-117.5,112.5,62.5,67.5,70,70,122.5,135,-145,135,317.5,Raw,SBD,Belgium
1,Keanu Robberechts,Juniors,129.4,120+,,,M,-130,130,135,135,80,-82.5,-82.5,80,150,160,165,165,380,Raw,SBD,Belgium
1,Hans Van der Staak,Juniors,58.25,59,1999-10-22,1999,M,120,-130,130,130,87.5,92.5,-97.5,92.5,157.5,162.5,170,170,392.5,Raw,SBD,Belgium
1,Sonita Muluh,Open,83.15,84,,,F,135,145,150,150,67.5,70,72.5,72.5,165,175,180,180,402.5,Raw,SBD,Cameroon
2,Stefanie Verhulst,Open,51.1,52,1990-12-13,1990,F,95,100,,100,52.5,55,,55,120,125,,125,280,Raw,SBD,Belgium
1,Nick Blockmans,Sub-Juniors,56.2,59,,,M,120,127.5,-131,127.5,92.5,-97.5,97.5,97.5,147.5,155,160.5,160.5,385.5,Raw,SBD,Belgium
3,Alexander Janssen,Open,65.25,66,,,M,-125,-125,125,125,95,-100,-102.5,95,162.5,170,175,175,395,Raw,SBD,Belgium
2,Bertrand Rongé,Open,65.75,66,,,M,140,-150,-150,140,95,100,-102.5,100,170,-175,175,175,415,Raw,SBD,Belgium
3,Jasper Obbers,Open,70.75,74,,,M,135,145,-152.5,145,90,97.5,-100,97.5,175,185,-190,185,427.5,Raw,SBD,Belgium
2,Noa Depaepe,Juniors,90.5,93,,,M,130,135,142.5,142.5,100,-110,-110,100,180,190,200,200,442.5,Raw,SBD,Belgium
1,Pieter Van Overbeke,Juniors,91.2,93,,,M,145,155,165,165,105,112.5,-120,112.5,180,195,200,200,477.5,Raw,SBD,Belgium
2,Alexander Bossaerts,Juniors,73.55,74,,,M,150,155,160,160,90,95,100,100,190,197.5,-200,197.5,457.5,Raw,SBD,Belgium
3,Robert Ivanoushkin,Juniors,82,83,,,M,165,180,185,185,100,115,-120,115,185,195,205,205,505,Raw,SBD,Belgium
4,Gilles De Peuter,Juniors,80.5,83,,,M,167.5,175,182.5,182.5,92.5,97.5,-102.5,97.5,192.5,205,-225,205,485,Raw,SBD,Belgium
1,Hugo de Grauwe,Masters 3,104.4,105,,,M,-170,170,,170,125,135,,135,200,222.5,232.5,232.5,537.5,Raw,SBD,Belgium
1,Rik De Grauwe,Juniors,77.45,83,,,M,170,180,,180,130,140,-145,140,200,225,-235,225,545,Raw,SBD,Belgium
3,Jeroen Leemans,Open,83,83,,,M,160,-172.5,-172.5,160,110,117.5,122.5,122.5,200,220,,220,502.5,Raw,SBD,Belgium
1,Audrey De Keersmaeker,Juniors,46.76,47,,,F,,,,,60,62.5,64,64,,,,,64,Raw,B,Belgium
1,Jean-Michel De Witte,Open,56.9,59,,,M,,,,,90,95,-100,95,,,,,95,Raw,B,Belgium
1,Kenny Verbouw,Juniors,57.65,59,,,M,,,,,100,105,110,110,,,,,110,Raw,B,Belgium
1,Philip Dewilde,Masters 3,104,105,,,M,,,,,-100,110,115,115,,,,,115,Raw,B,Belgium
1,Jean-Marc De Ro,Masters 1,90.7,93,,,M,,,,,110,115,120,120,,,,,120,Raw,B,Belgium
1,Chesney Goossens,Open,65.35,66,,,M,130,135,-140,135,140,150,-155,150,155,160,165,165,450,Raw,SBD,Belgium
5,Fidel Barrios,Open,82.35,83,,,M,150,157.5,-160,157.5,120,-125,,120,180,-190,-190,180,457.5,Raw,SBD,Belgium
7,Andrey Kossarev,Open,83.4,93,,,M,145,155,165,165,105,112.5,-120,112.5,175,185,195,195,472.5,Raw,SBD,Belgium
4,Dries Haselaars,Open,79.4,83,,,M,160,-170,175,175,125,132.5,-137.5,132.5,180,-197.5,-207.5,180,487.5,Raw,SBD,Belgium
6,Ward Bernaerts,Open,90,93,,,M,155,-162.5,167.5,167.5,97.5,105,107.5,107.5,197.5,205,210,210,485,Raw,SBD,Belgium
1,Tim Molkens,Open,73.5,74,,,M,165,170,-175,170,120,125,-130,125,195,207.5,215,215,510,Raw,SBD,Belgium
5,Bart Ceunen,Open,90.25,93,,,M,170,185,195,195,125,132.5,-137.5,132.5,200,210,220,220,547.5,Raw,SBD,Belgium
2,Jasper Pessemier,Open,81.15,83,,,M,165,175,-180,175,117.5,-125,-125,117.5,195,210,-222.5,210,502.5,Raw,SBD,Belgium
1,Wouter Luca,Juniors,73.8,74,,,M,100,,,100,120,125,130,130,210,225,235,235,465,Raw,SBD,Belgium
3,Dries Vrancken,Open,91.6,93,,,M,180,190,-195,190,125,130,-135,130,220,232.5,-240,232.5,552.5,Raw,SBD,Belgium
2,Joris De Saedeleer,Open,103.9,105,,,M,175,185,195,195,-140,145,-150,145,230,240,250,250,590,Raw,SBD,Belgium
2,Kristof Custers,Open,73.7,74,,,M,-170,180,,180,115,120,,120,170,180,,180,480,Raw,SBD,Belgium
2,Jef Haerinck,Juniors,83,83,,,M,-170,175,182.5,182.5,125,135,-140,135,210,225,,225,542.5,Raw,SBD,Belgium
3,Jeroen Van Dun,Open,105.4,120,,,M,200,215,230,230,-120,130,-135,130,250,270,,270,630,Raw,SBD,Belgium
1,Jimmy Van De Wiel,Masters 1,82.8,83,,,M,200,205,,205,150,155,,155,-200,210,215,215,575,Raw,SBD,Belgium
2,Jonas De Creus,Open,90.8,93,,,M,195,-212.5,-212.5,195,115,120,-125,120,222.5,230,240,240,555,Raw,SBD,Belgium
1,Sam Van Ingelgem,Open,90.75,93,,,M,200,205,210,210,150,-155,155,155,225,235,-240,235,600,Raw,SBD,Belgium
4,Kevin François,Open,116,120,,,M,-210,210,,210,-135,-135,135,135,225,235,-242.5,235,580,Raw,SBD,Belgium
2,Niko Van den Brande,Open,116.8,120,,,M,240,250,257.5,257.5,155,160,165,165,250,262.5,272.5,272.5,695,Raw,SBD,Belgium
1,Nour Kuru,Sub-Juniors,99.9,105,,,M,215,225,235,235,-115,115,-130,115,245.5,-262.5,-275,245.5,595.5,Raw,SBD,Belgium
1,Alan Peeters,Open,117,120,,,M,250,-270,-275,250,195,-205,,195,275,295,-315,295,740,Raw,SBD,Belgium
1,Sven Laenen,Open,103,105,,,M,245,,,245,-172.5,172.5,-182.5,172.5,-125,125,,125,542.5,Single-ply,SBD,Belgium
1,Bart Van Heesvelde,Open,101.6,105,,,M,200,210,220,220,-140,140,155,155,-220,220,,220,595,Raw,SBD,Belgium
5,Tim Depypere,Open,108.7,120,,,M,170,180,-187.5,180,115,-120,-120,115,205,,,205,500,Raw,SBD,Belgium
1,Aaron Messiant,Open,81.65,83,,,M,160,-170,170,170,110,115,117.5,117.5,227.5,,,227.5,515,Raw,SBD,Belgium
4,Simon Podevijn,Open,92.2,93,,,M,180,,,180,130,,,130,242.5,,,242.5,552.5,Raw,SBD,Belgium
1,Jimmy Van De Wiel,Masters 1,82.8,83,,,M,,,,,140,142.5,145,145,,,,,145,Raw,B,Belgium
1,Emmerik Vanhee,Open,87.3,93,,,M,,,,,145,157.5,165,165,,,,,165,Raw,B,Belgium
2,Lieven De Saedeleer,Open,101.8,105,,,M,,,,,150,160,170,170,,,,,170,Raw,B,Belgium
1,Per Gunnar Roalkvam,Masters 1,109.5,120,,,M,,,,,170,175,-177.5,175,,,,,175,Single-ply,B,Norway
1,Wouter De Saedeleer,Open,103.6,105,,,M,,,,,185,192.5,-200,192.5,,,,,192.5,Raw,B,Belgium
2,Simon Podevijn,Open,92.2,93,,,M,,,,,135,137.5,,137.5,,,,,137.5,Raw,B,Belgium
