Division,WeightClassKg,Place,Name,Team,BodyweightKg,Best3SquatKg,Best3BenchKg,Best3DeadliftKg,TotalKg,Equipment,Event,Sex
Girls,44.23,1,LeighAnn Sitzman,Decatur,43.27,108.86,56.7,108.86,274.42,Single-ply,SBD,F
Girls,44.23,2,Kirsten Boyd,Alvarado,41.28,104.33,47.63,104.33,256.28,Single-ply,SBD,F
Girls,44.23,3,Julie Rico,Kennedale,40.19,95.25,43.09,106.59,244.94,Single-ply,SBD,F
Girls,44.23,4,Jessica Duque,Hillsboro,41.82,88.45,40.82,95.25,224.53,Single-ply,SBD,F
Girls,44.23,5,Heather Hough,Aubrey,44.09,77.11,47.63,90.72,215.46,Single-ply,SBD,F
Girls,44.23,6,Elizabeth Brock,Kennedale,43.91,86.18,40.82,83.91,210.92,Single-ply,SBD,F
Girls,44.23,7,Clarissa Castaneda,Hillsboro,39.55,79.38,29.48,99.79,208.65,Single-ply,SBD,F
Girls,44.23,8,Riley Booker,Kennedale,42.37,81.65,47.63,77.11,206.38,Single-ply,SBD,F
Girls,44.23,9,Riane Maher,Aubrey,42.05,74.84,36.29,90.72,201.85,Single-ply,SBD,F
Girls,47.85,1,Olivia Hernandez,Alvarado,47.81,104.33,49.9,102.06,256.28,Single-ply,SBD,F
Girls,47.85,2,Alondra Ortiz,Saginaw,47.81,92.99,43.09,108.86,244.94,Single-ply,SBD,F
Girls,47.85,3,Laena Bodovsky,Hillsboro,46.45,88.45,43.09,86.18,217.72,Single-ply,SBD,F
Girls,47.85,4,Ruth Marcos,Hillsboro,47.63,90.72,38.56,88.45,217.72,Single-ply,SBD,F
Girls,47.85,5,Alyssa Hammonds,Castleberry,47.17,83.91,40.82,83.91,208.65,Single-ply,SBD,F
Girls,47.85,6,Sydney Blankenship,Aubrey,46.18,79.38,36.29,90.72,206.38,Single-ply,SBD,F
Girls,47.85,7,Julyssa Cantu,Decatur,46.27,86.18,34.02,74.84,195.04,Single-ply,SBD,F
Girls,47.85,8,Sofia Padilla,Saginaw,47.63,77.11,31.75,86.18,195.04,Single-ply,SBD,F
Girls,47.85,9,Mia Rodriguez,Saginaw,47.36,70.31,29.48,77.11,176.9,Single-ply,SBD,F
Girls,47.85,DQ,Jessi Maher,Aubrey,47.54,74.84,31.75,,,Single-ply,SBD,F
Girls,51.94,1,Nancy Martinez,Decatur,49.35,127.01,58.97,138.35,324.32,Single-ply,SBD,F
Girls,51.94,2,Macie Dickerson,Decatur,50.98,113.4,52.16,99.79,265.35,Single-ply,SBD,F
Girls,51.94,3,Alex Saenz,Kennedale,50.89,95.25,45.36,122.47,263.08,Single-ply,SBD,F
Girls,51.94,4,Judith Marcos,Hillsboro,51.07,113.4,54.43,95.25,263.08,Single-ply,SBD,F
Girls,51.94,5,Harlee Owen,Alvarado,49.53,102.06,47.63,108.86,258.55,Single-ply,SBD,F
Girls,51.94,6,Yaireliz Camacho,Saginaw,51.17,79.38,36.29,86.18,201.85,Single-ply,SBD,F
Girls,51.94,7,Haley Velasquez,Saginaw,51.8,83.91,31.75,81.65,197.31,Single-ply,SBD,F
Girls,56.02,1,Ruth Mitchell,Kennedale,54.88,129.27,74.84,131.54,335.66,Single-ply,SBD,F
Girls,56.02,2,Dana McAlister,Aubrey,55.07,106.59,52.16,117.93,276.69,Single-ply,SBD,F
Girls,56.02,3,Taziana Tubbs,Saginaw,52.16,104.33,40.82,129.27,274.42,Single-ply,SBD,F
Girls,56.02,4,Cameran Bilderback,Aubrey,54.25,99.79,61.23,99.79,260.82,Single-ply,SBD,F
Girls,56.02,5,Heather Gee,Alvarado,54.61,102.06,45.36,108.86,256.28,Single-ply,SBD,F
Girls,56.02,6,Lianae Pacheco,Kennedale,55.88,106.59,43.09,106.59,256.28,Single-ply,SBD,F
Girls,56.02,7,Dreonna Foster,Alvarado,55.34,95.25,45.36,108.86,249.48,Single-ply,SBD,F
Girls,56.02,8,Alexis Pule,Castleberry,54.16,92.99,43.09,106.59,242.67,Single-ply,SBD,F
Girls,56.02,9,Alexia Sellards,Decatur,54.16,92.99,40.82,92.99,226.8,Single-ply,SBD,F
Girls,56.02,10,Hagen Lail,Kennedale,54.43,68.04,40.82,72.57,181.44,Single-ply,SBD,F
Girls,56.02,11,Kylee Wilbert,Aubrey,55.16,56.7,36.29,74.84,167.83,Single-ply,SBD,F
Girls,60.1,1,Anjelica Sanchez,Alvarado,58.51,138.35,68.04,120.2,326.59,Single-ply,SBD,F
Girls,60.1,2,Isabel Mayorga,Hillsboro,57.33,131.54,65.77,106.59,303.91,Single-ply,SBD,F
Girls,60.1,3,Jaqueline Aguilar,Alvarado,59.78,117.93,52.16,117.93,288.03,Single-ply,SBD,F
Girls,60.1,4,Ashly Douangsavanh,Saginaw,59.78,108.86,47.63,111.13,267.62,Single-ply,SBD,F
Girls,60.1,5,Sydney Wright,Aubrey,56.25,86.18,58.97,104.33,249.48,Single-ply,SBD,F
Girls,60.1,6,Bree Rundle,Decatur,59.42,99.79,36.29,102.06,238.14,Single-ply,SBD,F
Girls,60.1,7,Mia Little,Castleberry,59.42,88.45,40.82,106.59,235.87,Single-ply,SBD,F
Girls,60.1,8,Avery Quarles,Decatur,57.79,86.18,43.09,97.52,226.8,Single-ply,SBD,F
Girls,60.1,9,Andi Thiesen,Aubrey,60.06,77.11,45.36,104.33,226.8,Single-ply,SBD,F
Girls,60.1,10,Hailey Bibb,Kennedale,56.88,81.65,34.02,95.25,210.92,Single-ply,SBD,F
Girls,60.1,DQ,Sulema Pacheco,Decatur,59.69,92.99,31.75,,,Single-ply,SBD,F
Girls,60.1,DQ,Fernanda Rios,Castleberry,57.97,74.84,36.29,,,Single-ply,SBD,F
Girls,60.1,DQ,Kennady Tooke,Lake Worth,59.87,79.38,40.82,,,Single-ply,SBD,F
Girls,60.1,DQ,Joana Rodriguez,Fort Worth Diamond Hill-Jarvis,60.1,97.52,52.16,,,Single-ply,SBD,F
Girls,67.36,1,Rita Spirrison,Kennedale,67.04,156.49,83.91,136.08,376.48,Single-ply,SBD,F
Girls,67.36,2,Caren Pena,Kennedale,67.22,149.69,74.84,138.35,362.87,Single-ply,SBD,F
Girls,67.36,3,Emalie Arnold,Alvarado,64.41,142.88,74.84,133.81,351.53,Single-ply,SBD,F
Girls,67.36,4,Paxtynn Booker,Kennedale,67.31,124.74,77.11,117.93,319.78,Single-ply,SBD,F
Girls,67.36,5,Kathryn Kittrell,Decatur,62.69,127.01,43.09,142.88,312.98,Single-ply,SBD,F
Girls,67.36,6,Taylor Guerra,Saginaw,66.86,120.2,47.63,133.81,301.64,Single-ply,SBD,F
Girls,67.36,7,Cailey Hawkins,Aubrey,65.5,120.2,52.16,127.01,299.37,Single-ply,SBD,F
Girls,67.36,8,Jaden Monterrubio,Hillsboro,66.95,113.4,61.23,106.59,281.23,Single-ply,SBD,F
Girls,67.36,9,Jessica Ramírez #1,Alvarado,66.04,113.4,58.97,106.59,278.96,Single-ply,SBD,F
Girls,67.36,10,Ellie Davis,Aubrey,63.23,108.86,63.5,104.33,276.69,Single-ply,SBD,F
Girls,67.36,11,Teona Brown,Cedar Hill,61.23,115.67,47.63,111.13,274.42,Single-ply,SBD,F
Girls,67.36,12,Erica Rodriguez,Hillsboro,64.41,113.4,54.43,95.25,263.08,Single-ply,SBD,F
Girls,67.36,13,Georgia Green,Aubrey,66.32,81.65,61.23,102.06,244.94,Single-ply,SBD,F
Girls,67.36,14,Hope Arnold,Decatur,64.23,81.65,34.02,92.99,208.65,Single-ply,SBD,F
Girls,67.36,15,Neecie Morgan,Alvarado,66.22,77.11,43.09,77.11,197.31,Single-ply,SBD,F
Girls,67.36,DQ,Kira Harrell,Lake Worth,67.13,124.74,58.97,,,Single-ply,SBD,F
Girls,75.07,1,Sheila Flores,Hillsboro,71.94,176.9,92.99,129.27,399.16,Single-ply,SBD,F
Girls,75.07,2,Monserrat Serrano,Hillsboro,74.75,149.69,68.04,122.47,340.19,Single-ply,SBD,F
Girls,75.07,3,Salma Ramirez,Hillsboro,69.58,138.35,68.04,127.01,333.39,Single-ply,SBD,F
Girls,75.07,4,Annette Castaneda,Hillsboro,71.4,145.15,72.57,108.86,326.59,Single-ply,SBD,F
Girls,75.07,5,Allyson Rea,Hillsboro,73.57,113.4,68.04,102.06,283.5,Single-ply,SBD,F
Girls,75.07,6,Mikeska Gill,Saginaw,71.85,95.25,49.9,129.27,274.42,Single-ply,SBD,F
Girls,75.07,7,Cheyenne Hilbun,Saginaw,70.58,111.13,45.36,111.13,267.62,Single-ply,SBD,F
Girls,75.07,8,Cheridan Jackson,Lake Worth,69.94,68.04,29.48,,97.52,Single-ply,SB,F
Girls,75.07,DQ,Priscilla Abrego,Castleberry,71.76,106.59,49.9,,,Single-ply,SBD,F
Girls,75.07,DQ,Lethal Wise,Mineral Wells,74.84,70.31,29.48,,,Single-ply,SBD,F
Girls,82.33,1,Alissa Ivanoski,Mineral Wells,79.74,122.47,58.97,127.01,308.44,Single-ply,SBD,F
Girls,82.33,2,RayAnn Schooling,Decatur,80.2,117.93,63.5,120.2,301.64,Single-ply,SBD,F
Girls,82.33,3,Shelby Wheeler,Mineral Wells,79.74,129.27,52.16,124.74,306.17,Single-ply,SBD,F
Girls,82.33,4,Vivian Castaneda,Fort Worth Diamond Hill-Jarvis,76.02,120.2,63.5,111.13,294.84,Single-ply,SBD,F
Girls,82.33,5,Sara Barboza,Castleberry,79.47,97.52,40.82,122.47,260.82,Single-ply,SBD,F
Girls,82.33,6,Savannah Torres,Aubrey,78.65,79.38,56.7,99.79,235.87,Single-ply,SBD,F
Girls,82.33,7,Lillian Izquierdo,Hillsboro,81.37,163.29,54.43,,217.72,Single-ply,SB,F
Girls,82.33,DQ,Cloe Bowens,Aubrey,81.69,86.18,74.84,,,Single-ply,SBD,F
Girls,82.33,DQ,Angeli Cruz,Saginaw,82.1,97.52,,,,Single-ply,SBD,F
Girls,82.33,DQ,Madisson Davilla,Mineral Wells,82.1,74.84,,,,Single-ply,SBD,F
Girls,90.04,1,Juliana Lopez,Decatur,85.09,145.15,65.77,145.15,356.07,Single-ply,SBD,F
Girls,90.04,2,Erynn George,Cedar Hill,83.91,127.01,74.84,138.35,340.19,Single-ply,SBD,F
Girls,90.04,3,Faith Canady,Cedar Hill,84.37,124.74,68.04,136.08,328.85,Single-ply,SBD,F
Girls,90.04,4,Kaitlynn Chriestenson,Mineral Wells,89.36,124.74,56.7,115.67,297.1,Single-ply,SBD,F
Girls,90.04,5,Mackenzie Spielman,Aubrey,89.9,113.4,61.23,113.4,288.03,Single-ply,SBD,F
Girls,90.04,6,Breanna Sternes,Cedar Hill,86.73,117.93,43.09,122.47,283.5,Single-ply,SBD,F
Girls,90.04,7,Sarah Gregory,Decatur,88.81,102.06,49.9,106.59,258.55,Single-ply,SBD,F
Girls,90.04,DQ,Natalia Sanchez,Lake Worth,86.45,122.47,52.16,,,Single-ply,SBD,F
Girls,100.02,1,Yadira Abreu,Castleberry,95.35,151.95,88.45,176.9,417.3,Single-ply,SBD,F
Girls,100.02,2,Karina Moreno,Castleberry,93.8,142.88,72.57,156.49,371.95,Single-ply,SBD,F
Girls,100.02,3,Desiree Garcia,Mineral Wells,97.34,151.95,65.77,149.69,367.41,Single-ply,SBD,F
Girls,100.02,4,Kaela Roberds,Decatur,92.08,133.81,77.11,117.93,328.85,Single-ply,SBD,F
Girls,100.02,5,Carolina Tejada,Mineral Wells,92.99,136.08,52.16,113.4,301.64,Single-ply,SBD,F
Girls,100.02,6,Abigail Cruz,Saginaw,92.9,111.13,45.36,131.54,288.03,Single-ply,SBD,F
Girls,100.02,DQ,Gina Tabuyo,Castleberry,99.79,97.52,43.09,,,Single-ply,SBD,F
Girls,100.02,DQ,Janiah Mathis,Lake Worth,99.79,90.72,45.36,,,Single-ply,SBD,F
Girls,100.02,DQ,Sophia Perez,Lake Worth,99.79,142.88,54.43,,,Single-ply,SBD,F
Girls,117.71,1,Dezne Taylor,Alvarado,103.42,149.69,86.18,161.03,396.89,Single-ply,SBD,F
Girls,117.71,2,Jamari Nathan-Woods,Cedar Hill,103.24,158.76,86.18,142.88,387.82,Single-ply,SBD,F
Girls,117.71,3,Zoe Snow,Mineral Wells,109.86,142.88,54.43,136.08,333.39,Single-ply,SBD,F
Girls,117.71+,1,Valerie Lee,Alvarado,134.72,192.78,90.72,158.76,442.25,Single-ply,SBD,F
Girls,117.71+,2,Andrea Butler,Mineral Wells,130.36,181.44,58.97,158.76,399.16,Single-ply,SBD,F
Girls,117.71+,DQ,Cayla Harris,Cedar Hill,117.93,154.22,65.77,,,Single-ply,SBD,F
