Division,WeightClassKg,Place,Name,Team,BodyweightKg,Best3SquatKg,Best3BenchKg,Best3DeadliftKg,TotalKg,Equipment,Event,Sex
Boys,55.79,1,Jonathan Cardenas,Freeport Brazosport,51.8,151.95,86.18,122.47,360.61,Single-ply,SBD,M
Boys,55.79,2,Santiago Centeno,Bay City,51.8,117.93,79.38,142.88,340.19,Single-ply,SBD,M
Boys,51.71,3,Raymond Garza,Clute Brazoswood,50.17,115.67,61.23,124.74,301.64,Single-ply,SBD,M
Boys,51.71,4,Jordan Trevino,Bay City,50.17,102.06,61.23,117.93,281.23,Single-ply,SBD,M
Boys,51.71,5,Steve Melgar,Hitchcock,42.09,106.59,47.63,122.47,276.69,Single-ply,SBD,M
Boys,51.71,6,Mason Williams,Clute Brazoswood,50.17,99.79,56.7,113.4,269.89,Single-ply,SBD,M
Boys,51.71,7,Devin West,Clute Brazoswood,51.07,104.33,54.43,104.33,263.08,Single-ply,SBD,M
Boys,51.71,8,Camrin Wleczyk,Van Vleck,38.37,63.5,36.29,74.84,174.63,Single-ply,SBD,M
Boys,51.71,DQ,Mark Salinas,Manvel,51.71,,,,,Single-ply,SBD,M
Boys,51.71,DQ,Cody Prestenback,Freeport Brazosport,51.71,,,,,Single-ply,SBD,M
Boys,55.79,1,Jacob Warchesik,Manvel,53.71,113.4,79.38,136.08,328.85,Single-ply,SBD,M
Boys,59.87,2,Bryce Ham,Danbury,55.88,74.84,38.56,102.06,215.46,Single-ply,SBD,M
Boys,55.79,DQ,Angel Medrano,Manvel,55.79,,,,,Single-ply,SBD,M
Boys,55.79,DQ,Anthony Scarborugh,Hitchcock,55.79,,,,,Single-ply,SBD,M
Boys,59.87,1,Alex Amador,Freeport Brazosport,59.51,170.1,92.99,183.7,446.79,Single-ply,SBD,M
Boys,67.13,2,Cameron Guillen,Clute Brazoswood,60.06,163.29,83.91,151.95,399.16,Single-ply,SBD,M
Boys,59.87,3,Brandon Robles,Van Vleck,59.78,136.08,74.84,140.61,351.53,Single-ply,SBD,M
Boys,59.87,4,Zach Palmer,Van Vleck,59.6,131.54,65.77,124.74,322.05,Single-ply,SBD,M
Boys,67.13,5,Douglas Washington,Clute Brazoswood,59.96,104.33,77.11,120.2,301.64,Single-ply,SBD,M
Boys,59.87,6,Luis Avila,Van Vleck,56.61,104.33,61.23,120.2,285.76,Single-ply,SBD,M
Boys,59.87,DQ,Jose Ramos,Bay City,59.87,,,,,Single-ply,SBD,M
Boys,67.13,DQ,Shawn Glover,Danbury,60.06,131.54,86.18,,,Single-ply,SBD,M
Boys,67.13,DQ,Dariun Hunter,Port Arthur Memorial,60.06,,,,,Single-ply,SBD,M
Boys,59.87,DQ,Adrian Martinez #6,Texas City,57.7,129.27,86.18,,,Single-ply,SBD,M
Boys,67.13,1,Osvaldo Sardina,Danbury,67.13,174.63,115.67,204.12,494.42,Single-ply,SBD,M
Boys,67.13,2,Caleb Ross,Clute Brazoswood,64.5,149.69,97.52,181.44,428.64,Single-ply,SBD,M
Boys,67.13,3,Jakob Rios,Clute Brazoswood,62.87,142.88,99.79,174.63,417.3,Single-ply,SBD,M
Boys,67.13,4,Tyvarian Lane,Stafford,62.69,147.42,102.06,149.69,399.16,Single-ply,SBD,M
Boys,67.13,5,Nathaniel Walker,Hitchcock,63.05,154.22,92.99,147.42,394.63,Single-ply,SBD,M
Boys,74.84,6,Steven Jones,Beaumont West Brook,67.31,136.08,92.99,158.76,387.82,Single-ply,SBD,M
Boys,74.84,7,Blane Marcantel,Santa Fe,67.31,151.95,74.84,151.95,378.75,Single-ply,SBD,M
Boys,67.13,8,Keith Chesson,Manvel,63.5,145.15,88.45,142.88,376.48,Single-ply,SBD,M
Boys,67.13,9,Dillan Wakefield,Van Vleck,66.41,129.27,86.18,145.15,360.61,Single-ply,SBD,M
Boys,67.13,DQ,Abraham Espino,Van Vleck,67.13,,,,,Single-ply,SBD,M
Boys,67.13,DQ,Kobe Blackmon,Van Vleck,65.32,142.88,90.72,,,Single-ply,SBD,M
Boys,67.13,DQ,Arnaldo Garcia,Port Arthur Memorial,67.13,,,,,Single-ply,SBD,M
Boys,67.13,DQ,Devantae Stafford,Freeport Brazosport,67.13,,,,,Single-ply,SBD,M
Boys,67.13,DQ,Robert Ricard,Hitchcock,66.68,142.88,99.79,,,Single-ply,SBD,M
Boys,67.13,DQ,Jeremiah Credit,Freeport Brazosport,67.13,,,,,Single-ply,SBD,M
Boys,74.84,1,Sam Fisher,Bay City,73.12,210.92,138.35,226.8,576.06,Single-ply,SBD,M
Boys,82.1,2,Tahj Edwards,Freeport Brazosport,75.02,192.78,111.13,201.85,505.76,Single-ply,SBD,M
Boys,74.84,3,Lawrence Smith,Bay City,73.03,226.8,90.72,179.17,496.68,Single-ply,SBD,M
Boys,74.84,4,Jared Hernandez,Texas City,72.39,174.63,117.93,183.7,476.27,Single-ply,SBD,M
Boys,74.84,5,Russhun Limbrick,Beaumont West Brook,72.03,183.7,108.86,181.44,474,Single-ply,SBD,M
Boys,74.84,6,Drew Lowery,Clute Brazoswood,74.39,170.1,104.33,197.31,471.74,Single-ply,SBD,M
Boys,74.84,7,Nefi Hernandez,Texas City,70.67,183.7,122.47,158.76,464.93,Single-ply,SBD,M
Boys,74.84,8,James Jones,Beaumont West Brook,70.4,172.37,97.52,172.37,442.25,Single-ply,SBD,M
Boys,74.84,9,Nick Martinez,Van Vleck,73.21,156.49,99.79,172.37,428.64,Single-ply,SBD,M
Boys,74.84,10,Ethan Ryman,Bay City,72.12,145.15,99.79,167.83,412.77,Single-ply,SBD,M
Boys,74.84,11,Randy Williams,Hitchcock,69.31,176.9,83.91,142.88,403.7,Single-ply,SBD,M
Boys,74.84,12,Jerry Keunte,Port Arthur Memorial,74.12,136.08,88.45,151.95,376.48,Single-ply,SBD,M
Boys,74.84,13,John Michael Wilson,Santa Fe,74.57,142.88,97.52,129.27,369.68,Single-ply,SBD,M
Boys,74.84,14,Yuki Namae,Manvel,71.21,131.54,81.65,131.54,344.73,Single-ply,SBD,M
Boys,74.84,15,Brandon McKay,Clute Brazoswood,68.95,113.4,61.23,133.81,308.44,Single-ply,SBD,M
Boys,74.84,DQ,Nate Moore,Beaumont West Brook,74.84,,,,,Single-ply,SBD,M
Boys,74.84,DQ,Kotlin Howard,Manvel,74.84,,,,,Single-ply,SBD,M
Boys,82.1,1,Ashanti Walker,Texas City,79.11,204.12,129.27,201.85,535.24,Single-ply,SBD,M
Boys,82.1,2,Exavier Simpson,Texas City,76.84,188.24,124.74,192.78,505.76,Single-ply,SBD,M
Boys,82.1,3,Leonard Owens,Manvel,77.93,192.78,113.4,195.04,501.22,Single-ply,SBD,M
Boys,82.1,4,Chris Almaguer,Beaumont West Brook,81.65,192.78,106.59,181.44,480.81,Single-ply,SBD,M
Boys,82.1,5,Jakobi Harris,Beaumont West Brook,79.29,174.63,90.72,188.24,453.59,Single-ply,SBD,M
Boys,82.1,6,Laurencio Madrigal,Freeport Brazosport,75.75,167.83,90.72,192.78,451.32,Single-ply,SBD,M
Boys,82.1,7,Jahcyi Thomas,Freeport Brazosport,79.2,124.74,113.4,183.7,421.84,Single-ply,SBD,M
Boys,82.1,8,Colton Miller,Santa Fe,75.84,147.42,95.25,156.49,399.16,Single-ply,SBD,M
Boys,82.1,9,Brandon Lewis,Clute Brazoswood,78.02,111.13,95.25,145.15,351.53,Single-ply,SBD,M
Boys,82.1,DQ,D'Marcus Miles,Van Vleck,82.1,,,,,Single-ply,SBD,M
Boys,82.1,DQ,Jorge Carli,Bay City,79.47,215.46,111.13,,,Single-ply,SBD,M
Boys,89.81,1,Oziel Rios,Palacios,84.1,235.87,174.63,263.08,673.58,Single-ply,SBD,M
Boys,89.81,2,Eric Hembling,Clute Brazoswood,88.63,197.31,120.2,238.14,555.65,Single-ply,SBD,M
Boys,89.81,3,Logan Holt,Hitchcock,87.18,226.8,122.47,204.12,553.38,Single-ply,SBD,M
Boys,89.81,4,Marvin Watson,Van Vleck,89.45,226.8,106.59,204.12,537.51,Single-ply,SBD,M
Boys,89.81,5,Charles Hester,Stafford,85.64,181.44,129.27,222.26,532.97,Single-ply,SBD,M
Boys,89.81,6,David Garza,Palacios,84.91,201.85,113.4,208.65,523.9,Single-ply,SBD,M
Boys,89.81,7,JaCorein Barnes,Port Arthur Memorial,87.54,204.12,113.4,188.24,505.76,Single-ply,SBD,M
Boys,89.81,8,Brent Smith,Hitchcock,88.99,197.31,104.33,181.44,483.08,Single-ply,SBD,M
Boys,89.81,9,Chris Ponder,Texas City,86.55,172.37,122.47,183.7,478.54,Single-ply,SBD,M
Boys,89.81,10,Blair Aiden,Santa Fe,89.63,183.7,108.86,183.7,476.27,Single-ply,SBD,M
Boys,89.81,11,Marcelo Acosta,Clute Brazoswood,86.09,158.76,106.59,174.63,439.98,Single-ply,SBD,M
Boys,89.81,12,Jorge Ochoa,Beaumont West Brook,85.64,165.56,97.52,161.03,424.11,Single-ply,SBD,M
Boys,89.81,13,Tyler Ray,Santa Fe,88.54,170.1,83.91,163.29,417.3,Single-ply,SBD,M
Boys,89.81,14,Christian Valdez,Danbury,88.36,136.08,70.31,133.81,340.19,Single-ply,SBD,M
Boys,89.81,15,Zeke Carrizales,Clute Brazoswood,89.81,131.54,54.43,145.15,331.12,Single-ply,SBD,M
Boys,89.81,DQ,Lorenzo Henderson,Port Arthur Memorial,89.81,,,,,Single-ply,SBD,M
Boys,89.81,DQ,Mykel Thomas,Port Arthur Memorial,89.81,,,,,Single-ply,SBD,M
Boys,89.81,DQ,Kadrien Pickney,Port Arthur Memorial,86.09,124.74,,,,Single-ply,SBD,M
Boys,89.81,DQ,Nathan Lewis,Freeport Brazosport,85.73,,,,,Single-ply,SBD,M
Boys,99.79,1,Chase Yates,Santa Fe,99.16,226.8,138.35,235.87,601.01,Single-ply,SBD,M
Boys,99.79,2,Daniel Martinez,Freeport Brazosport,98.16,204.12,122.47,206.38,532.97,Single-ply,SBD,M
Boys,99.79,3,Mark Contreras,Freeport Brazosport,94.08,192.78,136.08,201.85,530.7,Single-ply,SBD,M
Boys,99.79,4,Adrian Ruiz,Bay City,91.17,183.7,165.56,179.17,528.44,Single-ply,SBD,M
Boys,99.79,5,Hunter Thiem,Hitchcock,95.98,199.58,111.13,192.78,503.49,Single-ply,SBD,M
Boys,99.79,6,Seth Anguiano,Manvel,96.25,176.9,117.93,197.31,492.15,Single-ply,SBD,M
Boys,99.79,7,Bo Castillo,Santa Fe,97.52,188.24,115.67,181.44,485.34,Single-ply,SBD,M
Boys,99.79,8,Elfonso Vargas,Clute Brazoswood,94.08,156.49,97.52,165.56,419.57,Single-ply,SBD,M
Boys,99.79,9,Tyler Danford,Clute Brazoswood,97.98,167.83,74.84,174.63,417.3,Single-ply,SBD,M
Boys,99.79,10,Levi Winson,Santa Fe,96.07,170.1,83.91,158.76,412.77,Single-ply,SBD,M
Boys,99.79,DQ,Elijah Ellis,Bay City,99.79,,,,,Single-ply,SBD,M
Boys,99.79,DQ,Irving Perez,Manvel,91.26,156.49,,,,Single-ply,SBD,M
Boys,99.79,DQ,Jacob Salazar,Stafford,93.98,111.13,,,,Single-ply,SBD,M
Boys,109.77,1,Lorenzo Baeza,Texas City,106.59,256.28,163.29,233.6,653.17,Single-ply,SBD,M
Boys,109.77,2,Elton Woodard,Stafford,102.51,213.19,136.08,213.19,562.45,Single-ply,SBD,M
Boys,109.77,3,Xavian Hampton,Hitchcock,105.51,231.33,102.06,219.99,553.38,Single-ply,SBD,M
Boys,124.74,4,Paul Guevara,Clute Brazoswood,109.95,199.58,136.08,197.31,532.97,Single-ply,SBD,M
Boys,109.77,5,Prince Flye,Bay City,106.5,217.72,124.74,183.7,526.17,Single-ply,SBD,M
Boys,109.77,6,Kanien Collins,Port Arthur Memorial,109.23,204.12,113.4,199.58,517.1,Single-ply,SBD,M
Boys,109.77,7,Luke MacLennan,Bay City,108.05,192.78,111.13,181.44,485.34,Single-ply,SBD,M
Boys,109.77,8,Charlie Tabares,Van Vleck,101.97,145.15,115.67,192.78,453.59,Single-ply,SBD,M
Boys,109.77,9,Eric Salazar,Van Vleck,106.97,176.9,120.2,154.22,451.32,Single-ply,SBD,M
Boys,109.77,10,Trent Frost,Van Vleck,104.33,142.88,106.59,188.24,437.72,Single-ply,SBD,M
Boys,109.77,DQ,Casey Williams #2,Port Arthur Memorial,109.77,,,,,Single-ply,SBD,M
Boys,124.74,1,Jimmy LaFata,Clute Brazoswood,116.75,256.28,165.56,217.72,639.57,Single-ply,SBD,M
Boys,124.74,2,Victor Guevara,Freeport Brazosport,114.12,242.67,142.88,231.33,616.89,Single-ply,SBD,M
Boys,124.74,3,Carlos Alvarez,Hitchcock,111.04,256.28,158.76,199.58,614.62,Single-ply,SBD,M
Boys,124.74,4,Paul Hill,Van Vleck,116.21,226.8,158.76,217.72,603.28,Single-ply,SBD,M
Boys,124.74,5,Kyler Gentry,Santa Fe,120.38,219.99,142.88,226.8,589.67,Single-ply,SBD,M
Boys,124.74,6,Luis Barron,Danbury,123.38,229.06,138.35,208.65,576.06,Single-ply,SBD,M
Boys,124.74,7,Dante Hayes,Texas City,111.49,210.92,129.27,226.8,566.99,Single-ply,SBD,M
Boys,124.74,8,Victor Esquivel,Clute Brazoswood,110.77,165.56,127.01,188.24,480.81,Single-ply,SBD,M
Boys,124.74,9,Christian Brown,Danbury,119.29,174.63,102.06,183.7,460.4,Single-ply,SBD,M
Boys,124.74,10,Shamus Conley,Manvel,123.74,181.44,115.67,163.29,460.4,Single-ply,SBD,M
Boys,124.74,11,Parker Fraiser,Danbury,121.02,138.35,86.18,158.76,383.29,Single-ply,SBD,M
Boys,124.74,DQ,Jimmy Powell,Santa Fe,124.74,,,,,Single-ply,SBD,M
Boys,124.74,DQ,Antonio Williams,Freeport Brazosport,115.76,190.51,,,,Single-ply,SBD,M
Boys,124.74+,1,Brandon Artis,Port Arthur Memorial,130.36,217.72,122.47,233.6,573.79,Single-ply,SBD,M
Boys,124.74+,2,Kaleb Allen,Port Arthur Memorial,138.35,208.65,113.4,229.06,551.11,Single-ply,SBD,M
Boys,124.74+,3,Moses Horn,Stafford,127.19,192.78,122.47,176.9,492.15,Single-ply,SBD,M
Boys,124.74+,4,Jamaud Lane,Beaumont West Brook,125.28,179.17,120.2,188.24,487.61,Single-ply,SBD,M
Boys,124.74+,5,Johnathan Woods,Van Vleck,144.79,210.92,104.33,165.56,480.81,Single-ply,SBD,M
Boys,124.74+,DQ,Joel Wamget,Van Vleck,140.43,256.28,129.27,,,Single-ply,SBD,M
Boys,124.74+,DQ,Chris Sampson,Texas City,133.81,,,,,Single-ply,SBD,M
Boys,124.74+,DQ,Austin Closs,Freeport Brazosport,136.08,,,,,Single-ply,SBD,M
Boys,124.74+,DQ,Victor Sanchez,Hitchcock,130.91,206.38,120.2,,,Single-ply,SBD,M
