Division,WeightClassKg,Place,Name,Team,BodyweightKg,Best3SquatKg,Best3BenchKg,Best3DeadliftKg,TotalKg,Equipment,Event,Sex,BirthDate
Boys,51.71,1,Alex Garcia,Cotulla,51.53,158.76,92.99,154.22,405.97,Single-ply,SBD,M,
Boys,51.71,2,Angelo Legaspe,San Antonio Cole,51.71,136.08,83.91,142.88,362.87,Single-ply,SBD,M,
Boys,51.71,3,Ricky Martinez,Pearsall,51.35,127.01,77.11,129.27,333.39,Single-ply,SBD,M,
Boys,51.71,4,Christopher Reyes,San Antonio Brooks Academy,50.8,113.4,63.5,142.88,319.78,Single-ply,SBD,M,
Boys,51.71,5,Tony Garza,Carrizo Springs,44.54,120.2,58.97,117.93,297.1,Single-ply,SBD,M,
Boys,51.71,6,Chris Cancino,San Antonio Cole,49.08,97.52,65.77,108.86,272.16,Single-ply,SBD,M,
Boys,51.71,7,Robert Longoria,Pearsall,51.17,86.18,54.43,124.74,265.35,Single-ply,SBD,M,
Boys,55.79,1,Devin Garza,Pearsall,55.52,147.42,72.57,140.61,360.61,Single-ply,SBD,M,
Boys,55.79,2,Ryan Jimenez,Crystal City,55.34,138.35,81.65,136.08,356.07,Single-ply,SBD,M,
Boys,55.79,3,Devon Mora,San Antonio East Central,55.52,149.69,65.77,140.61,356.07,Single-ply,SBD,M,
Boys,55.79,4,Damian Guerra,Dilley,55.79,136.08,70.31,115.67,322.05,Single-ply,SBD,M,
Boys,55.79,5,Kyle Briseno,Carrizo Springs,54.43,117.93,65.77,122.47,306.17,Single-ply,SBD,M,
Boys,55.79,6,Elias Garcia,Somerset,52.07,104.33,63.5,99.79,267.62,Single-ply,SBD,M,
Boys,59.87,1,Diego Morales,Castroville Medina Valley,59.15,240.4,117.93,215.46,573.79,Single-ply,SBD,M,
Boys,59.87,2,Lupe Ibarra,Floresville,59.15,183.7,113.4,192.78,489.88,Single-ply,SBD,M,
Boys,59.87,3,Ernesto Consuegra,Cotulla,59.87,158.76,88.45,172.37,419.57,Single-ply,SBD,M,
Boys,59.87,4,Jacob Garcia,Cotulla,59.87,151.95,97.52,165.56,415.04,Single-ply,SBD,M,
Boys,59.87,5,Samuel Flores,Del Rio,58.06,124.74,90.72,140.61,356.07,Single-ply,SBD,M,
Boys,59.87,6,Matthew Flores,San Antonio Brooks Academy,58.69,136.08,65.77,147.42,349.27,Single-ply,SBD,M,
Boys,59.87,7,Aydin Hiebert,Knippa,57.42,92.99,52.16,111.13,256.28,Single-ply,SBD,M,
Boys,67.13,1,Julian Rico,Somerset,64.86,256.28,170.1,210.92,637.3,Single-ply,SBD,M,
Boys,67.13,2,Vincent Villanueva,Floresville,67.04,213.19,111.13,208.65,532.97,Single-ply,SBD,M,
Boys,67.13,3,Michael Aguilar,San Antonio East Central,65.77,217.72,108.86,204.12,530.7,Single-ply,SBD,M,
Boys,67.13,4,Angel Rodríguez,Crystal City,66.22,197.31,115.67,190.51,503.49,Single-ply,SBD,M,
Boys,67.13,5,Hector Frausto,Del Rio,63.68,158.76,95.25,199.58,453.59,Single-ply,SBD,M,
Boys,67.13,6,Eric Hernandez,Pearsall,65.59,165.56,99.79,188.24,453.59,Single-ply,SBD,M,
Boys,67.13,7,Gavin LaFleur,Floresville,62.41,179.17,99.79,167.83,446.79,Single-ply,SBD,M,
Boys,67.13,8,Virgil Luna,Crystal City,65.05,167.83,97.52,181.44,446.79,Single-ply,SBD,M,
Boys,67.13,9,Emmanuel Sanchez,Del Rio,64.68,165.56,102.06,165.56,433.18,Single-ply,SBD,M,
Boys,67.13,10,Sergio Sonora,Carrizo Springs,67.13,170.1,92.99,170.1,433.18,Single-ply,SBD,M,
Boys,67.13,11,Emanuel Rios,Castroville Medina Valley,66.77,163.29,106.59,158.76,428.64,Single-ply,SBD,M,
Boys,67.13,12,Joshua Legaspe,San Antonio Cole,66.68,158.76,90.72,176.9,426.38,Single-ply,SBD,M,
Boys,67.13,13,Rene Carrasco,Del Rio,65.86,154.22,95.25,158.76,408.23,Single-ply,SBD,M,
Boys,67.13,14,Alejandro Garcia,Del Rio,64.5,151.95,95.25,158.76,405.97,Single-ply,SBD,M,
Boys,67.13,15,Alex De La Rosa,Dilley,66.5,140.61,97.52,161.03,399.16,Single-ply,SBD,M,
Boys,67.13,16,Tommy Bannon,San Antonio Cole,62.87,147.42,72.57,165.56,385.55,Single-ply,SBD,M,
Boys,67.13,17,Jerry Martinez,Uvalde,62.6,145.15,81.65,154.22,381.02,Single-ply,SBD,M,
Boys,67.13,18,Diego Torres,Dilley,67.13,156.49,79.38,142.88,378.75,Single-ply,SBD,M,
Boys,67.13,19,Duece Cano,Dilley,66.41,136.08,97.52,136.08,369.68,Single-ply,SBD,M,
Boys,67.13,20,Abraham Guillen,Del Rio,63.68,127.01,79.38,151.95,358.34,Single-ply,SBD,M,
Boys,74.84,1,Daniel Almedia,Uvalde,71.21,208.65,115.67,265.35,589.67,Single-ply,SBD,M,
Boys,74.84,2,Zachary Lambert,Uvalde,74.84,213.19,115.67,222.26,551.11,Single-ply,SBD,M,
Boys,74.84,3,Abraham Davila,Uvalde,71.67,215.46,120.2,199.58,535.24,Single-ply,SBD,M,
Boys,74.84,4,Carlos Gonzales,Dilley,74.39,217.72,102.06,199.58,519.36,Single-ply,SBD,M,
Boys,74.84,5,Ashad Knight,San Antonio East Central,73.84,188.24,111.13,208.65,508.02,Single-ply,SBD,M,
Boys,74.84,6,Shane Medrano,Uvalde,72.12,188.24,106.59,204.12,498.95,Single-ply,SBD,M,
Boys,74.84,7,Christian Luensmann,San Antonio East Central,73.57,192.78,104.33,185.97,483.08,Single-ply,SBD,M,
Boys,74.84,8,Zack Nelson,Floresville,70.13,172.37,122.47,176.9,471.74,Single-ply,SBD,M,
Boys,74.84,9,Adrian Hernandez,Pearsall,71.67,183.7,102.06,181.44,467.2,Single-ply,SBD,M,
Boys,74.84,10,Jacob Trevino,Del Rio,69.58,163.29,102.06,188.24,453.59,Single-ply,SBD,M,
Boys,74.84,11,Daniel Mohs,San Antonio East Central,74.66,174.63,92.99,185.97,453.59,Single-ply,SBD,M,
Boys,74.84,12,Rene Martinez,Del Rio,68.22,161.03,90.72,170.1,421.84,Single-ply,SBD,M,
Boys,74.84,13,Elijah Solis,Uvalde,74.84,167.83,104.33,147.42,419.57,Single-ply,SBD,M,
Boys,74.84,14,Joey Medina,San Antonio Cole,74.66,147.42,74.84,154.22,376.48,Single-ply,SBD,M,
Boys,74.84,15,Andrew Guillen,Del Rio,69.58,124.74,68.04,147.42,340.19,Single-ply,SBD,M,
Boys,74.84,16,Larry Allen,Knippa,74.03,113.4,92.99,83.91,290.3,Single-ply,SBD,M,
Boys,74.84,DQ,Steven Perales,Carrizo Springs,74.84,181.44,,,,Single-ply,SBD,M,
Boys,74.84,DQ,Gabriel Martinez,Pearsall,73.12,208.65,117.93,,,Single-ply,SBD,M,
Boys,82.1,1,Ray Leal,Pearsall,80.83,215.46,111.13,233.6,560.19,Single-ply,SBD,M,
Boys,82.1,2,Jesse Sanchez,Cotulla,79.29,217.72,127.01,204.12,548.85,Single-ply,SBD,M,
Boys,82.1,3,Marco Burkman,San Antonio Cole,80.38,224.53,129.27,192.78,546.58,Single-ply,SBD,M,
Boys,82.1,4,Nathan Delgado,Crystal City,80.74,219.99,131.54,195.04,546.58,Single-ply,SBD,M,
Boys,82.1,5,Leroy Lima,Floresville,78.93,208.65,117.93,217.72,544.31,Single-ply,SBD,M,
Boys,82.1,6,Tyler Felux,San Antonio Brooks Academy,79.74,208.65,124.74,204.12,537.51,Single-ply,SBD,M,
Boys,82.1,7,Darren Thomas,Cotulla,80.74,201.85,122.47,204.12,528.44,Single-ply,SBD,M,
Boys,82.1,8,Hector Gomez,Del Rio,81.28,206.38,129.27,192.78,528.44,Single-ply,SBD,M,
Boys,82.1,9,Jacob Davis,Castroville Medina Valley,80.83,204.12,102.06,183.7,489.88,Single-ply,SBD,M,
Boys,82.1,10,Robert Olivarez,Uvalde,81.19,161.03,115.67,181.44,458.13,Single-ply,SBD,M,
Boys,82.1,11,Jarret Gest,Carrizo Springs,78.65,172.37,108.86,172.37,453.59,Single-ply,SBD,M,
Boys,82.1,12,Raul Maldonado,Crystal City,81.83,172.37,104.33,154.22,430.91,Single-ply,SBD,M,
Boys,82.1,13,Robert Vasquez,Del Rio,80.74,133.81,102.06,172.37,408.23,Single-ply,SBD,M,
Boys,82.1,14,Gilbert Martinez,Crystal City,81.01,142.88,52.16,149.69,344.73,Single-ply,SBD,M,
Boys,82.1,DQ,Chevy Collins,Knippa,79.02,79.38,68.04,,,Single-ply,SBD,M,
Boys,82.1,DQ,Ulrich Kalthoft,Pearsall,78.74,,,185.97,,Single-ply,SBD,M,
Boys,89.81,1,Alejandro Flores,Del Rio,89.63,240.4,149.69,263.08,653.17,Single-ply,SBD,M,
Boys,89.81,2,Aaron Ramirez,Dilley,89.81,247.21,142.88,233.6,623.69,Single-ply,SBD,M,
Boys,89.81,3,Isaac Garcia,Crystal City,88.9,238.14,131.54,238.14,607.81,Single-ply,SBD,M,
Boys,89.81,4,Austin Montanez,San Antonio Cole,89.18,226.8,102.06,217.72,546.58,Single-ply,SBD,M,
Boys,89.81,5,Jason Coronado,Floresville,89.54,210.92,106.59,226.8,544.31,Single-ply,SBD,M,
Boys,89.81,6,David Castro,Carrizo Springs,84.46,210.92,108.86,201.85,521.63,Single-ply,SBD,M,
Boys,89.81,7,Zach Lawyer,Castroville Medina Valley,88.54,204.12,102.06,206.38,512.56,Single-ply,SBD,M,
Boys,89.81,8,Vicente Correa,Dilley,87.09,204.12,92.99,213.19,510.29,Single-ply,SBD,M,
Boys,89.81,9,Alomar Ybarra,Somerset,88.99,181.44,106.59,183.7,471.74,Single-ply,SBD,M,
Boys,89.81,10,Aaron Roldan,Hondo,89.72,174.63,120.2,158.76,453.59,Single-ply,SBD,M,
Boys,89.81,11,Josh Munoz,Castroville Medina Valley,88,188.24,79.38,179.17,446.79,Single-ply,SBD,M,
Boys,89.81,12,Gabriel Guajardo,Hondo,89.81,165.56,95.25,181.44,442.25,Single-ply,SBD,M,
Boys,89.81,13,Leo Strozzie,Somerset,87.91,142.88,72.57,174.63,390.09,Single-ply,SBD,M,
Boys,89.81,14,Lance Nielson,San Antonio Brooks Academy,86.82,136.08,68.04,158.76,362.87,Single-ply,SBD,M,
Boys,89.81,15,Felix Escobedo,Del Rio,85.28,124.74,88.45,136.08,349.27,Single-ply,SBD,M,
Boys,89.81,16,Lars Nielson,San Antonio Brooks Academy,84.91,124.74,61.23,147.42,333.39,Single-ply,SBD,M,
Boys,89.81,DQ,Ace Mata,Crystal City,83.64,,,,,Single-ply,SBD,M,
Boys,89.81,DQ,Josiah Marquez,Pearsall,86.27,247.21,149.69,,,Single-ply,SBD,M,
Boys,99.79,1,Michael Gonzalez,Somerset,92.8,315.25,195.04,238.14,748.43,Single-ply,SBD,M,
Boys,99.79,2,Isaiah Valdez,Somerset,97.98,308.44,192.78,224.53,725.75,Single-ply,SBD,M,
Boys,99.79,3,Tristan Medrano,Del Rio,99.06,231.33,165.56,231.33,628.23,Single-ply,SBD,M,
Boys,99.79,4,Armando Rodriquez,Carrizo Springs,97.43,249.48,115.67,229.06,594.21,Single-ply,SBD,M,
Boys,99.79,5,Eli Gonzalez,Cotulla,95.89,231.33,156.49,192.78,580.6,Single-ply,SBD,M,
Boys,99.79,6,Dakota Castillo,Somerset,94.71,224.53,138.35,183.7,546.58,Single-ply,SBD,M,
Boys,99.79,7,Nathaniel Ramos,Somerset,94.71,204.12,149.69,176.9,530.7,Single-ply,SBD,M,
Boys,99.79,8,Oscar Briseno,Carrizo Springs,91.9,222.26,113.4,154.22,489.88,Single-ply,SBD,M,
Boys,99.79,9,Adam Andres,Uvalde,99.79,167.83,106.59,195.04,469.47,Single-ply,SBD,M,
Boys,99.79,10,Oscar Ramirez,Carrizo Springs,95.07,197.31,102.06,158.76,458.13,Single-ply,SBD,M,
Boys,99.79,11,Adrain Carazzco,Dilley,99.25,170.1,111.13,158.76,439.98,Single-ply,SBD,M,
Boys,99.79,12,Luke Morales,Crystal City,99.7,136.08,77.11,151.95,365.14,Single-ply,SBD,M,
Boys,99.79,DQ,Adrian Carrasco,Dilley,98.88,170.1,98.88,,,Single-ply,SBD,M,
Boys,99.79,DQ,Isaac Andres,Knippa,98.07,102.06,61.23,,,Single-ply,SBD,M,
Boys,109.77,1,Abraham Rosas,Del Rio,107.5,260.82,136.08,258.55,655.44,Single-ply,SBD,M,
Boys,109.77,2,Joe Vega #5,Crystal City,109.59,260.82,174.63,197.31,632.76,Single-ply,SBD,M,
Boys,109.77,3,Gabriel Gutierrez,Pearsall,107.14,254.01,120.2,226.8,601.01,Single-ply,SBD,M,
Boys,109.77,4,Steven Terrazas,Somerset,99.88,219.99,147.42,195.04,562.45,Single-ply,SBD,M,
Boys,109.77,5,Issac Salazar,Del Rio,108.68,215.46,124.74,215.46,555.65,Single-ply,SBD,M,
Boys,109.77,6,Philip Valles,Carrizo Springs,104.78,208.65,120.2,208.65,537.51,Single-ply,SBD,M,
Boys,109.77,7,Francisco Castillo,Somerset,108.77,226.8,111.13,190.51,528.44,Single-ply,SBD,M,
Boys,109.77,8,Rodolfo Reyes,Uvalde,109.77,219.99,106.59,185.97,512.56,Single-ply,SBD,M,
Boys,109.77,9,Julio Obregon,Hondo,107.68,183.7,111.13,174.63,469.47,Single-ply,SBD,M,
Boys,109.77,10,Cyrus Vaugh,San Antonio Cole,103.51,190.51,83.91,192.78,467.2,Single-ply,SBD,M,
Boys,124.74,1,Trace Ferguson,Castroville Medina Valley,123.83,294.84,215.46,192.78,703.07,Single-ply,SBD,M,
Boys,124.74,2,Dustin Dominguez,Dilley,122.83,283.5,156.49,244.94,684.92,Single-ply,SBD,M,
Boys,124.74,3,Paul Zertuche,Castroville Medina Valley,119.39,235.87,165.56,217.72,619.15,Single-ply,SBD,M,
Boys,124.74,4,Kollin Meeks,Pearsall,112.22,272.16,140.61,204.12,616.89,Single-ply,SBD,M,
Boys,124.74,5,Gabriel Heimer,San Antonio Brooks Academy,122.92,249.48,165.56,199.58,614.62,Single-ply,SBD,M,
Boys,124.74,6,Abraham Hernandez,Castroville Medina Valley,124.65,235.87,131.54,231.33,598.74,Single-ply,SBD,M,
Boys,124.74,7,Gabriel Aguirre,Del Rio,120.66,226.8,102.06,244.94,573.79,Single-ply,SBD,M,
Boys,124.74,8,Josue Reyes,Del Rio,116.66,238.14,136.08,197.31,571.53,Single-ply,SBD,M,
Boys,124.74,9,Juan Flores,Somerset,117.75,244.94,124.74,201.85,571.53,Single-ply,SBD,M,
Boys,124.74,10,Anthony Huizar,Del Rio,124.38,219.99,136.08,204.12,560.19,Single-ply,SBD,M,
Boys,124.74,11,Moses Cortez,Castroville Medina Valley,124.65,188.24,127.01,181.44,496.68,Single-ply,SBD,M,
Boys,124.74,12,Brandon Laureano,San Antonio Brooks Academy,117.57,122.47,65.77,163.29,351.53,Single-ply,SBD,M,
Boys,124.74+,1,Daniel Garza,Carrizo Springs,132.45,285.76,163.29,219.99,669.05,Single-ply,SBD,M,
Boys,124.74+,2,Daniel Santallana,San Antonio East Central,142.7,254.01,136.08,254.01,644.1,Single-ply,SBD,M,
Boys,124.74+,3,Frankie Martinez,San Antonio East Central,128.91,249.48,142.88,240.4,632.76,Single-ply,SBD,M,
Boys,124.74+,4,Mark Flores,Somerset,128.19,260.82,147.42,188.24,596.47,Single-ply,SBD,M,
Boys,124.74+,5,Robert Castro,Crystal City,174,195.04,108.86,165.56,469.47,Single-ply,SBD,M,
Boys,,NS,Seth Bullard,Castroville Medina Valley,,,,,,Single-ply,SBD,M,
Boys,,NS,David Casias,San Antonio Brooks Academy,,,,,,Single-ply,SBD,M,
Boys,,NS,Ricardo Torres,Del Rio,,,,,,Single-ply,SBD,M,
Boys,,NS,Jorge Vicen,San Antonio Brooks Academy,,,,,,Single-ply,SBD,M,
Boys,,NS,Martin Quintanilla,San Antonio Brooks Academy,,,,,,Single-ply,SBD,M,
Boys,,NS,Jonathan Larralde,San Antonio Brooks Academy,,,,,,Single-ply,SBD,M,
Boys,,NS,Kory Hunter,San Antonio Cole,,,,,,Single-ply,SBD,M,
Boys,,NS,Nathan Rios,San Antonio Cole,,,,,,Single-ply,SBD,M,
Boys,,NS,Jose Gonzalez,Cotulla,,,,,,Single-ply,SBD,M,
Boys,,NS,Mike Flores,Cotulla,,,,,,Single-ply,SBD,M,
Boys,,NS,Joseph Salazar,Cotulla,,,,,,Single-ply,SBD,M,
Boys,,NS,Andrew Velasquez,Cotulla,,,,,,Single-ply,SBD,M,
Boys,,NS,Blaude Martinez,Cotulla,,,,,,Single-ply,SBD,M,
Boys,,NS,Cristian Martinez,Hondo,,,,,,Single-ply,SBD,M,
