Place,Sex,Name,Event,Division,WeightClassKg,Equipment,Team,BodyweightKg,Squat1Kg,Squat2Kg,Squat3Kg,Best3SquatKg,Bench1Kg,Bench2Kg,Bench3Kg,Best3BenchKg,Deadlift1Kg,Deadlift2Kg,Deadlift3Kg,Best3DeadliftKg,TotalKg,BirthYear
1,M,Michael Berrian,SBD,MR-T1,74,Raw,Virtus,72.5,102.5,117.5,127.5,127.5,80,85,87.5,87.5,120,140,152.5,152.5,367.5,2000
2,M,Drew Arensdorf,SBD,MR-T1,74,Raw,Virtus,72.5,67.5,77.5,85,85,42.5,50,-52.5,50,87.5,95,107.5,107.5,242.5,1999
1,M,Tyler Severns,SBD,MR-T1,93,Raw,,88.5,165,177.5,-180,177.5,105,115,125,125,192.5,210,-215,210,512.5,1998
2,M,Tom Connelly,SBD,MR-T1,93,Raw,,89.6,87.5,92.5,-102.5,92.5,-57.5,57.5,-62.5,57.5,97.5,112.5,117.5,117.5,267.5,1999
1,M,Kyle Bacon,SBD,MR-T1,120,Raw,,117,120,127.5,135,135,92.5,97.5,105,105,137.5,147.5,167.5,167.5,407.5,1990
1,M,Joseph Peña #1,SBD,MR-T1,120+,Raw,,150.3,295,-320,330,330,135,142.5,147.5,147.5,222.5,232.5,245,245,722.5,1998
DQ,M,Allen Zou,SBD,MR-T2,59,Raw,,58.8,127.5,-142.5,-142.5,127.5,-102.5,102.5,107.5,107.5,-175,-175,-175,,,1996
1,M,Marcus Naillon,SBD,MR-T2,66,Raw,,65.4,90,105,112.5,112.5,72.5,75,77.5,77.5,142.5,147.5,157.5,157.5,347.5,1997
1,M,Zack Barnwell,SBD,MR-T2,74,Raw,,71.9,-145,150,-165,150,115,117.5,-120,117.5,205,220.5,227.5,227.5,495,
1,M,Zach Hallford,SBD,MR-T2,83,Raw,SSPT,80.5,-207.5,207.5,-210,207.5,-120,120,-125,120,210,-220,-220,210,537.5,1996
2,M,Patrick Holden,SBD,MR-T2,83,Raw,,81.9,150,182.5,-195,182.5,-112.5,127.5,137.5,137.5,175,200,-220,200,520,1997
3,M,Malik Holland,SBD,MR-T2,83,Raw,,81.6,142.5,155,-170,155,102.5,-110,-110,102.5,245,260,-290,260,517.5,1997
4,M,Jesus Apodaca Cordova,SBD,MR-T2,83,Raw,RMLC,80.1,112.5,132.5,137.5,137.5,77.5,-85,-85,77.5,127.5,142.5,155,155,370,
1,M,Ashton Rouska,SBD,MR-T2,93,Raw,,83.9,227.5,242.5,252.5,252.5,152.5,157.5,-162.5,157.5,287.5,-300,-325,287.5,697.5,1997
2,M,Matt Koe,SBD,MR-T2,93,Raw,,86.8,182.5,222.5,-232.5,222.5,125,145,150,150,182.5,242.5,-255,242.5,615,1996
3,M,Adam Hamdan,SBD,MR-T2,93,Raw,,90.8,235,-242.5,242.5,242.5,140,147.5,-152.5,147.5,205,215,225,225,615,1997
4,M,Cooper Brooks,SBD,MR-T2,93,Raw,,91.5,195,-210,210,210,115,130,-140,130,205,220,232.5,232.5,572.5,1997
5,M,Conor Shea,SBD,MR-T2,93,Raw,,92.4,142.5,160,172.5,172.5,102.5,115,-117.5,115,187.5,200,-227.5,200,487.5,1997
1,M,Ty Hennen,SBD,MR-T2,105,Raw,,102.8,225,-235,235,235,115,122.5,130,130,242.5,-250,-260,242.5,607.5,1997
2,M,Tanner Dobrenz,SBD,MR-T2,105,Raw,,94.2,122.5,130,140,140,100,-102.5,102.5,102.5,145,150,162.5,162.5,405,1996
1,M,Ryan Spiecha,SBD,MR-T2,120,Raw,,118,227.5,245,257.5,257.5,142.5,-155,-155,142.5,227.5,-245,-245,227.5,627.5,1998
2,M,Jack Maly,SBD,MR-T2,120,Raw,Virtus,111.4,160,172.5,182.5,182.5,125,-137.5,137.5,137.5,185,210,-227.5,210,530,1996
1,M,Alex Werda,SBD,MR-T2,120+,Raw,,133.4,137.5,147.5,165,165,75,87.5,-95,87.5,170,185,202.5,202.5,455,
1,M,Dalton LaCoe,SBD,MR-T3,53,Raw,,52.8,120,137.5,145,145,95,105,-110,105,200,212.5,220,220,470,1995
1,M,Aaron Hall,SBD,MR-T3,59,Raw,,57.1,115,125,-132.5,125,77.5,82.5,-85,82.5,172.5,182.5,187.5,187.5,395,1996
2,M,Shawn Womack,SBD,MR-T3,59,Raw,,58.3,85,97.5,107.5,107.5,62.5,70,-75,70,125,-147.5,147.5,147.5,325,1994
1,M,David Nguyen,SBD,MR-T3,66,Raw,,62.2,165,-177.5,180,180,100,107.5,115,115,175,187.5,202.5,202.5,497.5,1988
2,M,Mason Ismert,SBD,MR-T3,66,Raw,Virtus,65.8,82.5,92.5,102.5,102.5,-60,67.5,-72.5,67.5,115,137.5,152.5,152.5,322.5,1995
DQ,M,Drake Wednig,SBD,MR-T3,66,Raw,,65.3,132.5,145,150,150,-82.5,82.5,-90,82.5,-180,-180,-180,,,1995
1,M,Cody Houser,SBD,MR-T3,74,Raw,,73.8,-210,217.5,227.5,227.5,145,150,155,155,212.5,227.5,-232.5,227.5,610,1995
2,M,Nathan Kimball,SBD,MR-T3,74,Raw,,72.2,195,210,215,215,125,130,135,135,215,230,-240,230,580,1996
3,M,Zachary Oldaker,SBD,MR-T3,74,Raw,SSPT,73.3,175,185,192.5,192.5,120,127.5,132.5,132.5,230,240,-250,240,565,1995
1,M,Coy Jorden,SBD,MR-T3,83,Raw,,81.1,190,205,217.5,217.5,135,145,-150,145,235,250,-260,250,612.5,1996
1,M,Nicholas Steffl,SBD,MR-T3,93,Raw,,91.7,192.5,205,215,215,125,130,137.5,137.5,225,255,267.5,267.5,620,1994
2,M,Cyler Anderson,SBD,MR-T3,93,Raw,,88.8,205,-217.5,220,220,115,125,-135,125,232.5,250,-260,250,595,1995
3,M,Austin Ramsey,SBD,MR-T3,93,Raw,,92.5,205,210,215,215,125,132.5,135,135,212.5,230,-247.5,230,580,1996
4,M,Benjamin Powers,SBD,MR-T3,93,Raw,,92.3,195,-200,-200,195,125,-132.5,-132.5,125,210,222.5,227.5,227.5,547.5,1996
5,M,Gage Bush,SBD,MR-T3,93,Raw,,86.1,180,-185,-185,180,142.5,-147.5,-147.5,142.5,222.5,-237.5,-240,222.5,545,1995
1,M,Peter Hubbard #2,SBD,MR-T3,105,Raw,,104.1,192.5,207.5,-217.5,207.5,130,137.5,-142.5,137.5,210,230,240,240,585,1994
2,M,Ben Nelson #3,SBD,MR-T3,105,Raw,,103.9,165,180,187.5,187.5,120,-127.5,-127.5,120,195,210,-227.5,210,517.5,1995
DQ,M,Jeffery Sylvester,SBD,MR-T3,120,Raw,Louisiana Legends,106,142.5,157.5,182.5,182.5,-97.5,-97.5,-97.5,,-215,,,,,1996
1,M,Billy Nunley,SBD,MR-T3,120+,Raw,,124.8,-215,215,-235,215,-125,125,135,135,217.5,235,-245,235,585,1995
1,M,Christopher Alexander,SBD,MR-Jr,59,Raw,LA Leg,58.4,120,-130,-130,120,70,75,-77.5,75,167.5,-180,-180,167.5,362.5,1993
1,M,Denver Chisom,SBD,MR-Jr,66,Raw,,65,-157.5,-162.5,165,165,130,135,-137.5,135,202.5,217.5,227.5,227.5,527.5,1990
2,M,Armond Hughes,SBD,MR-Jr,66,Raw,,65.7,-177.5,177.5,190,190,-102.5,102.5,105,105,217.5,230,-240.5,230,525,
3,M,Robert Ambrose,SBD,MR-Jr,66,Raw,,64.6,145,160,165,165,105,115,-120,115,182.5,197.5,202.5,202.5,482.5,1991
4,M,Kyle Simpson,SBD,MR-Jr,66,Raw,,64.9,147.5,150,,150,107.5,115,-117.5,115,217.5,,,217.5,482.5,1991
1,M,Jonathan Chapa,SBD,MR-Jr,74,Raw,,73,215,222.5,-230,222.5,-125,125,130,130,245,262.5,267.5,267.5,620,1990
2,M,Arthur Bui,SBD,MR-Jr,74,Raw,,73.3,195,205,210,210,130,137.5,-142.5,137.5,225,242.5,252.5,252.5,600,1992
3,M,Taylor Nox,SBD,MR-Jr,74,Raw,LA Leg,73.2,187.5,-200,200,200,135,142.5,147.5,147.5,220,240,-247.5,240,587.5,1993
4,M,Keith Schneider,SBD,MR-Jr,74,Raw,,73.1,185,197.5,-205,197.5,102.5,112.5,-120,112.5,232.5,247.5,-255,247.5,557.5,1992
5,M,Robert Irving,SBD,MR-Jr,74,Raw,,73.6,175,-180,-180,175,130,137.5,-140,137.5,227.5,230,237.5,237.5,550,1991
6,M,Billy Luther,SBD,MR-Jr,74,Raw,,68.8,165,177.5,187.5,187.5,120,125,-127.5,125,212.5,-227.5,-227.5,212.5,525,1991
7,M,John Shulik,SBD,MR-Jr,74,Raw,,72,-167.5,167.5,-187,167.5,127.5,-132.5,-132.5,127.5,215,-232.5,,215,510,1991
8,M,Joey Burke,SBD,MR-Jr,74,Raw,,72.7,167.5,172.5,182.5,182.5,112.5,-117.5,-117.5,112.5,200,215,-225,215,510,1994
9,M,Joseph Bliski,SBD,MR-Jr,74,Raw,LA Leg,69.1,155,165,170,170,105,-107.5,-107.5,105,200,-212.5,212.5,212.5,487.5,
1,M,Jonnie Candito,SBD,MR-Jr,83,Raw,,82.1,237.5,245,-250,245,132.5,140,-145,140,257.5,-265,-265,257.5,642.5,1992
2,M,Andrey Grebenetsky,SBD,MR-Jr,83,Raw,,82.7,207.5,227.5,-242.5,227.5,142.5,155,162.5,162.5,227.5,247.5,-260,247.5,637.5,1990
3,M,Spencer Johnson,SBD,MR-Jr,83,Raw,,81.9,195,202.5,207.5,207.5,147.5,157.5,162.5,162.5,242.5,-260,-260,242.5,612.5,1992
4,M,Alex Pinnow,SBD,MR-Jr,83,Raw,,78.5,207.5,217.5,223.5,223.5,127.5,142.5,-152.5,142.5,-220,222.5,240,240,606,1993
5,M,Matthew Guzik,SBD,MR-Jr,83,Raw,,77,200,212.5,217.5,217.5,127.5,132.5,135,135,245,-255,-255,245,597.5,1992
6,M,Tom Buckles,SBD,MR-Jr,83,Raw,,81.7,172.5,192.5,-205,192.5,112.5,125,132.5,132.5,215,235,250,250,575,1994
7,M,Ryne Golesh,SBD,MR-Jr,83,Raw,,81.4,170,185,195,195,112.5,125,132.5,132.5,175,202.5,212.5,212.5,540,1993
8,M,Joseph Fazio,SBD,MR-Jr,83,Raw,,81.4,142.5,157.5,165,165,125,135,-140,135,182.5,205,-210,205,505,1991
9,M,Benigno Paz,SBD,MR-Jr,83,Raw,,80.2,172.5,-187.5,187.5,187.5,95,105,-112.5,105,177.5,190,210,210,502.5,1993
10,M,David Beiswenger,SBD,MR-Jr,83,Raw,,80.8,145,162.5,172.5,172.5,87.5,-97.5,-97.5,87.5,200,220,227.5,227.5,487.5,1994
11,M,Donal Neal,SBD,MR-Jr,83,Raw,,78.5,165,-180,-180,165,100,-107.5,107.5,107.5,182.5,200,-227.5,200,472.5,
1,M,Garrett Bailey,SBD,MR-Jr,93,Raw,Louisiana Legends,92.3,242.5,255,-262.5,255,152.5,162.5,172.5,172.5,325,-340,-355.5,325,752.5,1992
2,M,Nicholas Deluca,SBD,MR-Jr,93,Raw,,92.4,250,-267.5,-267.5,250,155,162.5,172.5,172.5,260,-267.5,,260,682.5,
3,M,Michael Soya,SBD,MR-Jr,93,Raw,,91.3,200,222.5,235,235,160,167.5,-172.5,167.5,235,252.5,262.5,262.5,665,1990
4,M,Hani Jazayrli,SBD,MR-Jr,93,Raw,,91,227.5,245,-262.5,245,132.5,140,147.5,147.5,227.5,250,265,265,657.5,1990
5,M,Sam Nemir,SBD,MR-Jr,93,Raw,,90.1,215,222.5,-232.5,222.5,142.5,-147.5,-147.5,142.5,240,250,260,260,625,1993
6,M,Alan Beavers,SBD,MR-Jr,93,Raw,,91.5,200,-210,-210,200,142.5,145,150,150,250,-255,-255,250,600,1992
7,M,Michael Parsons,SBD,MR-Jr,93,Raw,,91.7,-205,205,-210,205,162.5,172.5,-182.5,172.5,207.5,217.5,-225,217.5,595,1990
1,M,Gregory Johnson,SBD,MR-Jr,105,Raw,Ram Powerlifting,97.8,262.5,272.5,282.5,282.5,160,-165,-165,160,340,347.5,-352.5,347.5,790,1990
2,M,Cody Mohlencamp,SBD,MR-Jr,105,Raw,,104.2,262.5,272.5,277.5,277.5,165,172.5,-177.5,172.5,255,-265,-265,255,705,1994
3,M,Joe Loyacono,SBD,MR-Jr,105,Raw,,102.5,215,230,-237.5,230,165,170,-172.5,170,287.5,300,-307.5,300,700,1991
4,M,Tyler Cook,SBD,MR-Jr,105,Raw,,104.1,192.5,202.5,210,210,147.5,157.5,165,165,247.5,272.5,-302.5,272.5,647.5,1991
5,M,Reichelt Michael,SBD,MR-Jr,105,Raw,,98.9,225,-245,-245,225,142.5,150,-157.5,150,225,242.5,-260,242.5,617.5,1994
6,M,William McDonald,SBD,MR-Jr,105,Raw,Ram Powerlifting,104,205,-212.5,-215,205,65,115,120,120,-205,205,-210,205,530,1993
DQ,M,Jay Wade,SBD,MR-Jr,105,Raw,,98.4,-260,-265,-265,,165,175,-182.5,175,265,-272.5,-272.5,265,,1994
1,M,Jared Goad,SBD,MR-Jr,120,Raw,SSPT,118.8,-265,-265,265,265,142.5,-160,-175,142.5,272.5,285,-290,285,692.5,1991
2,M,Sam Parker #2,SBD,MR-Jr,120,Raw,,118.1,227.5,237.5,-245,237.5,147.5,155,-162.5,155,260,280,-295,280,672.5,
3,M,Aaron Boulay,SBD,MR-Jr,120,Raw,,105.2,190,-207.5,-217.5,190,130,140,150,150,237.5,257.5,277.5,277.5,617.5,1991
1,M,Andy Askow,SBD,MR-Jr,120+,Raw,,177.7,307.5,325,340,340,185,195,205,205,265,280,282.5,282.5,827.5,1994
2,M,Luke Klein,SBD,MR-Jr,120+,Raw,,154.9,285,300,-305,300,187.5,195,-197.5,195,295,305,-332.5,305,800,1992
3,M,Austen Vickers,SBD,MR-Jr,120+,Raw,,122.4,260,282.5,-290,282.5,167.5,180,185,185,272.5,292.5,-300,292.5,760,1991
4,M,Jeremy Matschek,SBD,MR-Jr,120+,Raw,,123.7,210,217.5,227.5,227.5,165,-175,-182.5,165,225,232.5,237.5,237.5,630,1994
1,M,Quentin Myers,SBD,MR-O,59,Raw,,58.3,177.5,182.5,187.5,187.5,120,122.5,-125,122.5,207.5,210,212.5,212.5,522.5,1986
2,M,Eric Kupperstein,SBD,MR-O,59,Raw,,58.8,170,182.5,187.5,187.5,70,75,77.5,77.5,225,-245,-260,225,490,1966
3,M,Matthew Fox,SBD,MR-O,59,Raw,,58.1,157.5,167.5,,167.5,112.5,117.5,122.5,122.5,172.5,182.5,195,195,485,1991
4,M,Matthew Fox,SBD,MR-O,59,Raw,,58.1,157.5,167.5,,167.5,112.5,117.5,122.5,122.5,172.5,182.5,195,195,485,1991
5,M,K. Courtney Spencer,SBD,MR-O,59,Raw,SSPT,58.5,155,167.5,-180,167.5,97.5,102.5,-105,102.5,165,180,-190,180,450,
6,M,Alex Galant,SBD,MR-O,59,Raw,Titan,58.1,100,-115,-115,100,40,47.5,52.5,52.5,122.5,140,142.5,142.5,295,1947
DQ,M,Allen Zou,SBD,MR-O,59,Raw,,58.8,127.5,-142.5,-142.5,127.5,-102.5,102.5,107.5,107.5,-175,-175,-175,,,1996
1,M,Keith McHoney,SBD,MR-O,66,Raw,,63.4,-215,217.5,227.5,227.5,150,-157.5,-157.5,150,237.5,245,252.5,252.5,630,1985
2,M,Shawn Frasquillo,SBD,MR-O,66,Raw,SSPT,64.7,182.5,192.5,200,200,142.5,150,155,155,227.5,242.5,253,253,608,1986
3,M,Denver Chisom,SBD,MR-O,66,Raw,,65,-157.5,-162.5,165,165,130,135,-137.5,135,202.5,217.5,227.5,227.5,527.5,1990
4,M,Greg Simmons #2,SBD,MR-O,66,Raw,,65.7,155,167.5,177.5,177.5,115,122.5,125,125,195,-207.5,,195,497.5,1969
5,M,Bao-Khang Luu,SBD,MR-O,66,Raw,SSPT,64.1,165,177.5,185,185,90,95,102.5,102.5,192.5,205,-212.5,205,492.5,1978
6,M,Robert Ambrose,SBD,MR-O,66,Raw,,64.6,145,160,165,165,105,115,-120,115,182.5,197.5,202.5,202.5,482.5,1991
7,M,Kyle Simpson,SBD,MR-O,66,Raw,,64.9,147.5,150,,150,107.5,115,-117.5,115,217.5,,,217.5,482.5,1991
8,M,Daniel Vanderberg,SBD,MR-O,66,Raw,LA Leg,65.1,142.5,152.5,162.5,162.5,100,105,112.5,112.5,157.5,175,192.5,192.5,467.5,1987
9,M,Wes Ervin,SBD,MR-O,66,Raw,,63.7,140,147.5,155,155,90,95,-97.5,95,175,195,-207.5,195,445,
10,M,Vartan Khachaturov,SBD,MR-O,66,Raw,,65.5,137.5,142.5,147.5,147.5,92.5,97.5,-102.5,97.5,175,185,190,190,435,1988
11,M,Josh Rein,SBD,MR-O,66,Raw,Virtus,63.4,125,132.5,140,140,-77.5,77.5,80,80,75,,,75,295,
1,M,Taylor Atwood,SBD,MR-O,74,Raw,,73.5,222.5,235,-240,235,170,177.5,180,180,257.5,-265,272.5,272.5,687.5,1988
2,M,Scott Sullivan #1,SBD,MR-O,74,Raw,,73.7,207.5,227.5,-235,227.5,150,-160,160,160,247.5,262.5,-267.5,262.5,650,1986
3,M,Jonathan Chapa,SBD,MR-O,74,Raw,,73,215,222.5,-230,222.5,-125,125,130,130,245,262.5,267.5,267.5,620,1990
4,M,Cody Houser,SBD,MR-O,74,Raw,,73.8,-210,217.5,227.5,227.5,145,150,155,155,212.5,227.5,-232.5,227.5,610,1995
5,M,Tim Lamando,SBD,MR-O,74,Raw,,73.9,200,-210,210,210,122.5,130,-132.5,130,240,252.5,262.5,262.5,602.5,1979
6,M,Arthur Bui,SBD,MR-O,74,Raw,,73.3,195,205,210,210,130,137.5,-142.5,137.5,225,242.5,252.5,252.5,600,1992
7,M,Taylor Nox,SBD,MR-O,74,Raw,LA Leg,73.2,187.5,-200,200,200,135,142.5,147.5,147.5,220,240,-247.5,240,587.5,1993
8,M,Nathan Kimball,SBD,MR-O,74,Raw,,72.2,195,210,215,215,125,130,135,135,215,230,-240,230,580,1996
9,M,Nial Luu,SBD,MR-O,74,Raw,,72.8,180,192.5,-200,192.5,132.5,-140,-140,132.5,227.5,245,-255,245,570,1991
10,M,Johnny May,SBD,MR-O,74,Raw,,73.8,-192.5,-192.5,192.5,192.5,155,160,162.5,162.5,207.5,210,215,215,570,1968
11,M,Zachary Oldaker,SBD,MR-O,74,Raw,SSPT,73.3,175,185,192.5,192.5,120,127.5,132.5,132.5,230,240,-250,240,565,1995
12,M,Keith Schneider,SBD,MR-O,74,Raw,,73.1,185,197.5,-205,197.5,102.5,112.5,-120,112.5,232.5,247.5,-255,247.5,557.5,1992
13,M,Robert Irving,SBD,MR-O,74,Raw,,73.6,175,-180,-180,175,130,137.5,-140,137.5,227.5,230,237.5,237.5,550,1991
14,M,Alberto Nuñez,SBD,MR-O,74,Raw,,72.3,167.5,175,-182.5,175,115,122.5,125,125,220,-235,235,235,535,
15,M,Brian Ashbee,SBD,MR-O,74,Raw,,72.5,165,167.5,172.5,172.5,-132.5,137.5,142.5,142.5,175,185,200,200,515,1990
16,M,Brett Hof,SBD,MR-O,74,Raw,,71.9,170,-172.5,-172.5,170,115,125,-132.5,125,175,185,190,190,485,1987
17,M,Slade Jones,SBD,MR-O,74,Raw,,72.7,142.5,152.5,160,160,95,-100,100,100,200,212.5,222.5,222.5,482.5,1989
18,M,Jonathan Peebles,SBD,MR-O,74,Raw,,73.5,205,222.5,230,230,150,165,-172.5,165,75,,,75,470,1988
19,M,Justin Cowles,SBD,MR-O,74,Raw,,73.5,67.5,,,67.5,60,,,60,200,220,-250,220,347.5,1976
DQ,M,Anthony Lucas,SBD,MR-O,74,Raw,,73.4,210,220,-225,220,155,-160,-160,155,-235,-235,-235,,,1984
1,M,Josh Hyaduck,SBD,MR-O,83,Raw,,82.1,237.5,252.5,262.5,262.5,167.5,177.5,182.5,182.5,255,267.5,277.5,277.5,722.5,1987
2,M,Tertitski Alex,SBD,MR-O,83,Raw,SSPT,82,232.5,245,-252.5,245,150,157.5,162.5,162.5,287.5,-305,-315,287.5,695,1978
3,M,Jamie McDougal,SBD,MR-O,83,Raw,,81.5,200,-217.5,227.5,227.5,165,175,182.5,182.5,270,282.5,-290,282.5,692.5,1972
4,M,John Downing,SBD,MR-O,83,Raw,,81.6,252.5,262.5,-272.5,262.5,157.5,165,170,170,-260,260,-275,260,692.5,1990
5,M,Derek Gove,SBD,MR-O,83,Raw,,82.7,237.5,250,262.5,262.5,142.5,152.5,-157.5,152.5,272.5,-292.5,-292.5,272.5,687.5,1987
6,M,Michael Loncharich,SBD,MR-O,83,Raw,,82.1,225,240,-245,240,167.5,-175,,167.5,275,-287.5,-300,275,682.5,1989
7,M,Ross Leppala,SBD,MR-O,83,Raw,SSPT,82.6,225,240,250,250,165,175,182.5,182.5,225,240,250,250,682.5,1984
8,M,Justin Burch,SBD,MR-O,83,Raw,,81.5,210,230,-237.5,230,140,147.5,152.5,152.5,265,282.5,290,290,672.5,1982
9,M,Nicholas Gutierrez,SBD,MR-O,83,Raw,,82.5,225,255,262.5,262.5,135,147.5,-152.5,147.5,235,255,-262.5,255,665,1982
10,M,Elliot Rowe,SBD,MR-O,83,Raw,,81.9,215,222.5,230,230,150,157.5,160,160,242.5,257.5,267.5,267.5,657.5,1989
11,M,Lloyd Summers,SBD,MR-O,83,Raw,,79.7,210,215,,215,182.5,-187.5,-187.5,182.5,245,257.5,,257.5,655,
12,M,Jonnie Candito,SBD,MR-O,83,Raw,,82.1,237.5,245,-250,245,132.5,140,-145,140,257.5,-265,-265,257.5,642.5,1992
13,M,Andrey Grebenetsky,SBD,MR-O,83,Raw,,82.7,207.5,227.5,-242.5,227.5,142.5,155,162.5,162.5,227.5,247.5,-260,247.5,637.5,1990
14,M,Drew Thompson,SBD,MR-O,83,Raw,,82.1,210,220,-227.5,220,162.5,165,-170,165,230,240,250,250,635,1988
15,M,Benjamin Rowe,SBD,MR-O,83,Raw,,82.6,230,-240,-240,230,155,-165,-165,155,230,250,-255,250,635,1976
16,M,Jorge Unigarro,SBD,MR-O,83,Raw,SSPT,82.4,195,207.5,217.5,217.5,145,-155,-155,145,247.5,262.5,-272.5,262.5,625,1982
17,M,Christopher Szefler,SBD,MR-O,83,Raw,,80.2,190,200,212.5,212.5,142.5,150,-157.5,150,240,255,-260,255,617.5,1984
18,M,Elliot White,SBD,MR-O,83,Raw,SSPT,82.8,192.5,205,212.5,212.5,135,142.5,145,145,-225,237.5,245,245,602.5,
19,M,Derek Gelato,SBD,MR-O,83,Raw,,82,205,-215,,205,135,142.5,147.5,147.5,237.5,247.5,,247.5,600,1986
20,M,Matthew Guzik,SBD,MR-O,83,Raw,,77,200,212.5,217.5,217.5,127.5,132.5,135,135,245,-255,-255,245,597.5,1992
21,M,Christopher Aydin,SBD,MR-O,83,Raw,,80.6,200,210,217.5,217.5,140,152.5,-157.5,152.5,212.5,225,-237.5,225,595,1988
22,M,Donovan Thompson,SBD,MR-O,83,Raw,,82,175,205,210,210,142.5,160,162.5,162.5,182.5,222.5,,222.5,595,1966
23,M,Jason Kaplan,SBD,MR-O,83,Raw,,81.2,182.5,205,-212.5,205,130,140,-142.5,140,220,227.5,235,235,580,1984
24,M,Eric Bodhorn,SBD,MR-O,83,Raw,,81.2,190,192.5,197.5,197.5,-122.5,122.5,127.5,127.5,210,220,227.5,227.5,552.5,1986
25,M,Ken Bray,SBD,MR-O,83,Raw,,76.7,-170,172.5,-185,172.5,107.5,-112.5,112.5,112.5,240,255,-260,255,540,1969
26,M,Zach Hallford,SBD,MR-O,83,Raw,SSPT,80.5,-207.5,207.5,-210,207.5,-120,120,-125,120,210,-220,-220,210,537.5,1996
27,M,Anthony Torsell,SBD,MR-O,83,Raw,,76.8,190,-205,-210,190,145,150,-155,150,170,185,195,195,535,1986
28,M,Philip Wikerson,SBD,MR-O,83,Raw,,81.2,162.5,175,185,185,115,122.5,-130,122.5,227.5,-250,-262.5,227.5,535,
29,M,Chris Clark,SBD,MR-O,83,Raw,RMLC,82,175,182.5,190,190,125,127.5,130,130,200,-215,215,215,535,1972
30,M,Adam Palmer,SBD,MR-O,83,Raw,SSPT,81.6,-165,165,177.5,177.5,-125,-130,130,130,210,220,225,225,532.5,1982
31,M,Robbie O'Brien,SBD,MR-O,83,Raw,,77.6,170,-180,-187.5,170,105,110,-112.5,110,207.5,-217.5,227.5,227.5,507.5,1985
32,M,Jason Wood,SBD,MR-O,83,Raw,RMLC,81.5,155,170,175,175,105,112.5,115,115,185,192.5,-197.5,192.5,482.5,1979
33,M,Michael Williams,SBD,MR-O,83,Raw,,81.3,155,-162.5,162.5,162.5,110,-115,-115,110,185,187.5,192.5,192.5,465,1983
34,M,Christopher Carter,SBD,MR-O,83,Raw,,80.9,150,160,167.5,167.5,97.5,100,102.5,102.5,185,192.5,-202.5,192.5,462.5,1977
1,M,Layne Norton,SBD,MR-O,93,Raw,SSPT,91.7,265,282.5,295,295,162.5,172.5,177.5,177.5,-290,300,310,310,782.5,1981
2,M,LS McClain,SBD,MR-O,93,Raw,SSPT,92.9,252.5,265,275,275,207.5,-215,-215,207.5,-287.5,-290,290,290,772.5,1978
3,M,Garrett Bailey,SBD,MR-O,93,Raw,Louisiana Legends,92.3,242.5,255,-262.5,255,152.5,162.5,172.5,172.5,325,-340,-355.5,325,752.5,1992
4,M,Bryce Lewis,SBD,MR-O,93,Raw,RMLC,91.2,247.5,-267.5,-267.5,247.5,175,185,-192.5,185,285,302.5,317.5,317.5,750,1987
5,M,Kris Hunt,SBD,MR-O,93,Raw,SSPT,92.1,255,270,285,285,145,152.5,160,160,260,275,290,290,735,1982
6,M,Anthony Parrella,SBD,MR-O,93,Raw,SSPT,92.4,227.5,242.5,250,250,157.5,167.5,172.5,172.5,272.5,287.5,300,300,722.5,1983
7,M,Abe Weins,SBD,MR-O,93,Raw,,91.8,235,-247.5,-252.5,235,172.5,-182.5,-182.5,172.5,280,292.5,300,300,707.5,1986
8,M,Nick Gagnon,SBD,MR-O,93,Raw,,90.8,-245,250,-265,250,170,177.5,-182.5,177.5,260,272.5,-295,272.5,700,1987
9,M,Ashton Rouska,SBD,MR-O,93,Raw,,83.9,227.5,242.5,252.5,252.5,152.5,157.5,-162.5,157.5,287.5,-300,-325,287.5,697.5,1997
10,M,Brian Minor,SBD,MR-O,93,Raw,,92.2,222.5,235,242.5,242.5,145,157.5,-165,157.5,270,-285,285,285,685,1984
11,M,Nicholas Deluca,SBD,MR-O,93,Raw,,92.4,250,-267.5,-267.5,250,155,162.5,172.5,172.5,260,-267.5,,260,682.5,
12,M,Mark Bruno,SBD,MR-O,93,Raw,,88.4,200,215,227.5,227.5,137.5,145,-150,145,262.5,282.5,300,300,672.5,1988
13,M,Michael Soya,SBD,MR-O,93,Raw,,91.3,200,222.5,235,235,160,167.5,-172.5,167.5,235,252.5,262.5,262.5,665,1990
14,M,Donald Bigham,SBD,MR-O,93,Raw,,85.6,222.5,237.5,245,245,145,152.5,-157.5,152.5,240,252.5,262.5,262.5,660,1972
15,M,Scott Roberts,SBD,MR-O,93,Raw,RMLC,90.9,215,235,245,245,122.5,132.5,137.5,137.5,252.5,275,-285,275,657.5,1958
16,M,Hani Jazayrli,SBD,MR-O,93,Raw,,91,227.5,245,-262.5,245,132.5,140,147.5,147.5,227.5,250,265,265,657.5,1990
17,M,Corey Joyal,SBD,MR-O,93,Raw,,91.8,232.5,245,-250,245,145,152.5,-155,152.5,230,240,245,245,642.5,1976
18,M,Fred Rumler,SBD,MR-O,93,Raw,,92.7,-220,220,230,230,167.5,-185,-185,167.5,232.5,242.5,-255,242.5,640,
19,M,Alex Hanson,SBD,MR-O,93,Raw,,86.9,220,230,-237.5,230,122.5,127.5,-132.5,127.5,270,280,-287.5,280,637.5,1986
20,M,Tommy Janusz,SBD,MR-O,93,Raw,,90.9,205,215,-227.5,215,-175,185,195,195,227.5,-242.5,,227.5,637.5,1986
21,M,Dean Johnson,SBD,MR-O,93,Raw,,90.8,-232.5,242.5,250,250,142.5,-150,-150,142.5,230,242.5,-250,242.5,635,1975
22,M,Rory Tatum,SBD,MR-O,93,Raw,,92.6,227.5,240,252.5,252.5,132.5,137.5,145,145,220,227.5,232.5,232.5,630,1988
23,M,Jeff Bruno,SBD,MR-O,93,Raw,,89.7,-192.5,192.5,217.5,217.5,-130,130,-145,130,250,272.5,-285,272.5,620,1988
24,M,Alan Beavers,SBD,MR-O,93,Raw,,91.5,200,-210,-210,200,142.5,145,150,150,250,-255,-255,250,600,1992
25,M,Nathaniel Hancock,SBD,MR-O,93,Raw,,91.5,192.5,-205,-205,192.5,155,162.5,170,170,212.5,225,235,235,597.5,1978
26,M,Adrian Martinez #3,SBD,MR-O,93,Raw,RMLC,88.9,-212.5,212.5,240,240,117.5,127.5,130,130,-225,225,-255,225,595,1984
27,M,Eric Lohman,SBD,MR-O,93,Raw,,91.7,200,212.5,-227.5,212.5,137.5,147.5,,147.5,220,-237.5,-237.5,220,580,1989
28,M,Christian Evans,SBD,MR-O,93,Raw,,92.6,205,220,227.5,227.5,100,110,115,115,200,220,230,230,572.5,1976
29,M,Chad Singleton,SBD,MR-O,93,Raw,,90.5,157.5,167.5,172.5,172.5,120,127.5,132.5,132.5,225,245,260,260,565,1993
30,M,Ben Rudman,SBD,MR-O,93,Raw,,89.2,175,185,195,195,125,132.5,137.5,137.5,190,212.5,227.5,227.5,560,1986
31,M,Raymond Chard,SBD,MR-O,93,Raw,RMLC,91.2,170,185,190,190,107.5,-112.5,112.5,112.5,215,235,-245,235,537.5,1989
32,M,Vic Fazio,SBD,MR-O,93,Raw,,91.9,165,192.5,-200,192.5,112.5,125,-130,125,200,220,-230,220,537.5,1962
33,M,Frank Scotello,SBD,MR-O,93,Raw,,89.9,145,175,-195,175,-125,-125,125,125,162.5,192.5,202.5,202.5,502.5,1976
34,M,Clark Kitzes,SBD,MR-O,93,Raw,,90.5,175,185,190,190,107.5,-112.5,-112.5,107.5,175,182.5,190,190,487.5,1988
35,M,Kurt Vasquez,SBD,MR-O,93,Raw,,90,135,140,-142.5,140,110,112.5,117.5,117.5,190,195,-200,195,452.5,1979
DQ,M,Tony Schwebach,SBD,MR-O,93,Raw,,86.6,222.5,232.5,-240,232.5,142.5,150,-155,150,-260,-260,-270,,,1990
DQ,M,Jeff Van Natter,SBD,MR-O,93,Raw,,87.5,-122.5,122.5,125,125,-112.5,-115,-117.5,,167.5,170,-175,170,,1974
DQ,M,Dan Gresh,SBD,MR-O,93,Raw,RMLC,91,190,-200,200,200,-140,-140,,,,,,,,1989
DQ,M,Sean Reagan,SBD,MR-O,93,Raw,,91.1,-190,-190,-190,,-160,-170,-170,,227.5,-240,-240,227.5,,1977
1,M,Nick Tylutki,SBD,MR-O,105,Raw,Titan,102.3,300,-310,310,310,180,185,187.5,187.5,305,315,325,325,822.5,1978
2,M,Eli Burks,SBD,MR-O,105,Raw,,101.8,257.5,-272.5,272.5,272.5,165,175,182.5,182.5,317.5,345,-357.5,345,800,1987
3,M,Rivas John,SBD,MR-O,105,Raw,Goggins Force,104.1,265,277.5,-282.5,277.5,195,202.5,-207.5,202.5,300,312.5,-322.5,312.5,792.5,1990
4,M,Gregory Johnson,SBD,MR-O,105,Raw,Ram Powerlifting,97.8,262.5,272.5,282.5,282.5,160,-165,-165,160,340,347.5,-352.5,347.5,790,1990
5,M,William LeBlanc,SBD,MR-O,105,Raw,Titan,103.8,287.5,300,307.5,307.5,167.5,172.5,177.5,177.5,285,300,-307.5,300,785,1990
6,M,Garrett Blevins,SBD,MR-O,105,Raw,,97.6,277.5,-287.5,-287.5,277.5,192.5,200,202.5,202.5,300,-320,-320,300,780,1988
7,M,Matt Nolan,SBD,MR-O,105,Raw,,101.9,240,257.5,265,265,167.5,180,-187.5,180,282.5,315,,315,760,1986
8,M,John Norcott,SBD,MR-O,105,Raw,,103.8,260,272.5,280,280,167.5,172.5,177.5,177.5,277.5,285,297.5,297.5,755,1989
9,M,Lorenzo Peterson,SBD,MR-O,105,Raw,,103.6,232.5,-245,245,245,167.5,175,182.5,182.5,282.5,300,317.5,317.5,745,1981
10,M,Steve Landry,SBD,MR-O,105,Raw,,104.4,-255,255,-265,255,182.5,-190,-190,182.5,282.5,295,307.5,307.5,745,1965
11,M,Matthew Albright,SBD,MR-O,105,Raw,,104.1,250,262.5,-270,262.5,170,175,180,180,267.5,287.5,-295,287.5,730,1982
12,M,Michael Pucci,SBD,MR-O,105,Raw,,101.4,242.5,255,267.5,267.5,167.5,180,182.5,182.5,240,255,267.5,267.5,717.5,1986
13,M,Daniel Reid,SBD,MR-O,105,Raw,,104.3,247.5,255,262.5,262.5,142.5,152.5,-155,152.5,275,295,-307.5,295,710,1988
14,M,Mark Robb,SBD,MR-O,105,Raw,SSPT,102.2,-250,265,-275,265,140,147.5,-152.5,147.5,275,,,275,687.5,1959
15,M,Ken Gack,SBD,MR-O,105,Raw,Phoinix,104.4,235,242.5,247.5,247.5,175,180,-182.5,180,240,250,257.5,257.5,685,1970
16,M,Matthew Otero,SBD,MR-O,105,Raw,,101.1,230,240,-247.5,240,155,165,-170,165,-260,272.5,-282.5,272.5,677.5,1979
17,M,Josef Schaffer,SBD,MR-O,105,Raw,,103.6,230,-242.5,-242.5,230,192.5,200,205,205,220,230,-235,230,665,1976
18,M,Alvin Fritz,SBD,MR-O,105,Raw,,103.9,227.5,-245,245,245,160,-170,-170,160,230,247.5,-255,247.5,652.5,1968
19,M,Jake Monroe,SBD,MR-O,105,Raw,,102.8,212.5,225,-227.5,225,130,137.5,-142.5,137.5,257.5,270,-280,270,632.5,1988
20,M,Matt Gary,SBD,MR-O,105,Raw,SSPT,104.4,195,205,212.5,212.5,140,147.5,-155,147.5,245,260,272.5,272.5,632.5,
21,M,Mike O'Donnell,SBD,MR-O,105,Raw,,104.1,220,232.5,-240,232.5,130,137.5,-142.5,137.5,240,260,-265,260,630,
22,M,Danny Henry,SBD,MR-O,105,Raw,,100.9,185,200,210,210,-135,135,145,145,245,272.5,-285,272.5,627.5,1971
23,M,Austin Keanu,SBD,MR-O,105,Raw,,103.2,230,247.5,-252.5,247.5,150,-160,-160,150,205,227.5,-240,227.5,625,1961
24,M,Alex Goldberg,SBD,MR-O,105,Raw,,99.8,175,-187.5,187.5,187.5,-117.5,122.5,127.5,127.5,272.5,287.5,-295,287.5,602.5,
25,M,Charles Gonzales,SBD,MR-O,105,Raw,Ram Powerlifting,100.2,187.5,197.5,200,200,132.5,137.5,140,140,250,-260,260,260,600,1984
26,M,Peter Hubbard #2,SBD,MR-O,105,Raw,,104.1,192.5,207.5,-217.5,207.5,130,137.5,-142.5,137.5,210,230,240,240,585,1994
27,M,William McDonald,SBD,MR-O,105,Raw,Ram Powerlifting,104,205,-212.5,-215,205,65,115,120,120,-205,205,-210,205,530,1993
DQ,M,Jay Wade,SBD,MR-O,105,Raw,,98.4,-260,-265,-265,,165,175,-182.5,175,265,-272.5,-272.5,265,,1994
DQ,M,Joshua Price,SBD,MR-O,105,Raw,,102.8,-232.5,-232.5,,,,,,,-247.5,,,,,1983
DQ,M,Casey Jahns,SBD,MR-O,105,Raw,,103.9,190,-205,217.5,217.5,-195,-195,-195,,-240,,,,,1990
DQ,M,Angelo Miller,SBD,MR-O,105,Raw,,104.3,-235,-235,-235,,-137.5,137.5,150,150,227.5,252.5,-272.5,252.5,,1976
DQ,M,Vasil Gushterov,SBD,MR-O,105,Raw,RMLC,104.8,-250,-250,-250,,,,,,,,,,,1975
1,M,Michael Tuchscherer,SBD,MR-O,120,Raw,SSPT,118.9,315,332.5,340,340,197.5,-207.5,-207.5,197.5,320,342.5,357.5,357.5,895,1985
2,M,Jared Martin #1,SBD,MR-O,120,Raw,,117.3,-317.5,-325,325,325,182.5,-187.5,-187.5,182.5,317.5,327.5,337.5,337.5,845,1989
3,M,Anthony Harris #1,SBD,MR-O,120,Raw,,113.8,285,307.5,320,320,165,180,187.5,187.5,295,307.5,325,325,832.5,1964
4,M,Thad Benefield,SBD,MR-O,120,Raw,,117.6,262.5,280,290,290,190,202.5,207.5,207.5,297.5,320,-335,320,817.5,1975
5,M,Trettin Robert,SBD,MR-O,120,Raw,,117.4,275,287.5,295,295,192.5,205,210,210,277.5,295,-312.5,295,800,1986
6,M,Joseph Visconti,SBD,MR-O,120,Raw,SSPT,112.8,207.5,220,230,230,190,200,-207.5,200,250,265,272.5,272.5,702.5,1978
7,M,Kevin Phillipson,SBD,MR-O,120,Raw,SSPT,115.6,207.5,222.5,232.5,232.5,175,187.5,-192.5,187.5,275,-292.5,-292.5,275,695,1980
8,M,Robert Schmidt #3,SBD,MR-O,120,Raw,SSPT,117.6,247.5,260,-272.5,260,175,182.5,-190,182.5,230,240,-250,240,682.5,1973
9,M,Adam Nunnallee,SBD,MR-O,120,Raw,,118.6,215,225,235,235,150,160,165,165,270,-292.5,-292.5,270,670,1980
10,M,Michael Reschke,SBD,MR-O,120,Raw,,118.6,217.5,230,237.5,237.5,130,-137.5,-137.5,130,275,295,-307.5,295,662.5,1986
11,M,Chip Beck,SBD,MR-O,120,Raw,,116.7,205,215,-227.5,215,160,167.5,-172.5,167.5,227.5,250,-257.5,250,632.5,1972
12,M,Aaron Boulay,SBD,MR-O,120,Raw,,105.2,190,-207.5,-217.5,190,130,140,150,150,237.5,257.5,277.5,277.5,617.5,1991
13,M,Jonathan Iman,SBD,MR-O,120,Raw,,115.5,200,210,225,225,125,-135,137.5,137.5,210,220,-227.5,220,582.5,1981
1,M,Blaine Sumner,SBD,MR-O,120+,Raw,Titan,166.3,355,382.5,400,400,225,237.5,240,240,305,315,335,335,975,1987
2,M,Ray Williams #1,SBD,MR-O,120+,Raw,SSPT,161,375,-395,395,395,220,-227.5,-227.5,220,-305,305,-320,305,920,1986
3,M,Matt Baller,SBD,MR-O,120+,Raw,SSPT,141.2,292.5,312.5,-325,312.5,242.5,255,265.5,265.5,272.5,290,302.5,302.5,880.5,
4,M,William Burrell,SBD,MR-O,120+,Raw,,133.3,-287.5,287.5,-305,287.5,202.5,-212.5,-212.5,202.5,320,-330,-330,320,810,1986
5,M,Luke Klein,SBD,MR-O,120+,Raw,,154.9,285,300,-305,300,187.5,195,-197.5,195,295,305,-332.5,305,800,1992
7,M,Chris Riley,SBD,MR-O,120+,Raw,,141.8,270,285,290,290,175,182.5,190,190,-275,300,-320,300,780,1986
8,M,Austen Vickers,SBD,MR-O,120+,Raw,,122.4,260,282.5,-290,282.5,167.5,180,185,185,272.5,292.5,-300,292.5,760,1991
9,M,Scott Gardner,SBD,MR-O,120+,Raw,,145.5,237.5,250,-265,250,180,192.5,-197.5,192.5,292.5,-320,-320,292.5,735,1986
10,M,Joseph Peña #1,SBD,MR-O,120+,Raw,,150.3,295,-320,330,330,135,142.5,147.5,147.5,222.5,232.5,245,245,722.5,1998
11,M,Randy Cairns,SBD,MR-O,120+,Raw,,124.3,235,252.5,265,265,-142.5,142.5,-147.5,142.5,252.5,262.5,270,270,677.5,1965
12,M,James Freeman #2,SBD,MR-O,120+,Raw,,129.4,215,235,-247.5,235,125,135,142.5,142.5,220,245,265,265,642.5,1988
13,M,Jeremy Matschek,SBD,MR-O,120+,Raw,,123.7,210,217.5,227.5,227.5,165,175,-182.5,175,225,232.5,237.5,237.5,640,1994
14,M,Joe Hanson,SBD,MR-O,120+,Raw,,124.9,177.5,187.5,-195,187.5,170,-182.5,-182.5,170,215,-222.5,230,230,587.5,1980
15,M,Billy Nunley,SBD,MR-O,120+,Raw,,124.8,-215,215,-235,215,-125,125,135,135,217.5,235,-245,235,585,1995
1,M,Mike Cagliola,SBD,MR-M1a,74,Raw,,72.8,180,190,195,195,132.5,140,142.5,142.5,202.5,212.5,217.5,217.5,555,1970
2,M,Brian Morrison,SBD,MR-M1a,74,Raw,,72.1,140,155,-167.5,155,115,125,-135,125,172.5,-190,190,190,470,1973
1,M,Jamie McDougal,SBD,MR-M1a,83,Raw,,81.5,200,-217.5,227.5,227.5,165,175,182.5,182.5,270,282.5,-290,282.5,692.5,1972
2,M,Ken Bray,SBD,MR-M1a,83,Raw,,76.7,-170,172.5,-185,172.5,107.5,-112.5,112.5,112.5,240,255,-260,255,540,1969
3,M,Chris Clark,SBD,MR-M1a,83,Raw,RMLC,82,175,182.5,190,190,125,127.5,130,130,200,-215,215,215,535,1972
4,M,Robert Odom,SBD,MR-M1a,83,Raw,,76.2,155,167.5,-182.5,167.5,105,112.5,-117.5,112.5,175,182.5,200,200,480,1974
1,M,Donald Bigham,SBD,MR-M1a,93,Raw,,85.6,222.5,237.5,245,245,145,152.5,-157.5,152.5,240,252.5,262.5,262.5,660,1972
1,M,Ken Gack,SBD,MR-M1a,105,Raw,Phoinix,104.4,235,242.5,247.5,247.5,175,180,-182.5,180,240,250,257.5,257.5,685,1970
2,M,Clint Poore,SBD,MR-M1a,105,Raw,,104.5,200,220,-230,220,190,200,-205,200,200,220,230,230,650,1973
3,M,Danny Henry,SBD,MR-M1a,105,Raw,,100.9,185,200,210,210,-135,135,145,145,245,272.5,-285,272.5,627.5,1971
1,M,Ron Lloyd,SBD,MR-M1a,120,Raw,,117,250,-255,,250,175,185,187.5,187.5,272.5,277.5,282.5,282.5,720,
2,M,Robert Schmidt #3,SBD,MR-M1a,120,Raw,SSPT,117.6,247.5,260,-272.5,260,175,182.5,-190,182.5,230,240,-250,240,682.5,1973
3,M,Michael Skelton,SBD,MR-M1a,120,Raw,,108.9,210,222.5,-232.5,222.5,165,-180,180,180,245,260,-265,260,662.5,1969
4,M,Chip Beck,SBD,MR-M1a,120,Raw,,116.7,205,215,-227.5,215,160,167.5,-172.5,167.5,227.5,250,-257.5,250,632.5,1972
5,M,Darren Jackson,SBD,MR-M1a,120,Raw,,115.3,205,222.5,-227.5,222.5,125,132.5,137.5,137.5,205,222.5,232.5,232.5,592.5,1970
1,M,Eric Kupperstein,SBD,MR-M1b,59,Raw,,58.8,170,182.5,187.5,187.5,70,75,77.5,77.5,225,-245,-260,225,490,1966
1,M,Jeff Phillips #1,SBD,MR-M1b,66,Raw,,64,137.5,155,160,160,105,112.5,115,115,205,227.5,232.5,232.5,507.5,1965
2,M,Greg Simmons #2,SBD,MR-M1b,66,Raw,,65.7,155,167.5,177.5,177.5,115,122.5,125,125,195,-207.5,,195,497.5,1969
1,M,Johnny May,SBD,MR-M1b,74,Raw,,73.8,-192.5,-192.5,192.5,192.5,155,160,162.5,162.5,207.5,210,215,215,570,1968
2,M,Keith Scisney,SBD,MR-M1b,74,Raw,,73.3,182.5,202.5,210,210,110,125,132.5,132.5,182.5,212.5,-227.5,212.5,555,
3,M,Michael Macri,SBD,MR-M1b,74,Raw,,71.8,-177.5,177.5,-187.5,177.5,85,90,-95,90,177.5,187.5,200,200,467.5,1969
1,M,Laddie Gibson,SBD,MR-M1b,83,Raw,,82.2,185,205,212.5,212.5,165,175,-180.5,175,230,245,260,260,647.5,1965
2,M,Donovan Thompson,SBD,MR-M1b,83,Raw,,82,175,205,210,210,142.5,160,162.5,162.5,182.5,222.5,230,230,602.5,1966
1,M,Troy Gibson,SBD,MR-M1b,93,Raw,,91.5,217.5,230,,230,165,172.5,177.5,177.5,255,265,275,275,682.5,1965
2,M,Chad Rexrode,SBD,MR-M1b,93,Raw,SSPT,88.7,205,217.5,227.5,227.5,155,162.5,-170,162.5,225,240,252.5,252.5,642.5,1968
3,M,Alvin Ueunten,SBD,MR-M1b,93,Raw,,90,192.5,205,217.5,217.5,147.5,160,-165,160,225,245,255,255,632.5,1969
4,M,Vic Fazio,SBD,MR-M1b,93,Raw,,91.9,165,192.5,-200,192.5,112.5,125,-130,125,200,220,-230,220,537.5,1962
5,M,Thomas Mazzotta,SBD,MR-M1b,93,Raw,,86.6,127.5,142.5,160,160,82.5,92.5,102.5,102.5,157.5,182.5,195,195,457.5,1967
1,M,Alvin Fritz,SBD,MR-M1b,105,Raw,,103.9,227.5,-245,245,245,160,-170,-170,160,230,247.5,-255,247.5,652.5,1968
2,M,Greg Titus,SBD,MR-M1b,105,Raw,,100.8,190,200,210,210,167.5,172.5,180,180,230,240,250,250,640,1966
3,M,Roy Andrew,SBD,MR-M1b,105,Raw,SSPT,101.6,195,207.5,-212.5,207.5,147.5,155,160,160,242.5,257.5,-272.5,257.5,625,1967
4,M,David Nix,SBD,MR-M1b,105,Raw,,104.6,200,212.5,222.5,222.5,142.5,147.5,150,150,200,220,-227.5,220,592.5,1968
1,M,Wesley Beach,SBD,MR-M1b,120,Raw,,114.2,227.5,240,-245,240,165,170,-172.5,170,275,285,295,295,705,1969
2,M,Randy Cairns,SBD,MR-M1b,120+,Raw,,124.3,235,252.5,265,265,-142.5,142.5,-147.5,142.5,252.5,262.5,270,270,677.5,1965
3,M,Carl Werda,SBD,MR-M1b,120+,Raw,,144,227.5,247.5,252.5,252.5,160,170,-180,170,240,245,250,250,672.5,1966
1,M,Gary Kaiser,SBD,MR-M2a,74,Raw,,73.3,142.5,,,142.5,130,137.5,-143,137.5,207.5,-227.5,,207.5,487.5,1960
1,M,Michael Willett,SBD,MR-M2a,83,Raw,,82.8,170,185,-192.5,185,120,130,-132.5,130,210,225,232.5,232.5,547.5,1962
2,M,Randy Haskett,SBD,MR-M2a,83,Raw,,78,132.5,-152.5,-152.5,132.5,95,-107.5,-107.5,95,175,182.5,192.5,192.5,420,1960
1,M,Russell Clark,SBD,MR-M2a,93,Raw,,91.4,197.5,210,217.5,217.5,125,-127.5,-127.5,125,227.5,245,262.5,262.5,605,1961
2,M,Douglas Ballard,SBD,MR-M2a,93,Raw,,91.1,187.5,200,210,210,112.5,120,127.5,127.5,215,232.5,-250,232.5,570,1963
1,M,Ennis White,SBD,MR-M2a,105,Raw,,104.2,205,212.5,-235,212.5,170,180,-187.5,180,242.5,247.5,257.5,257.5,650,1964
2,M,Austin Keanu,SBD,MR-M2a,105,Raw,,103.2,230,247.5,-252.5,247.5,150,-160,-160,150,205,227.5,-240,227.5,625,1961
1,M,Anthony Harris #1,SBD,MR-M2a,120,Raw,,113.8,285,307.5,320,320,165,180,187.5,187.5,295,307.5,325,325,832.5,1964
2,M,Lance Robbins,SBD,MR-M2a,120,Raw,Phoinix,111.8,182.5,205,-210,205,125,-135,-135,125,205,227.5,240,240,570,1963
3,M,Brett Robbins,SBD,MR-M2a,120,Raw,Phoinix,113.1,182.5,205,210,210,125,-137.5,-137.5,125,205,227.5,-237.5,227.5,562.5,1963
1,M,Thomas Montoya,SBD,MR-M2a,120+,Raw,,128.3,182.5,192.5,200,200,-130,130,-137.5,130,137.5,-182.5,,137.5,467.5,1964
1,M,Wayne David Herl,SBD,MR-M2b,83,Raw,,82.4,-170,170,177.5,177.5,110,115,120,120,215,222.5,227.5,227.5,525,
1,M,Scott Roberts,SBD,MR-M2b,93,Raw,RMLC,90.9,215,235,245,245,122.5,132.5,137.5,137.5,252.5,275,-285,275,657.5,1958
2,M,Jeff Monahos,SBD,MR-M2b,93,Raw,,89.6,187.5,202.5,-210,202.5,132.5,140,-145,140,200,215,227.5,227.5,570,1959
3,M,Chuck Akers,SBD,MR-M2b,93,Raw,,92.9,192.5,-205,205,205,120,125,-130,125,227.5,-240,-240,227.5,557.5,1959
4,M,Jeff Pagan,SBD,MR-M2b,93,Raw,,90.9,185,-190,-190,185,155,157.5,160,160,195,-197.5,,195,540,1957
5,M,Gary Grahn,SBD,MR-M2b,93,Raw,,91.7,140,-147.5,150,150,105,112.5,120,120,160,175,185,185,455,1955
1,M,Mark Robb,SBD,MR-M2b,105,Raw,SSPT,102.2,-250,265,-275,265,140,147.5,-152.5,147.5,275,,,275,687.5,1959
2,M,Doug Currence,SBD,MR-M2b,105,Raw,,105,232.5,250,-260,250,160,165,167.5,167.5,250,,,250,667.5,1959
3,M,Warren Dickerson,SBD,MR-M2b,105,Raw,,94.3,172.5,-185,-185,172.5,135,140,142.5,142.5,227.5,250,257,257,572,1955
4,M,Sergy Shadyun,SBD,MR-M2b,105,Raw,RMLC,104.8,190,210,-220,210,110,120,-130,120,190,-200,-200,190,520,1957
5,M,Jim Curley,SBD,MR-M2b,105,Raw,,99.5,100,127.5,145,145,100,105,-107.5,105,175,185,195,195,445,1955
DQ,M,Harold Lloyd,SBD,MR-M2b,105,Raw,SSPT,104.3,200,210,-215,210,110,115,-120,115,-222.5,-222.5,-222.5,,,1957
1,M,Joseph Marksteiner,SBD,MR-M3a,66,Raw,,65.7,142.5,157.5,167.5,167.5,82.5,85,90,90,140,155,170,170,427.5,1953
1,M,Bob Yamasaki,SBD,MR-M3a,74,Raw,,73.2,185,197.5,205,205,110,117.5,-122.5,117.5,210,227.5,-242.5,227.5,550,1952
2,M,Edgie Walrath,SBD,MR-M3a,74,Raw,,73.9,-90,90,,90,80,85,-87.5,85,107.5,115,125,125,300,1953
1,M,Daniel Swannigan,SBD,MR-M3a,83,Raw,,82,-85,-85,115,115,-110,115,-122.5,115,-205,-227.5,235,235,465,1953
2,M,John LaFlamme,SBD,MR-M3a,83,Raw,,82.4,132.5,147.5,152.5,152.5,85,92.5,95,95,195,-215,215,215,462.5,1950
3,M,Bill Clayton,SBD,MR-M3a,83,Raw,,78.8,155,-165,165,165,92.5,-100,-100,92.5,185,197.5,-205,197.5,455,1953
1,M,Claude Welcome,SBD,MR-M3a,93,Raw,,90.7,157.5,167.5,175,175,135,140,142.5,142.5,182.5,192.5,200,200,517.5,1951
2,M,Charles Gilmore,SBD,MR-M3a,93,Raw,,91.9,102.5,125,132.5,132.5,112.5,115,117.5,117.5,185,207.5,220.5,220.5,470.5,1952
3,M,Steve Harms,SBD,MR-M3a,93,Raw,,92.6,110,125,130,130,125,-130,-130,125,100,130,-145,130,385,1952
1,M,Floyd Givens,SBD,MR-M3a,105,Raw,,95.9,-150,150,180,180,-107.5,107.5,120,120,225,-242.5,257,257,557,1951
2,M,Al Wood,SBD,MR-M3a,105,Raw,,101.2,145,-155,-155,145,80,85,100,100,182.5,192.5,-202.5,192.5,437.5,
3,M,Charles King,SBD,MR-M3a,105,Raw,,95.4,95,105,110,110,110,120,125,125,140,155,160,160,395,1950
1,M,David Wolf,SBD,MR-M3a,120,Raw,,116.1,165,175,182.5,182.5,-125,125,130,130,205,215,222.5,222.5,535,1954
2,M,Frank Baja,SBD,MR-M3a,120,Raw,RMLC,108.3,162.5,177.5,185,185,92.5,97.5,100,100,192.5,202.5,210,210,495,1954
1,M,Alex Galant,SBD,MR-M3b,59,Raw,Titan,58.1,100,-115,-115,100,40,47.5,52.5,52.5,122.5,140,142.5,142.5,295,1947
DQ,M,Robert Humphreys,SBD,MR-M3b,74,Raw,,73.7,100,-110,-110,100,-80,-80,-80,,-140,,,,,1946
1,M,Jim Yakubovsky,SBD,MR-M3b,93,Raw,,91.4,160,167.5,182.5,182.5,75,82.5,-87.5,82.5,182.5,200,-255,200,465,1947
1,M,Stan Mingus,SBD,MR-M3b,105,Raw,,101.5,170,190,-200,190,145,160,-165,160,210,227.5,-235,227.5,577.5,1949
1,M,Crayton Taylor,SBD,MR-M3b,120,Raw,,113.2,-142.5,150,-160,150,100,-107.5,107.5,107.5,227.5,235,,235,492.5,1946
DQ,M,Rudy Stanko,SBD,MR-M3b,120,Raw,,106.8,-65,-65,65,65,145,-165,-165,145,-145,,,,,
1,M,Curtis Wainwright,SBD,MR-M3b,120+,Raw,,121.6,210,-220,-230,210,142.5,147.5,150,150,-225,225,237.5,237.5,597.5,1954
1,M,Robert Trujillo,SBD,MR-M4a,59,Raw,,58.6,100,-115,-115,100,75,80,-82.5,80,150,160,-162.5,160,340,1944
1,M,Sam Alduenda,SBD,MR-M4a,74,Raw,,73.3,115,140,-150,140,107.5,112.5,117.5,117.5,170,185,195,195,452.5,1942
1,M,Raymond Fougnier,SBD,MR-M4a,83,Raw,,81.6,120,-130,-130,120,80,-90,90,90,170,180,185,185,395,1943
2,M,Thomas Kalen,SBD,MR-M4a,83,Raw,,81.3,137.5,142.5,-150,142.5,97.5,-102.5,-102.5,97.5,137.5,145,152.5,152.5,392.5,1943
3,M,Jim Cushing-Murray,SBD,MR-M4a,83,Raw,,80.8,75,-85,-85,75,57.5,62.5,-65,62.5,82.5,-92.5,95,95,232.5,
1,M,Bobby Wischkowski,SBD,MR-M4a,93,Raw,,90.5,137.5,-142.5,,137.5,102.5,105,-107.5,105,167.5,177.5,-182.5,177.5,420,1943
1,M,Bill Helmich,SBD,MR-M4a,105,Raw,,104.4,102.5,,,102.5,100,,,100,165,,,165,367.5,1942
1,M,John Huestis,SBD,MR-M4a,120+,Raw,,126.1,110,127.5,137.5,137.5,87.5,-100,100,100,142.5,-167.5,167.5,167.5,405,1944
1,M,Frank Stamboolian Jr,SBD,MR-M4b,74,Raw,,73,100,120,122.5,122.5,85,-92.5,95,95,125,142.5,152.5,152.5,370,1938
1,M,Paul Predecki,SBD,MR-M4b,93,Raw,,88.8,107.5,117.5,127.5,127.5,-102.5,110,115,115,155,165,175,175,417.5,1938
2,M,Tom O'Keefe,SBD,MR-M4b,93,Raw,RMLC,89.4,110,120,122.5,122.5,82.5,87.5,90,90,150,162.5,165,165,377.5,1935
1,M,Charlie Doggett,SBD,MR-M5,93,Raw,,92.1,25,,,25,82.5,-87.5,87.5,87.5,65,,,65,177.5,
1,F,Emily Gardner,SBD,FR-T1,57,Raw,,55.6,85,95,102.5,102.5,55,60,65,65,82.5,90,97.5,97.5,265,2000
1,F,Robin Johnson,SBD,FR-T1,72,Raw,SSPT,70.9,115,122.5,130,130,65,-67.5,67.5,67.5,125,132.5,140,140,337.5,1998
2,F,Natalie Montoya,SBD,FR-T1,72,Raw,,65.7,70,77.5,85,85,52.5,57.5,58,58,-80,80,,80,223,1999
1,F,Katlin Nicole Reyes,SBD,FR-T2,43,Raw,,42.1,82.5,-87.5,87.5,87.5,42.5,45,-47.5,45,82.5,90,95,95,227.5,
1,F,Lydia Mele,SBD,FR-T2,72,Raw,,71.5,115,-122.5,-122.5,115,60,65,-67.5,65,130,137.5,-142.5,137.5,317.5,1998
2,F,Michelle Robbins,SBD,FR-T2,72,Raw,Phoinix,66.2,90,95,97.5,97.5,60,67.5,-70,67.5,137.5,145,-152.5,145,310,1997
3,F,Shelby Miles,SBD,FR-T2,72,Raw,,69.7,102.5,-110,110,110,60,65,-67.5,65,-125,125,-142.5,125,300,1998
1,F,Cipriana Castellano,SBD,FR-T2,84,Raw,SSPT,73.2,142.5,150,-157.5,150,75,80,-82.5,80,137.5,147.5,155,155,385,1997
2,F,Kaylie Butt,SBD,FR-T2,84,Raw,,78.6,-107.5,107.5,117.5,117.5,45,52.5,55,55,130,140,-150,140,312.5,1997
3,F,Richele Schulte,SBD,FR-T2,84,Raw,,83.3,82.5,90,97.5,97.5,52.5,57.5,-60,57.5,100,107.5,115,115,270,1997
4,F,Tracy Payne,SBD,FR-T2,84,Raw,,73.6,50,60,65,65,37.5,40,45,45,82.5,92.5,107.5,107.5,217.5,1998
1,F,Jessica Doyle,SBD,FR-T2,84+,Raw,,88.4,90,105,110,110,45,50,55,55,120,127.5,-132.5,127.5,292.5,1996
1,F,Courtney Childress,SBD,FR-T3,52,Raw,,51.5,67.5,75,-82.5,75,42.5,47.5,-52.5,47.5,112.5,122.5,-132.5,122.5,245,
1,F,Darian Lendermon,SBD,FR-T3,57,Raw,,54.7,102.5,105,110,110,60,65,-72.5,65,117.5,122.5,132.5,132.5,307.5,1994
1,F,Gina Hensley,SBD,FR-T3,63,Raw,,62.7,110,120,125,125,60,-65,-65,60,155,160,-165,160,345,1995
2,F,Mary E Clark,SBD,FR-T3,63,Raw,,58.8,80,87.5,90,90,60,62.5,65,65,125,142.5,-157.5,142.5,297.5,
DQ,F,Rachel Orosz,SBD,FR-T3,63,Raw,,62.2,90,95,100,100,45,50,52.5,52.5,-135,-135,-135,,,
1,F,Klarissa Kobernusz,SBD,FR-T3,72,Raw,,65.3,102.5,110,-115,110,-47.5,-52.5,52.5,52.5,140,147.5,-152.5,147.5,310,
1,F,Ella Lowenberg,SBD,FR-T3,84,Raw,,82.9,-90,-90,90,90,52.5,55,57.5,57.5,115,120,-125,120,267.5,
1,F,Sylvia Vanden Heuvel,SBD,FR-T3,84+,Raw,,85.2,82.5,102.5,-120,102.5,52.5,57.5,60,60,102.5,122.5,-137.5,122.5,285,1995
1,F,Ashley Will,SBD,FR-Jr,52,Raw,,51.8,102.5,-107.5,-107.5,102.5,42.5,45,47.5,47.5,105,110,-112.5,110,260,1994
2,F,Shelby Sweat,SBD,FR-Jr,52,Raw,,50.3,67.5,80,-85,80,40,-45,-45,40,95,102.5,110,110,230,1991
1,F,Laura McGuill,SBD,FR-Jr,57,Raw,,56.3,112.5,120,125,125,52.5,57.5,62.5,62.5,140,150,-155,150,337.5,1991
2,F,Elaine Wang,SBD,FR-Jr,57,Raw,,56.9,100,110,-117.5,110,55,60,-65,60,-120,120,132.5,132.5,302.5,1991
3,F,Carol Champion,SBD,FR-Jr,57,Raw,,56,-67.5,70,77.5,77.5,50,-55,-55,50,100,110,117.5,117.5,245,1993
1,F,Alice Zheng,SBD,FR-Jr,63,Raw,,62.7,125,130,-135.5,130,-62.5,62.5,70,70,142.5,150,-170,150,350,1992
2,F,Erin Stevenson,SBD,FR-Jr,63,Raw,,61.7,120,127.5,-132.5,127.5,75,-82.5,-82.5,75,125,137.5,145,145,347.5,1993
3,F,Leanna Carr,SBD,FR-Jr,63,Raw,,62.5,127.5,135,-140,135,60,62.5,-65,62.5,137.5,150,-160,150,347.5,1991
4,F,Ewa Januszkiewicz,SBD,FR-Jr,63,Raw,,61.2,97.5,107.5,115,115,55,60,62.5,62.5,142.5,152.5,162.5,162.5,340,1991
5,F,Chelsea Karabin,SBD,FR-Jr,63,Raw,,62.2,-95,97.5,-102.5,97.5,62.5,65,-70,65,112.5,122.5,-125,122.5,285,1993
1,F,Mikelina Belaineh,SBD,FR-Jr,72,Raw,SSPT,70.3,140,150,155,155,80,82.5,85,85,175,187.5,-192.5,187.5,427.5,1991
2,F,Tiffany Wohlers,SBD,FR-Jr,72,Raw,,72,137.5,142.5,150,150,80,85,-90,85,-175,175,185,185,420,
3,F,Chelsea Savit,SBD,FR-Jr,72,Raw,,70.4,135,148,152.5,152.5,85,92.5,95,95,155,170,-182.5,170,417.5,1991
4,F,Haley Kavelak,SBD,FR-Jr,72,Raw,,68.6,117.5,132.5,142.5,142.5,70,77.5,-82.5,77.5,152.5,170,,170,390,1990
5,F,Hannah Ghindea,SBD,FR-Jr,72,Raw,,68.3,100,107.5,-115,107.5,57.5,62.5,65,65,137.5,150,157.5,157.5,330,1992
6,F,Alex Ballard,SBD,FR-Jr,72,Raw,,68.5,125,-130,130,130,50,55,60,60,140,-150,-150,140,330,1990
7,F,Lauren Shortell,SBD,FR-Jr,72,Raw,,64.9,72.5,80,85,85,52.5,57.5,60,60,120,132.5,140,140,285,1991
1,F,Stephanie Mahan,SBD,FR-Jr,84,Raw,SSPT,83.6,127.5,137.5,-142.5,137.5,65,70,75,75,137.5,147.5,157.5,157.5,370,1992
2,F,Jenny Nocas,SBD,FR-Jr,84,Raw,SSPT,79.5,117.5,125,-132.5,125,72.5,77.5,80,80,135,145,155,155,360,1993
1,F,Katlin Nicole Reyes,SBD,FR-O,43,Raw,,42.1,82.5,-87.5,87.5,87.5,42.5,45,-47.5,45,82.5,90,95,95,227.5,
2,F,Kelli Lowenburg,SBD,FR-O,43,Raw,,42.9,65,70,-75,70,30,-32.5,,30,100,105,107.5,107.5,207.5,
1,F,Joanna Welsh,SBD,FR-O,47,Raw,SSPT,46.4,85,92.5,95,95,55,-57.5,57.5,57.5,125,132.5,-137.5,132.5,285,1972
2,F,Colleen McNamara,SBD,FR-O,47,Raw,SSPT,46.7,90,95,-100,95,52.5,57.5,62.5,62.5,102.5,110,-117.5,110,267.5,1981
3,F,Shyami Murphy,SBD,FR-O,47,Raw,,45.8,80,-85,85,85,40,42.5,-45,42.5,92.5,-97.5,97.5,97.5,225,1966
1,F,Suzanne Hartwig-Gary,SBD,FR-O,52,Raw,SSPT,51.6,132.5,142.5,147.5,147.5,67.5,72.5,-77.5,72.5,135,145,155,155,375,1968
2,F,Marisa Inda,SBD,FR-O,52,Raw,,50.6,122.5,127.5,132.5,132.5,75,80,-82.5,80,145,155,160,160,372.5,1976
3,F,Michelle McHugh,SBD,FR-O,52,Raw,RMLC,51.3,95,102.5,110,110,52.5,62.5,-72.5,62.5,100,105,110,110,282.5,1984
4,F,Courtney Childress,SBD,FR-O,52,Raw,,51.5,67.5,75,-82.5,75,42.5,47.5,-52.5,47.5,112.5,122.5,-132.5,122.5,245,
5,F,Shelby Sweat,SBD,FR-O,52,Raw,,50.3,67.5,80,-85,80,40,-45,-45,40,95,102.5,110,110,230,1991
1,F,Lodrina Cherne,SBD,FR-O,57,Raw,,55.8,-115,120,-125,120,67.5,70,72.5,72.5,147.5,155,-160,155,347.5,1982
2,F,Alyssa Haveson,SBD,FR-O,57,Raw,,55.6,107.5,117.5,120,120,62.5,67.5,72.5,72.5,142.5,152.5,-157.5,152.5,345,1988
3,F,Laura McGuill,SBD,FR-O,57,Raw,,56.3,112.5,120,125,125,52.5,57.5,62.5,62.5,140,150,-155,150,337.5,1991
4,F,Lynne Homan,SBD,FR-O,57,Raw,,56.8,90,97.5,105,105,70,75,-80,75,135,142.5,145,145,325,1962
5,F,Antoinette Kemper,SBD,FR-O,57,Raw,,55,107.5,117.5,120,120,72.5,75,-77.5,75,120,127.5,-132.5,127.5,322.5,1964
6,F,Melissa Hunt,SBD,FR-O,57,Raw,,55.2,100,107.5,-110,107.5,60,62.5,65,65,122.5,-132.5,132.5,132.5,305,
7,F,Camilla Jones,SBD,FR-O,57,Raw,,54.4,87.5,-92.5,92.5,92.5,60,62.5,65,65,132.5,140,-150,140,297.5,1985
8,F,Daniele Sacks,SBD,FR-O,57,Raw,,56.9,82.5,90,92.5,92.5,55,-60,60,60,122.5,130,-132.5,130,282.5,
9,F,Shannan D'Annunzio,SBD,FR-O,57,Raw,,56.5,75,85,-90,85,55,-60,60,60,105,117.5,122.5,122.5,267.5,1971
10,F,Theresa Ball,SBD,FR-O,57,Raw,,55.7,77.5,82.5,87.5,87.5,47.5,50,52.5,52.5,102.5,110,112.5,112.5,252.5,1973
11,F,Heather Hoff,SBD,FR-O,57,Raw,,56.3,107.5,-115,117.5,117.5,52.5,55,57.5,57.5,65,70,75,75,250,1989
DQ,F,Rhonda Winterhalter,SBD,FR-O,57,Raw,,55.6,-80,-80,-80,,45,-50,-50,45,-85,85,90,90,,1972
1,F,Jennifer Thompson #1,SBD,FR-O,63,Raw,,61.5,130,142.5,-147.5,142.5,125,137.5,140,140,160,190,202.5,202.5,485,1973
2,F,Meghan Pellatt,SBD,FR-O,63,Raw,,62.7,127.5,135,140,140,-75,77.5,80,80,-170,172.5,185,185,405,1984
3,F,Kristen Dunsmore,SBD,FR-O,63,Raw,,62.1,132.5,142.5,150,150,80,-85,-85,80,152.5,162.5,172.5,172.5,402.5,1989
4,F,Leanna Carr,SBD,FR-O,63,Raw,,62.5,127.5,135,-140,135,60,62.5,-65,62.5,137.5,150,-160,150,347.5,1991
5,F,Gina Hensley,SBD,FR-O,63,Raw,,62.7,110,120,125,125,60,-65,-65,60,155,160,-165,160,345,1995
6,F,Dicy Saylor,SBD,FR-O,63,Raw,,62.5,117.5,132.5,137.5,137.5,57.5,62.5,65,65,115,127.5,140,140,342.5,1988
7,F,Sara Egbom,SBD,FR-O,63,Raw,,59.2,110,115,120,120,60,62.5,65,65,140,147.5,155,155,340,1988
8,F,Ewa Januszkiewicz,SBD,FR-O,63,Raw,,61.2,97.5,107.5,115,115,55,60,62.5,62.5,142.5,152.5,162.5,162.5,340,1991
9,F,April White,SBD,FR-O,63,Raw,,63,115,127.5,-132.5,127.5,65,70,-72.5,70,127.5,135,-157.5,135,332.5,1983
10,F,Kelsea Koenreich,SBD,FR-O,63,Raw,,60.6,107.5,112.5,115,115,60,-62.5,-62.5,60,147.5,155,-160,155,330,1987
11,F,Zoe Ubaldo,SBD,FR-O,63,Raw,,62.3,122.5,-130,-130,122.5,-60,60,65,65,137.5,-142.5,-142.5,137.5,325,1988
12,F,Barbara Lee #1,SBD,FR-O,63,Raw,,62.4,107.5,115,120,120,55,62.5,-67.5,62.5,127.5,137.5,-145,137.5,320,1982
13,F,Jessica Cloud,SBD,FR-O,63,Raw,,62.4,87.5,95,-100,95,42.5,47.5,50,50,127.5,140,142.5,142.5,287.5,1983
14,F,Chelsea Karabin,SBD,FR-O,63,Raw,,62.2,-95,97.5,-102.5,97.5,62.5,65,-70,65,112.5,122.5,-125,122.5,285,1993
15,F,Rachel Warpeha,SBD,FR-O,63,Raw,,59.3,87.5,92.5,95,95,62.5,65,67.5,67.5,92.5,105,112.5,112.5,275,1984
DQ,F,Rachel Orosz,SBD,FR-O,63,Raw,,62.2,90,95,100,100,45,50,52.5,52.5,-135,-135,-135,,,
1,F,Kimberly Walford,SBD,FR-O,72,Raw,,66.5,160,170,180,180,100,105,107.5,107.5,-215,215,-233,215,502.5,1978
2,F,Mikelina Belaineh,SBD,FR-O,72,Raw,SSPT,70.3,140,150,155,155,80,82.5,85,85,175,187.5,-192.5,187.5,427.5,1991
3,F,Tiffany Wohlers,SBD,FR-O,72,Raw,,72,137.5,142.5,150,150,80,85,-90,85,-175,175,185,185,420,
4,F,Chelsea Savit,SBD,FR-O,72,Raw,,70.4,135,148,152.5,152.5,85,92.5,95,95,155,170,-182.5,170,417.5,1991
5,F,Rori Alter,SBD,FR-O,72,Raw,,69.1,130,135,140,140,82.5,87.5,90,90,170,180,182.5,182.5,412.5,1987
6,F,Erin Walterman,SBD,FR-O,72,Raw,,67.2,120,130,-137.5,130,77.5,87.5,-97.5,87.5,150,165,177.5,177.5,395,1982
7,F,Sheryl Condon,SBD,FR-O,72,Raw,SSPT,71.8,122.5,130,137.5,137.5,70,75,80,80,157.5,167.5,175,175,392.5,1972
8,F,Haley Kavelak,SBD,FR-O,72,Raw,,68.6,117.5,132.5,142.5,142.5,70,77.5,-82.5,77.5,152.5,170,,170,390,1990
9,F,Angela Bivens,SBD,FR-O,72,Raw,Goggins Force,71.6,132.5,-142.5,-145,132.5,67.5,72.5,77.5,77.5,155,172.5,-190.5,172.5,382.5,1980
10,F,Jaclyn Galligan,SBD,FR-O,72,Raw,,70,127.5,137.5,142.5,142.5,67.5,77.5,-85,77.5,-140,140,152.5,152.5,372.5,1983
11,F,Diana Lwanga,SBD,FR-O,72,Raw,,70.5,115,130,-137.5,130,62.5,70,-75,70,160,172.5,-185,172.5,372.5,1982
12,F,Jennifer Kroken,SBD,FR-O,72,Raw,,71,122.5,137.5,142.5,142.5,67.5,75,77.5,77.5,132.5,147.5,-155,147.5,367.5,1974
13,F,Chrissy Schaefer,SBD,FR-O,72,Raw,RMLC,71.2,127.5,135,-137.5,135,72.5,-77.5,-77.5,72.5,150,155,-160,155,362.5,1984
14,F,Katie Ford,SBD,FR-O,72,Raw,,71.3,122.5,-130,-130,122.5,77.5,82.5,-87.5,82.5,145,155,-165,155,360,
15,F,Amy Welcome,SBD,FR-O,72,Raw,,69.7,117.5,127.5,-130,127.5,65,67.5,-70,67.5,145,157.5,-165,157.5,352.5,1986
16,F,Amy Tomasko,SBD,FR-O,72,Raw,,63.4,122.5,132.5,137.5,137.5,62.5,67.5,-70,67.5,130,140,145,145,350,1988
17,F,Jennifer Varner,SBD,FR-O,72,Raw,,68.9,122.5,132.5,-137.5,132.5,60,65,-70,65,140,147.5,152.5,152.5,350,1983
18,F,Jessica Evans #2,SBD,FR-O,72,Raw,,67.4,125,135,-142.5,135,57.5,62.5,65,65,130,140,-145,140,340,1987
19,F,Robin Johnson,SBD,FR-O,72,Raw,SSPT,70.9,115,122.5,130,130,65,-67.5,67.5,67.5,125,132.5,140,140,337.5,1998
20,F,Dana Singleton,SBD,FR-O,72,Raw,,66.8,100,-115,120,120,57.5,62.5,-70,62.5,142.5,152.5,-160,152.5,335,1975
21,F,Hannah Ghindea,SBD,FR-O,72,Raw,,68.3,100,107.5,-115,107.5,57.5,62.5,65,65,137.5,150,157.5,157.5,330,1992
22,F,Kelly Miller,SBD,FR-O,72,Raw,,70.4,107.5,112.5,117.5,117.5,62.5,67.5,70,70,130,137.5,142.5,142.5,330,1982
23,F,Elizabeth Anderson,SBD,FR-O,72,Raw,,69.7,92.5,100,105,105,50,-52.5,-52.5,50,130,140,150,150,305,
24,F,Caylen Coxall,SBD,FR-O,72,Raw,RMLC,70.8,107.5,115,122.5,122.5,62.5,-67.5,-67.5,62.5,110,120,-125,120,305,1988
25,F,Lauren Shortell,SBD,FR-O,72,Raw,,64.9,72.5,80,85,85,52.5,57.5,60,60,120,132.5,140,140,285,1991
DQ,F,Jessica Bryant,SBD,FR-O,72,Raw,,69.6,-150,-150,-150,,85,90,-92.5,90,182.5,190,-195,190,,1987
1,F,Sebrina Davis,SBD,FR-O,84,Raw,,75.2,165,-177.5,180,180,85,95,,95,192.5,202.5,210,210,485,1970
2,F,Alicia Webb,SBD,FR-O,84,Raw,,81.8,182.5,-192.5,-192.5,182.5,85,92.5,97.5,97.5,180,185,190,190,470,1971
3,F,Natalie Hanson,SBD,FR-O,84,Raw,Bell Power Systems,81.3,160,167.5,175,175,90,95,-100,95,-172.5,-182.5,182.5,182.5,452.5,1990
4,F,Rachel Gibson,SBD,FR-O,84,Raw,,81.5,170,180,182.5,182.5,75,77.5,-80,77.5,170,-175,180,180,440,1988
5,F,Shana White,SBD,FR-O,84,Raw,Goggins Force,83,150,160,167.5,167.5,85,90,-95,90,182.5,-205,-205,182.5,440,1978
6,F,Meagan Pollock,SBD,FR-O,84,Raw,,80.9,135,145,152.5,152.5,85,90,92.5,92.5,147.5,162.5,170,170,415,1982
7,F,Amanda Carroll,SBD,FR-O,84,Raw,SSPT,84,140,150,-160,150,67.5,72.5,-77.5,72.5,150,160,165,165,387.5,1980
8,F,Cipriana Castellano,SBD,FR-O,84,Raw,SSPT,73.2,142.5,150,-157.5,150,75,80,-82.5,80,137.5,147.5,155,155,385,1997
9,F,Debbie Zeigler,SBD,FR-O,84,Raw,,80.3,135,142.5,150,150,82.5,87.5,-92.5,87.5,127.5,137.5,-147.5,137.5,375,1985
10,F,Laurie MacDonald,SBD,FR-O,84,Raw,,75.4,107.5,117.5,125,125,67.5,75,-80,75,132.5,145,150,150,350,1962
11,F,Lana Zellner,SBD,FR-O,84,Raw,SSPT,75.4,110,115,117.5,117.5,50,52.5,55,55,125,135,140,140,312.5,1985
12,F,Qudsiah Khan,SBD,FR-O,84,Raw,Phoinix,79,95,102.5,105,105,52.5,57.5,-62.5,57.5,115,122.5,135,135,297.5,1982
1,F,Bonica Brown,SBD,FR-O,84+,Raw,,128.4,220,232.5,242.5,242.5,115,127.5,140,140,192.5,215,227.5,227.5,610,1988
2,F,Rebecca Holcomb,SBD,FR-O,84+,Raw,SSPT,145,165,175,185,185,82.5,87.5,92.5,92.5,205,217.5,227.5,227.5,505,1987
3,F,Melissa Copeland,SBD,FR-O,84+,Raw,SSPT,115.1,185,195,-205,195,97.5,105,-107.5,105,182.5,192.5,-200,192.5,492.5,1977
4,F,Casey Fonoti,SBD,FR-O,84+,Raw,SSPT,129.5,-165,-165,165,165,85,92.5,100,100,190,-202.5,-202.5,190,455,1987
5,F,Michelle Fayant,SBD,FR-O,84+,Raw,,99,140,-152.5,157.5,157.5,95,102.5,105,105,170,182.5,190,190,452.5,1964
6,F,Elizabeth Flinner,SBD,FR-O,84+,Raw,,107,152.5,-162.5,162.5,162.5,82.5,-87.5,-87.5,82.5,152.5,170,-185,170,415,1989
7,F,Rachel Goldman,SBD,FR-O,84+,Raw,Phoinix,98.7,125,145,160,160,80,87.5,-92.5,87.5,125,150,160,160,407.5,
8,F,Courtney Lynch,SBD,FR-O,84+,Raw,,116.2,145,150,152.5,152.5,70,-75,75,75,160,172.5,177.5,177.5,405,1986
9,F,Amanda Jonnala,SBD,FR-O,84+,Raw,Goggins Force,120.7,-112.5,125,142.5,142.5,72.5,77.5,82.5,82.5,142.5,157.5,-167.5,157.5,382.5,1976
10,F,Alexis Dowling,SBD,FR-O,84+,Raw,,107,-135,137.5,-142.5,137.5,72.5,75,-77.5,75,155,162.5,-167.5,162.5,375,1985
11,F,Jerriann Doll,SBD,FR-O,84+,Raw,,94.3,85,95,105,105,82.5,90,-92.5,90,142.5,162.5,-165,162.5,357.5,
12,F,Michelle Grapel,SBD,FR-O,84+,Raw,SSPT,91.2,110,-112.5,-112.5,110,-60,62.5,65,65,127.5,135,137.5,137.5,312.5,1981
DQ,F,Rose Scotello,SBD,FR-Y1,43,Raw,,33.9,-25,-25,-25,,15,-17.5,17.5,17.5,30,35,40,40,,2004
1,F,Hannah Dolin,SBD,FR-Y1,57,Raw,,56.1,42.5,50,57.5,57.5,30,37.5,-45,37.5,67.5,75,82.5,82.5,177.5,2000
1,F,Kelli Lowenburg,SBD,FR-M1a,43,Raw,,42.9,65,70,-75,70,30,-32.5,,30,100,105,107.5,107.5,207.5,
1,F,Joanna Welsh,SBD,FR-M1a,47,Raw,SSPT,46.4,85,92.5,95,95,55,-57.5,57.5,57.5,125,132.5,-137.5,132.5,285,1972
1,F,Shannan D'Annunzio,SBD,FR-M1a,57,Raw,,56.5,75,85,-90,85,55,-60,60,60,105,117.5,122.5,122.5,267.5,1971
2,F,Theresa Ball,SBD,FR-M1a,57,Raw,,55.7,77.5,82.5,87.5,87.5,47.5,50,52.5,52.5,102.5,110,112.5,112.5,252.5,1973
DQ,F,Rhonda Winterhalter,SBD,FR-M1a,57,Raw,,55.6,-80,-80,-80,,45,-50,-50,45,-85,85,90,90,,1972
1,F,Jennifer Thompson #1,SBD,FR-M1a,63,Raw,,61.5,130,142.5,-147.5,142.5,125,137.5,140,140,160,190,202.5,202.5,485,1973
2,F,Carrie Merscham,SBD,FR-M1a,63,Raw,,60.9,67.5,72.5,77.5,77.5,40,42.5,45,45,85,92.5,100,100,222.5,1971
1,F,Priscilla Ribic,SBD,FR-M1a,72,Raw,,71.8,150,,,150,100,,,100,182.5,,,182.5,432.5,1972
2,F,Sheryl Condon,SBD,FR-M1a,72,Raw,SSPT,71.8,122.5,130,137.5,137.5,70,75,80,80,157.5,167.5,175,175,392.5,1972
3,F,Jennifer Kroken,SBD,FR-M1a,72,Raw,,71,122.5,137.5,142.5,142.5,67.5,75,77.5,77.5,132.5,147.5,-155,147.5,367.5,1974
4,F,Theresa Willis,SBD,FR-M1a,72,Raw,,64.1,90,97.5,102.5,102.5,50,55,-57.5,55,125,132.5,-140,132.5,290,1970
5,F,Beth Zellen,SBD,FR-M1a,72,Raw,,71.2,82.5,-87.5,-87.5,82.5,57.5,62.5,-67.5,62.5,120,127.5,135,135,280,1973
1,F,Sebrina Davis,SBD,FR-M1a,84,Raw,,75.2,165,-177.5,180,180,85,95,,95,192.5,202.5,210,210,485,1970
2,F,Alicia Webb,SBD,FR-M1a,84,Raw,,81.8,182.5,-192.5,-192.5,182.5,85,92.5,97.5,97.5,180,185,190,190,470,1971
1,F,Gena Doyle,SBD,FR-M1a,84+,Raw,,93,90,102.5,110,110,42.5,47.5,-52.5,47.5,120,130,140,140,297.5,1973
1,F,Shyami Murphy,SBD,FR-M1b,47,Raw,,45.8,80,-85,85,85,40,42.5,-45,42.5,92.5,-97.5,97.5,97.5,225,1966
1,F,Suzanne Hartwig-Gary,SBD,FR-M1b,52,Raw,SSPT,51.6,132.5,142.5,147.5,147.5,67.5,72.5,-77.5,72.5,135,145,155,155,375,1968
1,F,Danna Snow,SBD,FR-M1b,57,Raw,,56,85,90,92.5,92.5,67.5,72.5,-77.5,72.5,120,127.5,-135,127.5,292.5,1969
2,F,Cathy Mele,SBD,FR-M1b,57,Raw,,56.2,70,77.5,-82.5,77.5,52.5,55,-57.5,55,117.5,132.5,140.5,140.5,273,1966
1,F,Christine Hamp,SBD,FR-M1b,63,Raw,,61.3,100,107.5,112.5,112.5,70,-75,-77.5,70,117.5,122.5,137.5,137.5,320,1967
2,F,Joy Burg,SBD,FR-M1b,63,Raw,,58.4,90,-95,-95,90,50,52.5,55,55,120,127.5,-132.5,127.5,272.5,1965
1,F,Melissa Benson,SBD,FR-M1b,72,Raw,,71.7,77.5,-85,85,85,50,52.5,-55,52.5,85,90,102.5,102.5,240,1968
2,F,Cathy Belben,SBD,FR-M1b,72,Raw,Phoinix,65.2,62.5,-65,67.5,67.5,47.5,52.5,57.5,57.5,-92.5,92.5,100,100,225,1967
1,F,Tina Robinson,SBD,FR-M1b,84,Raw,,80.6,145,152.5,-160,152.5,102.5,107.5,112.5,112.5,160,170,182.5,182.5,447.5,1967
2,F,Heidi Ziegle,SBD,FR-M1b,84,Raw,Goggins Force (ALT),83.6,102.5,112.5,-120,112.5,65,70,-72.5,70,110,117.5,125,125,307.5,
1,F,Jerriann Doll,SBD,FR-M1b,84+,Raw,,94.3,85,95,105,105,82.5,90,-92.5,90,142.5,162.5,-165,162.5,357.5,
2,F,Carmen Hays,SBD,FR-M1b,84+,Raw,,97.9,75,80,87.5,87.5,52.5,55,-60,55,115,125,137.5,137.5,280,1968
1,F,Lynne Homan,SBD,FR-M2a,57,Raw,,56.8,90,97.5,105,105,70,75,-80,75,135,142.5,145,145,325,1962
2,F,Antoinette Kemper,SBD,FR-M2a,57,Raw,,55,107.5,117.5,120,120,72.5,75,-77.5,75,120,127.5,-132.5,127.5,322.5,1964
3,F,Rhonda Jones,SBD,FR-M2a,57,Raw,,54.7,70,-77.5,-77.5,70,42.5,45,-47.5,45,100,,,100,215,1964
1,F,Joanne Craig,SBD,FR-M2a,63,Raw,,62.5,107.5,117.5,122.5,122.5,57.5,60,-62.5,60,117.5,127.5,-135.5,127.5,310,1961
1,F,Donna Marts,SBD,FR-M2a,72,Raw,SSPT,70.4,105,112.5,117.5,117.5,70,75,80,80,130,140,147.5,147.5,345,1960
1,F,Laurie MacDonald,SBD,FR-M2a,84,Raw,,75.4,107.5,117.5,125,125,67.5,75,-80,75,132.5,145,150,150,350,1962
2,F,Patricia Nunziati,SBD,FR-M2a,84,Raw,,78.7,80,87.5,-95,87.5,57.5,-62.5,62.5,62.5,100,112.5,120,120,270,1964
3,F,Jeannine Cascadden,SBD,FR-M2a,84,Raw,SSPT,82.9,85,90,-97.5,90,60,65,-70,65,105,-110,-110,105,260,1963
4,F,Kim Meyer-Lee,SBD,FR-M2a,84,Raw,,77.9,72.5,77.5,82.5,82.5,60,62.5,65,65,90,95,100,100,247.5,1960
5,F,Stephany Wilken,SBD,FR-M2a,84,Raw,,80.9,-60,60,-67.5,60,42.5,47.5,-52.5,47.5,115,-120,120,120,227.5,1961
1,F,Michelle Fayant,SBD,FR-M2a,84+,Raw,,99,140,-152.5,157.5,157.5,95,102.5,105,105,170,182.5,190,190,452.5,1964
1,F,Cathleen Marksteiner,SBD,FR-M2b,63,Raw,,62.3,100,107.5,110,110,67.5,72.5,77.5,77.5,115,125,130,130,317.5,1958
2,F,Lisa McAdams,SBD,FR-M2b,63,Raw,,62.6,102.5,110,112.5,112.5,55,-57.5,-57.5,55,135,-147.5,-147.5,135,302.5,1958
3,F,Judith Drenth,SBD,FR-M2b,63,Raw,,61.5,85,92.5,-97.5,92.5,57.5,62.5,65,65,122.5,130,137.5,137.5,295,
DQ,F,Carol Mielke,SBD,FR-M2b,72,Raw,,70.5,-92.5,-97.5,-97.5,,57.5,60,-65,60,120,127.5,-132.5,127.5,,1958
1,F,Diane Kuhn,SBD,FR-M2b,84,Raw,,80.8,95,107.5,110,110,55,60,-62.5,60,127.5,137.5,-142.5,137.5,307.5,1958
1,F,Morgan Kent,SBD,FR-Y2,47,Raw,,45.7,60,67.5,70,70,27.5,32.5,35,35,60,67.5,72.5,72.5,177.5,2002
2,F,Kaylie Ball,SBD,FR-Y2,47,Raw,SSPT,46.4,37.5,42.5,47.5,47.5,25,27.5,-30,27.5,67.5,72.5,77.5,77.5,152.5,2001
1,F,Jane Freeman,SBD,FR-M3a,72,Raw,,70,47.5,55,60,60,37.5,42.5,-45,42.5,75,85,-90,85,187.5,1954
1,F,Carol Dorsey,SBD,FR-M3b,57,Raw,,56,50,-52.5,52.5,52.5,35,-37.5,37.5,37.5,80,85,87.5,87.5,177.5,1947
1,F,Helen White,SBD,FR-M3b,63,Raw,,60.4,80,85,-90,85,57.5,60,62.5,62.5,110,120,122.5,122.5,270,1945
2,F,Leslie Macko,SBD,FR-M3b,63,Raw,,61.3,52.5,60,-65,60,32.5,37.5,40,40,80,87.5,-95,87.5,187.5,1949
1,F,Gail Moore,SBD,FR-M3b,72,Raw,,71.2,85,95,100,100,62.5,67.5,-70,67.5,107.5,120,125,125,292.5,1947
1,F,Pat Kroken,SBD,FR-M3b,84,Raw,,82.9,75,-85,85,85,30,,,30,97.5,102.5,105,105,220,1947
1,F,Bebe Burns,SBD,FR-M4a,52,Raw,,50.6,42.5,52.5,-55,52.5,32.5,37.5,-40,37.5,60,70,75,75,165,1942
1,F,Regina Hackney,SBD,FR-M4b,84,Raw,Phoinix,82.4,70,75,80,80,45,47.5,-50,47.5,115,120,125,125,252.5,1939
6,M,Eric Harper,SBD,MR-O,120+,Raw,SSPT,136.4,280,297.5,310,310,202.5,212.5,222.5,222.5,-240,240,250,250,782.5,1966
1,M,Eric Harper,SBD,MR-M1b,120+,Raw,SSPT,136.4,280,297.5,310,310,202.5,212.5,222.5,222.5,-240,240,250,250,782.5,1966
