Division,WeightClassKg,Place,Name,Team,BodyweightKg,Best3SquatKg,Best3BenchKg,Best3DeadliftKg,TotalKg,Equipment,Event,Sex
Girls,44.23,1,Maya Higginbotham,Wylie,43.14,99.79,49.9,104.33,254.01,Single-ply,SBD,F
Girls,44.23,2,Ellie Farmer,Wylie,42.05,52.16,29.48,45.36,127.01,Single-ply,SBD,F
Girls,47.85,1,Lindsey Markcum,Princeton,46.54,79.38,45.36,97.52,222.26,Single-ply,SBD,F
Girls,47.85,2,Skyler Blodgett,Wylie East,45,70.31,27.22,79.38,176.9,Single-ply,SBD,F
Girls,51.94,1,Sonni Gehring,Wylie,51.03,117.93,58.97,111.13,288.03,Single-ply,SBD,F
Girls,51.94,2,Jenny Tagle,Wylie,50.76,106.59,52.16,122.47,281.23,Single-ply,SBD,F
Girls,51.94,3,Tia Gilliam,Wylie,48.53,58.97,38.56,92.99,190.51,Single-ply,SBD,F
Girls,51.94,DQ,Allyson Hathaway,Wylie,51.44,,,,,Single-ply,SBD,F
Girls,51.94,DQ,Cecelia Allen,Wylie,49.31,,,,,Single-ply,SBD,F
Girls,56.02,1,Bernabeth Beason,Wylie,53.8,136.08,72.57,124.74,333.39,Single-ply,SBD,F
Girls,56.02,2,Giovanna Valdez,Wylie,54.88,117.93,74.84,127.01,319.78,Single-ply,SBD,F
Girls,56.02,3,Cristina Sanchez,Wylie,55.07,124.74,56.7,138.35,319.78,Single-ply,SBD,F
Girls,56.02,4,Tiffani Boon,Princeton,55.66,104.33,49.9,106.59,260.82,Single-ply,SBD,F
Girls,56.02,5,Daviona Amos,Princeton,53.02,95.25,54.43,108.86,258.55,Single-ply,SBD,F
Girls,56.02,6,Mercy Nwaege,Wylie,53.48,83.91,47.63,90.72,222.26,Single-ply,SBD,F
Girls,56.02,7,Tracey Perkins-Crabtree,Wylie,54.43,88.45,45.36,81.65,215.46,Single-ply,SBD,F
Girls,56.02,8,Mason Wilson,Wylie East,53.84,70.31,40.82,99.79,210.92,Single-ply,SBD,F
Girls,56.02,DQ,Charlotte Mosby,Wylie,55.25,,,,,Single-ply,SBD,F
Girls,60.1,1,Hannah Saldivar,Wylie,57.7,129.27,74.84,140.61,344.73,Single-ply,SBD,F
Girls,60.1,2,Jane Onuoha,Bishop Lynch,59.15,124.74,49.9,142.88,317.51,Single-ply,SBD,F
Girls,60.1,3,Victoria Bell,Wylie,59.51,92.99,54.43,113.4,260.82,Single-ply,SBD,F
Girls,60.1,4,Ashlyn Westhora,Wylie,58.97,92.99,45.36,111.13,249.48,Single-ply,SBD,F
Girls,60.1,5,Angela Alcocer,Princeton,56.93,86.18,54.43,106.59,247.21,Single-ply,SBD,F
Girls,60.1,6,Emily Flatt,Princeton,57.24,90.72,61.23,90.72,242.67,Single-ply,SBD,F
Girls,60.1,7,Haven Wellborn,Princeton,57.61,74.84,45.36,97.52,217.72,Single-ply,SBD,F
Girls,60.1,8,Ashton Grothe,Wylie,58.65,74.84,49.9,74.84,199.58,Single-ply,SBD,F
Girls,60.1,DQ,Alissa Saldivar,Wylie,58.24,127.01,,,,Single-ply,SBD,F
Girls,60.1,DQ,Catherine Stowell,Wylie,59.6,,,,,Single-ply,SBD,F
Girls,67.36,1,Courtney DeCoste,Wylie,66.18,151.95,74.84,156.49,383.29,Single-ply,SBD,F
Girls,67.36,2,Hannah Eboagu,Bishop Lynch,63.37,145.15,72.57,156.49,374.21,Single-ply,SBD,F
Girls,67.36,3,Madalyn Whatley,Wylie,63.37,138.35,81.65,136.08,356.07,Single-ply,SBD,F
Girls,67.36,4,Madisyn Kile,Princeton,60.65,108.86,65.77,115.67,290.3,Single-ply,SBD,F
Girls,67.36,5,Lillia Farlow,Bishop Lynch,63,102.06,49.9,104.33,256.28,Single-ply,SBD,F
Girls,67.36,6,Kristal Santibanez,Wylie,66.18,97.52,54.43,99.79,251.74,Single-ply,SBD,F
Girls,67.36,7,Sydne Romine,Princeton,65.95,90.72,49.9,108.86,249.48,Single-ply,SBD,F
Girls,67.36,8,Amairani Lobato,Wylie East,60.65,83.91,38.56,99.79,222.26,Single-ply,SBD,F
Girls,67.36,9,Nicole Gomez,Bishop Lynch,65.68,77.11,34.02,92.99,204.12,Single-ply,SBD,F
Girls,75.07,1,Neiddy Rodriguez,Wylie,73.98,156.49,65.77,147.42,369.68,Single-ply,SBD,F
Girls,75.07,2,Onize Musa,Wylie,73.71,136.08,70.31,156.49,362.87,Single-ply,SBD,F
Girls,75.07,3,Jordan Meyer,Wylie East,68.08,99.79,45.36,97.52,242.67,Single-ply,SBD,F
Girls,75.07,4,Mackenzie Hall,Wylie,73.12,102.06,38.56,99.79,240.4,Single-ply,SBD,F
Girls,75.07,5,Destiny Whitney,Wylie East,67.86,90.72,43.09,92.99,226.8,Single-ply,SBD,F
Girls,75.07,6,Nicole Marshall,Wylie,70.53,81.65,49.9,95.25,226.8,Single-ply,SBD,F
Girls,75.07,7,Mya Pruitt,Wylie,74.75,92.99,54.43,79.38,226.8,Single-ply,SBD,F
Girls,75.07,DQ,Ashley Emo,Wylie East,72.08,,,,,Single-ply,SBD,F
Girls,75.07,DQ,Lauren Foley,Wylie East,73.35,,,,,Single-ply,SBD,F
Girls,82.33,1,Ashtyn Burget,Wylie,78.11,158.76,95.25,170.1,424.11,Single-ply,SBD,F
Girls,82.33,2,Carla Guerra,Princeton,79.97,120.2,79.38,138.35,337.93,Single-ply,SBD,F
Girls,82.33,3,Laeticia Evang,Wylie,78.38,122.47,61.23,108.86,292.57,Single-ply,SBD,F
Girls,82.33,4,Ashlynn Smith,Wylie East,80.65,117.93,45.36,111.13,274.42,Single-ply,SBD,F
Girls,82.33,5,Osaretin Emokpae,Wylie,78.74,113.4,49.9,102.06,265.35,Single-ply,SBD,F
Girls,82.33,6,Jennifer Canales,Princeton,77.2,77.11,43.09,102.06,222.26,Single-ply,SBD,F
Girls,90.04,1,Abigail Lutz,Wylie East,85.14,199.58,111.13,165.56,476.27,Single-ply,SBD,F
Girls,90.04,2,Madalyn Whaley,Wylie,83.46,158.76,83.91,142.88,385.55,Single-ply,SBD,F
Girls,90.04,3,Hailey Covington,Wylie,87,142.88,79.38,133.81,356.07,Single-ply,SBD,F
Girls,90.04,4,Marielle Crump,Wylie,89.58,124.74,61.23,136.08,322.05,Single-ply,SBD,F
Girls,90.04,5,Kennedy Martin,Bishop Lynch,87.04,122.47,58.97,136.08,317.51,Single-ply,SBD,F
Girls,90.04,6,Libby McCune,Wylie East,88.54,127.01,70.31,108.86,306.17,Single-ply,SBD,F
Girls,90.04,7,Jackie Walker,Bishop Lynch,82.69,117.93,43.09,122.47,283.5,Single-ply,SBD,F
Girls,90.04,8,Immija Payton,Wylie,84.87,120.2,56.7,106.59,283.5,Single-ply,SBD,F
Girls,90.04,9,Molly Kay,Princeton,85.68,104.33,47.63,115.67,267.62,Single-ply,SBD,F
Girls,100.02,1,Jasmine Ruvalcaba,Bishop Lynch,95.07,158.76,72.57,163.29,394.63,Single-ply,SBD,F
Girls,100.02,2,Brenna Little,Wylie,94.98,133.81,83.91,122.47,340.19,Single-ply,SBD,F
Girls,117.71,1,Kadeija Edwards,Wylie,104.05,156.49,86.18,158.76,401.43,Single-ply,SBD,F
Girls,117.71,2,Victoria Martinez #3,Wylie,106.41,167.83,92.99,138.35,399.16,Single-ply,SBD,F
Girls,117.71,3,Madyson Mills,Wylie East,111.27,108.86,61.23,104.33,274.42,Single-ply,SBD,F
