Division,WeightClassKg,Place,Name,Team,BodyweightKg,Best3SquatKg,Best3BenchKg,Best3DeadliftKg,TotalKg,Equipment,Event,Sex,BirthDate
Boys,55.79,1,Ethan Jackson,Springtown,54.52,136.08,70.31,151.95,358.34,Single-ply,SBD,M,
Boys,59.87,1,Denim Fields,Azle,57.88,115.67,61.23,142.88,319.78,Single-ply,SBD,M,
Boys,59.87,2,Alex Blackwell,Azle,59.87,111.13,65.77,117.93,294.84,Single-ply,SBD,M,
Boys,59.87,3,Cooper Magee,Azle,58.24,106.59,61.23,122.47,290.3,Single-ply,SBD,M,
Boys,59.87,4,Voltaire Salim,Saginaw,58.15,83.91,56.7,113.4,254.01,Single-ply,SBD,M,
Boys,67.13,1,Hunter Martin #2,Azle,64.86,190.51,99.79,190.51,480.81,Single-ply,SBD,M,
Boys,67.13,2,Austin Richey,Springtown,66.95,136.08,95.25,142.88,374.21,Single-ply,SBD,M,
Boys,67.13,3,Jack Jestis,Azle,64.86,129.27,83.91,156.49,369.68,Single-ply,SBD,M,
Boys,67.13,4,Isaac Braly,Saginaw,62.23,108.86,65.77,140.61,315.25,Single-ply,SBD,M,
Boys,67.13,5,Kaleb Vasquez,Azle,63.5,99.79,61.23,136.08,297.1,Single-ply,SBD,M,
Boys,67.13,DQ,Nathan Brewer,Saginaw,65.59,136.08,,145.15,,Single-ply,SBD,M,
Boys,74.84,1,Dawson Jones,Springtown,71.12,147.42,117.93,183.7,449.06,Single-ply,SBD,M,
Boys,74.84,2,Kevin Nyguen,Azle,71.58,161.03,108.86,172.37,442.25,Single-ply,SBD,M,
Boys,74.84,3,Michael McCoy,Springtown,73.03,147.42,113.4,181.44,442.25,Single-ply,SBD,M,
Boys,74.84,4,Billy Heath,Azle,70.13,158.76,97.52,163.29,419.57,Single-ply,SBD,M,
Boys,74.84,5,Emerson Sheperd,Saginaw,72.39,140.61,90.72,156.49,387.82,Single-ply,SBD,M,
Boys,74.84,6,Holt Lee,Azle,71.03,124.74,92.99,154.22,371.95,Single-ply,SBD,M,
Boys,74.84,7,Stan Chwojdak,Saginaw,70.85,131.54,86.18,142.88,360.61,Single-ply,SBD,M,
Boys,74.84,8,Dylan Quinn,Saginaw,72.94,131.54,77.11,147.42,356.07,Single-ply,SBD,M,
Boys,74.84,DQ,Jesse Martin,Springtown,74.75,,90.72,145.15,,Single-ply,SBD,M,
Boys,82.1,1,Garrett Gouyton,Azle,82.1,183.7,113.4,183.7,480.81,Single-ply,SBD,M,
Boys,82.1,2,Nate Robinson,Azle,81.28,174.63,97.52,181.44,453.59,Single-ply,SBD,M,
Boys,82.1,3,Cole Walker,Springtown,77.66,142.88,90.72,151.95,385.55,Single-ply,SBD,M,
Boys,82.1,4,Caden Hickman,Saginaw,79.38,140.61,74.84,145.15,360.61,Single-ply,SBD,M,
Boys,89.81,1,Miles Wiggins,Azle,84.1,161.03,99.79,167.83,428.64,Single-ply,SBD,M,
Boys,99.79,1,Korbyn Martin,Springtown,95.98,165.56,113.4,179.17,458.13,Single-ply,SBD,M,
Boys,99.79,2,Jacob Esskew,Springtown,95.25,158.76,117.93,170.1,446.79,Single-ply,SBD,M,
Boys,99.79,3,Basilio Segura,Springtown,95.35,151.95,108.86,181.44,442.25,Single-ply,SBD,M,
Boys,99.79,4,Logan Fabrizius,Springtown,94.26,179.17,99.79,158.76,437.72,Single-ply,SBD,M,
Boys,99.79,5,Zach Barrett,Azle,96.62,156.49,108.86,163.29,428.64,Single-ply,SBD,M,
Boys,99.79,6,Rowdy Dawson,Azle,99.79,170.1,95.25,163.29,428.64,Single-ply,SBD,M,
Boys,99.79,7,Branden Murray,Azle,95.89,158.76,90.72,113.4,362.87,Single-ply,SBD,M,
Boys,99.79,DQ,Brennan Villalta,Azle,99.79,,,,,Single-ply,SBD,M,
Boys,109.77,1,Marcello Deanda,Azle,108.68,222.26,154.22,226.8,603.28,Single-ply,SBD,M,
Boys,109.77,2,Riley Norton,Azle,108.41,222.26,129.27,204.12,555.65,Single-ply,SBD,M,
Boys,109.77,3,Kaleb Robinson,Azle,109.23,190.51,86.18,183.7,460.4,Single-ply,SBD,M,
Boys,109.77,4,Dean Forsythe,Azle,109.68,176.9,113.4,163.29,453.59,Single-ply,SBD,M,
Boys,109.77,5,Gerardo De La O,Saginaw,104.96,176.9,86.18,183.7,446.79,Single-ply,SBD,M,
Boys,109.77,6,Garrett Haymes,Springtown,108.68,158.76,111.13,170.1,439.98,Single-ply,SBD,M,
Boys,109.77,7,Reid Norris,Azle,109.77,131.54,90.72,151.95,374.21,Single-ply,SBD,M,
Boys,109.77,8,Klayton Stephens,Azle,108.68,131.54,77.11,151.95,360.61,Single-ply,SBD,M,
Boys,124.74,1,Caanan Revelle,Azle,115.48,224.53,136.08,201.85,562.45,Single-ply,SBD,M,
Boys,124.74,2,Jason Harris,Azle,119.66,249.48,111.13,199.58,560.19,Single-ply,SBD,M,
Boys,124.74,3,Hunter Baldwin,Springtown,110.5,181.44,127.01,215.46,523.9,Single-ply,SBD,M,
Boys,124.74,4,Nolan McGrath,Springtown,114.31,190.51,124.74,201.85,517.1,Single-ply,SBD,M,
Boys,124.74,5,Jesse Mauerhan,Azle,121.83,197.31,102.06,158.76,458.13,Single-ply,SBD,M,
Boys,124.74,6,Jonathan Robles,Azle,118.84,185.97,86.18,174.63,446.79,Single-ply,SBD,M,
Boys,124.74,7,Ivan Gonzales,Springtown,123.83,165.56,92.99,151.95,410.5,Single-ply,SBD,M,
Boys,124.74,8,Raul Sifuentes,Saginaw,124.19,151.95,81.65,167.83,401.43,Single-ply,SBD,M,
Boys,124.74+,1,Cole Hilliard,Azle,154.86,272.16,136.08,226.8,635.03,Single-ply,SBD,M,
Boys,124.74+,2,Devin Boisvert,Azle,132.81,204.12,90.72,215.46,510.29,Single-ply,SBD,M,
Boys,124.74+,3,Colton Barber,Saginaw,129.09,206.38,102.06,170.1,478.54,Single-ply,SBD,M,
Boys,124.74+,4,Cody Brackeen,Springtown,127.46,165.56,131.54,174.63,471.74,Single-ply,SBD,M,
Boys,124.74+,5,Daniel Macias,Springtown,129.55,158.76,97.52,151.95,408.23,Single-ply,SBD,M,
Boys,124.74+,6,Brandon Crews,Azle,149.32,136.08,86.18,156.49,378.75,Single-ply,SBD,M,
