Place,Name,Division,Country,BodyweightKg,Squat1Kg,Squat2Kg,Squat3Kg,Best3SquatKg,Squat4Kg,Bench1Kg,Bench2Kg,Bench3Kg,Best3BenchKg,Bench4Kg,Deadlift1Kg,Deadlift2Kg,Deadlift3Kg,Best3DeadliftKg,Deadlift4Kg,TotalKg,WeightClassKg,Sex,CyrillicName,BirthYear,Equipment,Event
1,Milan Troksiar,T3,Slovakia,51.4,90,100,-105,100,,62.5,67.5,-70,67.5,,100,115,120,120,,287.5,52,M,,1994,Wraps,SBD
1,Károly Mező,J,Hungary,49.5,80,90,95,95,100.5,80,85,90,90,,120,130.5,135,135,140,320,52,M,,1991,Wraps,SBD
1,Pavel Balážik,O,Slovakia,53.8,115,120,-125,120,125,82.5,88,90,90,,140,150.5,155,155,-160,365,56,M,,1979,Wraps,SBD
1,Pavol Spodniak,M5,Slovakia,55.6,75,-85,,75,,50,-62.5,-62.5,50,,110,120,132.5,132.5,,257.5,56,M,,1948,Wraps,SBD
1,Patrik Vasicek,T2,Czechia,57.9,100,110,-120,110,,50,65,70,70,,60,100,120,120,,300,60,M,,1997,Wraps,SBD
1,Peter Lehocký,T3,Slovakia,59.9,140,155,160,160,,95,100,-105,100,,160,180,190,190,,450,60,M,,1995,Wraps,SBD
1,Antoni Kaliňski,M4,Poland,60,115,125,130,130,,95,100,-105,100,,-125,125,135,135,-140,365,60,M,,1953,Wraps,SBD
1,Intars Baumanis,T1,Latvia,61.8,160,170,180,180,,85,95,97.5,97.5,,160,170,180,180,,457.5,67.5,M,,1998,Wraps,SBD
2,Endre Bence Jankó,T1,Hungary,65.4,110,120,130,130,,85,90,-96,90,,130,140,150,150,,370,67.5,M,,1998,Wraps,SBD
1,Andrea O'Farrell,T2,Ireland,66.9,155,162.5,-170,162.5,,105,-110,110,110,,205,-217.5,-217.5,205,,477.5,67.5,M,,1995,Wraps,SBD
1,Dušan Miletić,T3,Serbia,65.9,-150,150,-160,150,166,105,112.5,-117.5,112.5,-117.5,165,175,182.5,182.5,,445,67.5,M,,1993,Wraps,SBD
2,Lukáš Vašíček,T3,Czechia,64.3,120,130,140,140,,80,-85,85,85,,135,145,160,160,,385,67.5,M,,1995,Wraps,SBD
1,Nathan Bage,J,UK,65.4,160,170,-180,170,,115,-125,125,125,,190,210,220,220,,515,67.5,M,,1992,Wraps,SBD
1,Sevak Manukyan,O,Armenia,66,-190,200,-210,200,,150,155,160,160,-163,190,200,-210,200,,560,67.5,M,,1983,Wraps,SBD
2,Aleksey Okunev,O,Russia,66.4,190,-210,-220,190,,120,130,-140,130,,210,230,-242.5,230,,550,67.5,M,Алексей Окунев,1975,Wraps,SBD
3,James Glass,O,UK,65.4,130,152.5,-155,152.5,,90,100,-105,100,,-180,180,-192.5,180,,432.5,67.5,M,,1988,Wraps,SBD
DQ,Aidyn Mezgilbayev,O,Kazakhstan,66.9,-80,-80,,,,,,,,,,,,,,,67.5,M,,1976,Wraps,SBD
1,Yves Garcia,M7,France,66.4,115,125.5,-130,125.5,,83,85,,85,,125,135,140,140,,350.5,67.5,M,,1942,Wraps,SBD
1,Ernest Ruzin,M8,Israel,63.1,130,-140,,130,,75,-80,,75,,160,-165,-165,160,,365,67.5,M,,1937,Wraps,SBD
1,Gabriel Tkalčić,T1,Croatia,70.5,125,130,140,140,,60,70,-80,70,,130,140,150,150,,360,75,M,,2000,Wraps,SBD
1,Roman Dobeš,T2,Czechia,74.6,130,140,-150,140,,80,85,-87.5,85,,-130,130,145,145,,370,75,M,,1996,Wraps,SBD
2,Dávid Karácsony,T2,Hungary,73.4,80,90,-100,90,,-80,80,87.5,87.5,,115,125,135,135,,312.5,75,M,,1996,Wraps,SBD
1,Danijel Parac,T3,Croatia,71.7,200,-215,215,215,,105,110,-115,110,,207.5,217.5,225,225,237.5,550,75,M,,1994,Wraps,SBD
2,Dávid Gál,T3,Hungary,72.5,205,215,220,220,,95,105,-110,105,,205,215,-225,215,,540,75,M,,1994,Wraps,SBD
1,Merat Tafreshi,J,UK,73.2,226,-251,-251,226,,100,112.5,-120,112.5,,180,200,,200,,538.5,75,M,,1992,Wraps,SBD
2,Márton Dominik,J,Hungary,73.2,-100,-100,100,100,,-105,-105,105,105,,195,-205,-205,195,,400,75,M,,1990,Wraps,SBD
1,Virgile Belin,O,France,74.2,205,215,222.5,222.5,,120,-127.5,-127.5,120,,215,222.5,230,230,,572.5,75,M,,1978,Wraps,SBD
2,Michael Watt,O,Australia,70.7,175,-185,-185,175,,125,132.5,-137.5,132.5,,215,230,240,240,,547.5,75,M,,1982,Wraps,SBD
3,Zsolt Horváth,O,Hungary,72.7,-180,180,182.5,182.5,,130,135,-137.5,135,,210,220,230,230,,547.5,75,M,,1975,Wraps,SBD
4,József Cserháti,O,Hungary,74.2,180,185,190,190,,135,140,-142.5,140,,200,210,-220,210,,540,75,M,,1988,Wraps,SBD
1,Sergey Trukhnin,M2,Russia,73.1,200,212.5,-217.5,212.5,,120,130,-135,130,,180,200,-213,200,,542.5,75,M,Сергей Трухнин,1965,Wraps,SBD
1,István Verebi,M5,Hungary,73.8,130,,,130,,105,110,-113,110,,130,,,130,,370,75,M,,1951,Wraps,SBD
1,Bartolomej Veres,M8,Slovenia,73.8,50,60,70,70,,-45,45,50,50,,97.5,115,,115,,235,75,M,,1935,Wraps,SBD
1,Balázs Kerekes,T1,Hungary,77.5,100,120,130,130,,70,75,-80,75,,165,180.5,190.5,190.5,-198,395.5,82.5,M,,1999,Wraps,SBD
2,Vlastimil Šafařík,T1,Czechia,77.5,130,140,145,145,,85,90,95,95,,145,-152.5,-152.5,145,,385,82.5,M,,1998,Wraps,SBD
1,Liad Aram,T2,Israel,82.1,170,180,190,190,,92.5,100,-105,100,,170,187.5,-200,187.5,,477.5,82.5,M,,1995,Wraps,SBD
1,Brodie Marshall,T3,UK,79.6,230,240,-250,240,,125,133,-140,133,,240,250,-260,250,,623,82.5,M,,1995,Wraps,SBD
2,Tomislav Horvatek,T3,Croatia,81.8,190,200,210,210,,-110,115,120,120,,220,235,245,245,250,575,82.5,M,,1994,Wraps,SBD
3,Mátyás Karkus,T3,Hungary,79,125,-140,-147.5,125,,55,60,65,65,,140,155,165,165,,355,82.5,M,,1995,Wraps,SBD
DQ,Miloš Mitić,T3,Croatia,82.4,-160,-160,-160,,,,,,,,,,,,,,82.5,M,,1994,Wraps,SBD
1,Robert Hopkinson,J,UK,80.8,232.5,-240,-240,232.5,,140,145,-150,145,,230,240,-245,240,,617.5,82.5,M,,1993,Wraps,SBD
2,James Young,J,UK,82.4,190,-207.5,-207.5,190,,142.5,150,-155,150,,245,265,-272.5,265,,605,82.5,M,,1992,Wraps,SBD
3,Oleksandr Slavutskyy,J,Ukraine,81,-210,-210,210,210,,125,132.5,135,135,,225,245,-255,245,,590,82.5,M,Олександр Славутський,1991,Wraps,SBD
4,Luka Kovač,J,Croatia,78.7,190,-202.5,202.5,202.5,,125,-135,-135,125,,225,-242.5,-242.5,225,,552.5,82.5,M,,1990,Wraps,SBD
1,Petr Horák,O,Czechia,81.2,230,240,-252.5,240,,155,162.5,167.5,167.5,,255,270,277.5,277.5,,685,82.5,M,,1979,Wraps,SBD
2,Róbert Szász,O,Hungary,81,220,240,-251.5,240,-261,142.5,152.5,157.5,157.5,,210,230,237.5,237.5,,635,82.5,M,,1986,Wraps,SBD
3,Tomáš Lepieš,O,Slovakia,82.5,170,190,200,200,,125,140,145,145,,190,220,235,235,,580,82.5,M,,1980,Wraps,SBD
4,Vladimir Veršić,O,Croatia,81.7,-200,200,210,210,,130,135,137.5,137.5,,200,210,220,220,,567.5,82.5,M,,1977,Wraps,SBD
5,Peter Halaj,O,Slovakia,75.8,190,205,217.5,217.5,,120,130,-132.5,130,,190,210,-215,210,,557.5,82.5,M,,1980,Wraps,SBD
6,David Beauregard,O,Australia,81.7,175,190,-200,190,,117.5,125,-130,125,,200,217.5,225,225,,540,82.5,M,,1982,Wraps,SBD
7,Lee Powell,O,Canada,79.6,175,182.5,187.5,187.5,,110,115,-117.5,115,,225,-232.5,232.5,232.5,,535,82.5,M,,1984,Wraps,SBD
8,Zsolt Györfi,O,Hungary,78.8,180,200,-220,200,,-110,120,125,125,,170,185,195,195,,520,82.5,M,,1986,Wraps,SBD
DQ,Davor Horvat,O,Croatia,81.9,205,217.5,227.5,227.5,,-125,-125,-125,,,,,,,,,82.5,M,,1986,Wraps,SBD
1,Jan Lindqvist,M1,Finland,81.7,-180,185,210,210,,150,160,165,165,,270,280,295,295,,670,82.5,M,,1971,Wraps,SBD
2,Peter Lehocký,M1,Slovakia,75.6,200,217.5,227.5,227.5,,140,152.5,157.5,157.5,,225,255,265,265,,650,82.5,M,,1972,Wraps,SBD
3,Siniša Knežević,M1,Croatia,81.5,190,215,227.5,227.5,,125,132.5,-135,132.5,,200,220,-230,220,,580,82.5,M,,1971,Wraps,SBD
DQ,Rafail Valiullin,M1,Kazakhstan,81.5,-50,-50,-50,,,-145,,,,,,,,,,,82.5,M,,1971,Wraps,SBD
1,Adriano DaCosta,M3,France,75.9,205,220,235,235,,120,130,137.5,137.5,,-222.5,222.5,235,235,242.5,607.5,82.5,M,,1963,Wraps,SBD
1,John Dieter,M4,Germany,77.3,150,165,172.5,172.5,,100,110,115,115,,185,201,205,205,,492.5,82.5,M,,1955,Wraps,SBD
1,Bill Healy,M5,Ireland,80.9,210,-225,225,225,,130,140,-145,140,,225,235,240,240,243,605,82.5,M,,1950,Wraps,SBD
2,Miklós Kardos,M5,Hungary,81.1,-120,120,130,130,,80,85,-87.5,85,,140,150,160,160,,375,82.5,M,,1951,Wraps,SBD
1,Reinhold Sack,M6,Germany,75.8,145,155,160,160,,120,127.5,130,130,,170,177.5,182.5,182.5,,472.5,82.5,M,,1946,Wraps,SBD
2,Alexander Papir,M6,Israel,75.9,-110,110,-145,110,,95,100,-105,100,,140,155,,155,,365,82.5,M,,1945,Wraps,SBD
1,Birchmans Pereira,M6,Canada,77.4,170,182,182.5,182.5,183,65,70,72.5,72.5,,215,222.5,228,228,,483,82.5,M,,1946,Wraps,SBD
1,Chen Sonnenreich,T3,Israel,86.7,-232.5,232.5,245,245,250,132.5,140,147.5,147.5,,282.5,305,310,310,,702.5,90,M,,1995,Wraps,SBD
2,Roman Pokhvatko,T3,Ukraine,87.5,200,220,230,230,,120,125,130,130,,220,230,240,240,,600,90,M,Роман Похватько,1995,Wraps,SBD
3,Roman Salaba,T3,Czechia,88,-215,-220,220,220,,120,-127.5,127.5,127.5,,220,240,-252.5,240,,587.5,90,M,,1993,Wraps,SBD
4,Tomáš Kunc,T3,Czechia,88.3,160,180,195,195,,100,-110,-110,100,,240,-250,-250,240,,535,90,M,,1995,Wraps,SBD
5,Zoltan Csiba,T3,Slovakia,83.6,-140,150,-160,150,,110,120,-122.5,120,,140,160,175,175,,445,90,M,,1994,Wraps,SBD
1,Tomáš Kalenský,J,Czechia,85.5,220,235,-245,235,,130,135,-140,135,,215,230,240,240,,610,90,M,,1993,Wraps,SBD
2,József Bartal,J,Hungary,89.9,185,200,210,210,,120,135,142.5,142.5,,235,250,-260,250,,602.5,90,M,,1990,Wraps,SBD
3,Richard Novotný,J,Czechia,87.1,200,215,-230,215,,120,127.5,-130,127.5,,240,255,,255,,597.5,90,M,,1993,Wraps,SBD
4,Pavel Křiž,J,Czechia,85.2,190,-205,205,205,,115,122.5,127.5,127.5,,220,240,255,255,,587.5,90,M,,1990,Wraps,SBD
5,Attila Módos,J,Hungary,88,180,190,200,200,,120,-125,-125,120,,210,225,235,235,,555,90,M,,1989,Wraps,SBD
6,Matija Videc,J,Croatia,89.6,-160,160,-180,160,,90,100,-110,100,,200,-215,-232.5,200,,460,90,M,,1990,Wraps,SBD
1,Scott Wasson,O,Australia,89.4,262.5,270,277.5,277.5,,155,162.5,167.5,167.5,,300,315,-320,315,,760,90,M,,1987,Wraps,SBD
2,Asmir Bešić,O,Bosnia and Herzegovina,83.5,210,230,-250,230,,150,165,170,170,,240,260,270,270,,670,90,M,,1984,Wraps,SBD
3,János Fazekas,O,Hungary,88.8,190,200,220,220,,175,180.5,182.5,182.5,183,225,240,-250,240,,642.5,90,M,,1987,Wraps,SBD
4,József Kovács,O,Hungary,87.9,210,220,230,230,,150,157.5,160,160,,230,240,-250,240,,630,90,M,,1988,Wraps,SBD
5,Budai Balázs,O,Hungary,89.3,170,-180,-185,170,,125,130,135,135,,210,215,-220,215,,520,90,M,,1979,Wraps,SBD
DQ,Curtis McDonald,O,USA,89.5,-280,-280,280,280,,-162.5,162.5,167.5,167.5,,-277.5,-277.5,-277.5,,,,90,M,,1987,Wraps,SBD
DQ,Chris Jenkins #7,O,UK,89,272.5,-285,-285,272.5,,160,167.5,-170,167.5,,-297.5,,,,,,90,M,,1980,Wraps,SBD
DQ,Milorad Custo,O,Serbia,88.8,-270,-270,-270,,,,,,,,,,,,,,90,M,,1985,Wraps,SBD
1,David Heffernan,M1,USA,88.4,242.5,255,270,270,,170,180,187.5,187.5,190,205,225,-240,225,,682.5,90,M,,1972,Wraps,SBD
2,Tibor Szűcs,M1,Hungary,88.6,180,200,-205,200,,110,120,125,125,,190,210,230,230,,555,90,M,,1973,Wraps,SBD
1,František Vincourek,M2,Czechia,86,200,220,230,230,,142.5,152.5,157.5,157.5,-160,230,240,250,250,260,637.5,90,M,,1966,Wraps,SBD
2,Gérard Ivars,M2,France,87.3,190,200,215,215,,105,110,112.5,112.5,,215,225,-230,225,,552.5,90,M,,1966,Wraps,SBD
1,Aleksandrs Miglāns,M3,Latvia,86.1,200,210,220,220,,140,145,150,150,,220,230,,230,,600,90,M,,1963,Wraps,SBD
1,Lajos Ármai,M4,Hungary,88.3,130,140,150,150,,100,110,115,115,,140,150,165,165,,430,90,M,,1954,Wraps,SBD
2,Tibor Zvada,M4,Slovakia,82.6,-130,130,135,135,,70,-80,-80,70,,130,,,130,,335,90,M,,1958,Wraps,SBD
3,František Jung,M4,Czechia,84.1,70,-80,,70,,-50,-50,50,50,,120,140,150,150,,270,90,M,,1955,Wraps,SBD
1,Ferenc Smuk,M5,Hungary,85.2,222.5,235,240,240,,90,92.5,95,95,,210,225,240,240,,575,90,M,,1952,Wraps,SBD
1,Daniel Mervis,T2,UK,99.7,250,-272.5,272.5,272.5,,150,165,-170,165,,220,250,,250,,687.5,100,M,,1996,Wraps,SBD
1,János Rajmund Nagy,T3,Hungary,95.5,215,230,-245,230,,-157.5,157.5,162.5,162.5,-170.5,265,285,-307.5,285,,677.5,100,M,,1993,Wraps,SBD
1,Matt Stenzel,J,Australia,99.6,265,280,290,290,,165,172.5,177.5,177.5,,275,285,295,295,,762.5,100,M,,1990,Wraps,SBD
2,Augustine Cooke,J,Australia,99.2,260,270,-272.5,270,,-172.5,172.5,180,180,-183.5,250,255,260,260,,710,100,M,,1990,Wraps,SBD
3,Milan Daniš,J,Slovakia,97.2,200,220,230,230,,140,150,-155,150,,220,240,250,250,,630,100,M,,1990,Wraps,SBD
4,Darko Božak,J,Croatia,98.7,200,225,-240,225,,130,140,-145,140,,235,250,-262.5,250,,615,100,M,,1993,Wraps,SBD
DQ,Hrvoje Sirovec,J,Croatia,99.4,-305,-305,,,,,,,,,,,,,,,100,M,,1992,Wraps,SBD
DQ,Péter Gulyás,J,Hungary,96.9,-250,-250,-265,,,,,,,,,,,,,,100,M,,1990,Wraps,SBD
1,Ivan Zevyakin,O,Russia,99,-320,330,350,350,,180,-190,190,190,,315,-325,325,325,,865,100,M,Иван Зевякин,1988,Wraps,SBD
2,Sebastian Kot,O,Poland,99.9,-300,300,310,310,,192.5,200,-205,200,,310,320,327.5,327.5,334,837.5,100,M,,1985,Wraps,SBD
3,Roman Zverev,O,Russia,99.5,305,325,335,335,,170,180,-185,180,,260,280,320,320,,835,100,M,Роман Зверев,1988,Wraps,SBD
4,Scott Halliday,O,UK,99.3,-265,280,290,290,,185,-200,-200,185,,280,300,305,305,,780,100,M,,1977,Wraps,SBD
5,Thomas Lilley,O,Australia,97.5,255,267.5,275,275,,160,167.5,-175,167.5,,265,-272.5,-272.5,265,,707.5,100,M,,1989,Wraps,SBD
6,Imad Bahria,O,France,98.7,240,255,270,270,,120,127.5,135,135,,260,280,,280,-327,685,100,M,,1975,Wraps,SBD
7,Gábor Novakovics,O,Hungary,95.9,220,235,245,245,,150,157.5,-160,157.5,,260,270,-282.5,270,,672.5,100,M,,1989,Wraps,SBD
8,Péter Czentye,O,Hungary,94.1,240,-260,-272.5,240,,130,140,-150,140,,230,245,-260,245,,625,100,M,,1989,Wraps,SBD
9,Timothy Agnew,O,Canada,97.6,160,-182.5,-182.5,160,,117.5,-135,-135,117.5,,160,-182.5,-185,160,,437.5,100,M,,1987,Wraps,SBD
10,Tyson Neufeld,O,Canada,93,-142.5,142.5,-205,142.5,,102.5,-122.5,-122.5,102.5,,142.5,175,185,185,,430,100,M,,1978,Wraps,SBD
1,Attila Tóth,M1,Hungary,99,230,240,250,250,,177.5,183,-185,183,,230,240,250,250,,683,100,M,,1970,Wraps,SBD
1,Ivan Giňovský,M2,Slovakia,96.8,-210,215,232.5,232.5,-241,125,137.5,-142.5,137.5,,200,210,215,215,,585,100,M,,1967,Wraps,SBD
2,Valeriy Razdorozhnyy,M2,Russia,99.3,190,205,210,210,,140,150,-157.5,150,,190,200,210,210,,570,100,M,Валерий Раздорожный,1965,Wraps,SBD
1,Luboš Halenkovský,M3,Czechia,96.9,130,140,-150,140,,100,110,120,120,,140,160,180,180,,440,100,M,,1959,Wraps,SBD
1,Vladimír Svoboda,M5,Czechia,92.7,145,155,170,170,,115,120,127.5,127.5,,145,165,175,175,,472.5,100,M,,1952,Wraps,SBD
1,Martin Starčević,T1,Croatia,109.8,-120,130,145,145,,85,-95,-97.5,85,,125,140,152.5,152.5,,382.5,110,M,,1998,Wraps,SBD
1,David Blumenfeld,T2,Israel,104.6,185,205,215,215,,120,127.5,-132.5,127.5,,250,260,270,270,-280,612.5,110,M,,1996,Wraps,SBD
1,Dávid Nagy,J,Slovakia,105.9,230,250,260,260,,185,190,-195,190,,240,260,-280,260,,710,110,M,,1992,Wraps,SBD
2,Tamás Ottlakán,J,Hungary,102.2,190,210,-225,210,,-110,120,-132.5,120,,190,210,225,225,,555,110,M,,1989,Wraps,SBD
DQ,Kohlton Parenteau,J,Canada,104.5,-205,-205,-205,,,,,,,,,,,,,,110,M,,1990,Wraps,SBD
1,Ricky Goodyear,O,Australia,104.7,325,335,345,345,,195,205,212.5,212.5,,300,315,-342.5,315,,872.5,110,M,,1975,Wraps,SBD
2,Delroy McQueen,O,UK,104.8,320,340,350,350,,-160,160,170,170,,350,-370,,350,,870,110,M,,1975,Wraps,SBD
3,Ofek Benzion,O,Israel,108.9,-270,270,280,280,,-150,150,-162.5,150,,270,285,292.5,292.5,,722.5,110,M,,1989,Wraps,SBD
4,Viktor Horeš,O,Slovakia,103.5,230,240,-250,240,,-195,200,205,205,,245,265,275,275,,720,110,M,,1985,Wraps,SBD
5,Zsolt Faraga,O,Hungary,104.7,215,225,235,235,,150,160,-170,160,,220,230,-240,230,,625,110,M,,1974,Wraps,SBD
1,László Kiss,M1,Hungary,102.5,240,-260,-275,240,,140,155,-160,155,,250,-265,,250,,645,110,M,,1969,Wraps,SBD
1,Ferenc Gyenes,M2,Hungary,109,240,-256,260,260,,150,160,166,166,,260,-280,-280,260,,686,110,M,,1968,Wraps,SBD
2,Václav Mareš,M2,Czechia,108.4,-200,220,-240,220,,150,165,-170,165,,230,,,230,,615,110,M,,1968,Wraps,SBD
1,Michael Martin,M3,Canada,109.9,205,-250,-250,205,,115,135,-142.5,135,,205,227.5,239,239,,579,110,M,,1963,Wraps,SBD
1,Vasilijs Drobovs,M4,Latvia,100.9,182.5,192.5,202.5,202.5,,140,145,-150,145,,195,205,215,215,,562.5,110,M,,1958,Wraps,SBD
2,Jaroslav Šolc,M4,Slovakia,103.6,200,-215,-215,200,,135,142.5,-150,142.5,,195,205,-212.5,205,,547.5,110,M,,1957,Wraps,SBD
3,Roman Denikaev,M4,Russia,100.7,140,150,-170,150,,120,-130,-140,120,,160,180,-200,180,,450,110,M,Роман Деникаев,1955,Wraps,SBD
1,Louis Dunn,M5,South Africa,105.2,185,205,220,220,,75,85,-90,85,,205,240,255,255,,560,110,M,,1951,Wraps,SBD
2,Yuriy Shantsyn,M5,Russia,105.1,150,165,180,180,,-125,125,-130,125,,190,205,-215,205,,510,110,M,Юрий Шанцын,1949,Wraps,SBD
1,Stefan Plundrak,T1,Czechia,113.5,190,-210,-210,190,,100,110,-117.5,110,,111,,,111,,411,125,M,,1997,Wraps,SBD
1,Drazen Vujosevic,T2,Montenegro,110.6,160,180,190,190,200,115,130,-142.5,130,-142.5,-185,185,220,220,242.5,540,125,M,,1995,Wraps,SBD
1,Péter Juhász,T3,Hungary,119.8,240,260,270,270,,180,187.5,190,190,,270,285,-290,285,,745,125,M,,1993,Wraps,SBD
DQ,Sándor Jónás,J,Hungary,122.3,-300,-300,-300,,,-190,,,,,,,,,,,125,M,,1990,Wraps,SBD
1,Krisztián Lipták,O,Hungary,115.1,310,-320,-320,310,,200,207.5,-210,207.5,,305,315,325,325,,842.5,125,M,,1981,Wraps,SBD
2,Aleksey Alekseev,O,Russia,110.1,310,-320,-320,310,,195,-202.5,202.5,202.5,,280,310,320,320,,832.5,125,M,Алексей Алексеев,1988,Wraps,SBD
3,Andre Sweeney,O,South Africa,118.3,260,280,285,285,,180,-190,-190,180,,280,300,-315,300,,765,125,M,,1982,Wraps,SBD
4,Milan Smiljanić,O,Serbia,122.1,265,270,282.5,282.5,,200,212.5,-215,212.5,,250,265,-270,265,,760,125,M,,1978,Wraps,SBD
5,Marek Brázda,O,Czechia,118.3,230,245,-260,245,,150,-160,165,165,,260,280,300,300,,710,125,M,,1974,Wraps,SBD
DQ,Tamás Bocz,O,Hungary,110.4,-260,-260,-260,,,200,210,-220,210,,270,280,290,290,,,125,M,,1983,Wraps,SBD
1,Jason Gillespie,M1,Australia,120.7,230,245,-255,245,,165,-177.5,-177.5,165,,242.5,-260,-260,242.5,,652.5,125,M,,1972,Wraps,SBD
DQ,Jean-Yves Becourt,M1,France,116.8,-207.5,-207.5,-207.5,,,,,,,,,,,,,,125,M,,1970,Wraps,SBD
DQ,Denis Udovič,M1,Slovenia,120.4,-280,-280,,,,,,,,,,,,,,,125,M,,1970,Wraps,SBD
1,Jan Kruger,M2,South Africa,121.9,-265,-265,265,265,,175,-190,195,195,,265,285,300,300,,760,125,M,,1964,Wraps,SBD
2,Petri Billy Haavisto,M2,Finland,117.2,210,-240,240,240,,180,190,195,195,,250,270,-280,270,,705,125,M,,1965,Wraps,SBD
1,František Makranský,M3,Slovakia,121.5,250,-270,,250,,160,170,,170,,250,260,,260,,680,125,M,,1961,Wraps,SBD
2,Vladimir Polivanov,M3,Russia,118,200,215,222.5,222.5,,150,165,172.5,172.5,,200,225,242.5,242.5,,637.5,125,M,Владимир Поливанов,1963,Wraps,SBD
3,Željimir Korolija,M3,Croatia,110.3,150,170,180,180,,110,120,-125,120,,180,190,200,200,,500,125,M,,1963,Wraps,SBD
1,Félix Jovicic,T1,Hungary,129.8,200,210,225,225,,100,110,115,115,,200,210,-225,210,,550,140,M,,1998,Wraps,SBD
1,Niemi-Nikkola Arto Tapani,J,Finland,132.7,260,280,300,300,,180,200,210,210,,300,330,350,350,,860,140,M,,1990,Wraps,SBD
2,Aleksandar Ilić,J,Serbia,130.2,220,240,250,250,,180,195,202.5,202.5,211,240,255,270,270,,722.5,140,M,,1992,Wraps,SBD
1,Roland Nádasi,O,Hungary,126.4,260,275,290,290,,210,225,235,235,,310,330,-340,330,,855,140,M,,1985,Wraps,SBD
2,Alexandar Stankovic,O,Serbia,134.6,280,300,310,310,,180,190,-200,190,,320,340,-355,340,,840,140,M,,1982,Wraps,SBD
3,Pero Prakljačić,O,Croatia,136.5,250,270,-282.5,270,,155,-165,165,165,,280,-290,290,290,,725,140,M,,1982,Wraps,SBD
4,Jerome Hubert Pierre Reslinger,O,France,136.7,260,-280,,260,,185,200,-210,200,,240,260,-270,260,,720,140,M,,1981,Wraps,SBD
5,Nenad Stojanović,O,Serbia,125.1,120,,,120,,140,160,,160,,140,,,140,,420,140,M,,1982,Wraps,SBD
1,Péter Szabó,M2,Slovakia,125.1,225,240,250,250,,155,165,170,170,,235,250,,250,,670,140,M,,1964,Wraps,SBD
2,István Debus,M2,Hungary,126.2,180,200,220,220,,160,170,-180,170,,220,-230,250,250,,640,140,M,,1968,Wraps,SBD
DQ,László Oláh,M2,Hungary,125.2,-200,-200,-220,,,-150,,,,,,,,,,,140,M,,1964,Wraps,SBD
1,Viktór Szabó Zsolt,O,Hungary,160.8,370,-405,405,405,420,180,190,-200,190,,330,350,-370,350,,945,140+,M,,1976,Wraps,SBD
2,Freyded Rankyn Bejerano,O,Spain,171.6,-325,340,-350,340,,-225,227.5,232.5,232.5,-240,330,340,350,350,,922.5,140+,M,,1975,Wraps,SBD
1,Matthew Aichholzer,M1,Australia,144.3,210,220,225,225,,175,182.5,-187.5,182.5,,230,240,-245,240,,647.5,140+,M,,1973,Wraps,SBD
1,Zane-Dene Ison,M2,South Africa,145.3,240,265,275,275,,175,185,190,190,,250,270,285,285,,750,140+,M,,1968,Wraps,SBD
DQ,Veikko Yli-Rajala,M2,Finland,141,235,250,270,270,,205,215,-225,215,,,,,,,,140+,M,,1965,Wraps,SBD
1,Dana Brusová,J,Slovakia,46.2,85,90,,90,-95,60,62.5,-65,62.5,-65,100,-105,105,105,110,257.5,48,F,,1992,Wraps,SBD
1,Olga Veselova,O,Russia,51.7,-60,60,70,70,,42.5,47.5,-50,47.5,,60,65,-70,65,,182.5,52,F,Ольга Веселова,1979,Wraps,SBD
1,Bernadett Nagy,T3,Hungary,53.7,55,65,70,70,,30,-35,-35,30,,60,70,72.5,72.5,75,172.5,56,F,,1995,Wraps,SBD
1,Rosa-Maria Pietikäinen,J,Finland,54,-110,115,120,120,,45,50,-55,50,,125,130,137.5,137.5,140,307.5,56,F,,1991,Wraps,SBD
2,Taryn Madeley,J,Australia,53.2,90,102.5,105,105,,55,60,62.5,62.5,,125,132.5,-140,132.5,,300,56,F,,1991,Wraps,SBD
3,Beatrix Molnár,J,Hungary,53.5,40,55,-65,55,,25,30,-35,30,,60,80,85,85,,170,56,F,,1992,Wraps,SBD
1,Natacha Herbepin,M1,France,54.3,120,-127.5,-127.5,120,,60,67.5,70,70,-73,-130,130,137.5,137.5,-141,327.5,56,F,,1971,Wraps,SBD
1,Ariela Amitay,M2,Israel,55.8,130,137.5,-142.5,137.5,-142.5,70,-75,-75,70,,130,140,147.5,147.5,150,355,56,F,,1964,Wraps,SBD
1,Csilla Sipos,T1,Hungary,59.9,60,70,80,80,-82.5,30,35,-40,35,40,80,90,102.5,102.5,,217.5,60,F,,1997,Wraps,SBD
1,Miry Itskovich,T3,Israel,59.6,-100,100,-112.5,100,,52.5,60,62.5,62.5,65,100,105,-110,105,,267.5,60,F,,1994,Wraps,SBD
1,Szilvia Nagy,O,Hungary,58.7,110,120,126,126,132.5,50,55,-57.5,55,,105,115,120,120,,301,60,F,,1982,Wraps,SBD
2,Veronika Nagy,O,Hungary,56.8,75,82.5,-87.5,82.5,,35,40,-42.5,40,,95,102.5,107.5,107.5,,230,60,F,,1977,Wraps,SBD
1,Tünde Stér,M1,Hungary,59.3,120,130,140,140,,75,82.5,85,85,,145,155,160,160,-165,385,60,F,,1971,Wraps,SBD
1,Vicki Jewson,M1,Australia,58.7,105,110,-115,110,,57.5,-62.5,-62.5,57.5,,130,-140,145,145,147.5,312.5,60,F,,1972,Wraps,SBD
1,Michelle Warren,M3,Australia,57.9,107.5,-115,115,115,,52.5,-57.5,-57.5,52.5,,122.5,125,127.5,127.5,,295,60,F,,1961,Wraps,SBD
1,Lorena Grcić,T2,Croatia,65.8,80,-90,92.5,92.5,,50,52.5,56,56,,90,100,116,116,120,264.5,67.5,F,,1997,Wraps,SBD
1,Elena Šímová,O,Slovakia,63.1,145,-152.5,-152.5,145,,70,-75,-75,70,,145,155,-162.5,155,-162.5,370,67.5,F,,1978,Wraps,SBD
2,Dominique Thistleton,O,UK,66.2,115,120,125,125,,65,70,-72.5,70,,140,150,155,155,-161,350,67.5,F,,1985,Wraps,SBD
3,Tünde Szórád,O,Hungary,61,-115,-115,115,115,,57.5,-62.5,-62.5,57.5,,120,130,137.5,137.5,,310,67.5,F,,1985,Wraps,SBD
1,Mariya Voronina,M1,Russia,67,110,120,125,125,,57.5,65,67.5,67.5,,120,130,-140,130,,322.5,67.5,F,Мария Воронина,1972,Wraps,SBD
1,Olga Miglāne,M2,Latvia,64,90,-105,-110,90,,55,60,62.5,62.5,-65,100,110,125,125,,277.5,67.5,F,,1965,Wraps,SBD
1,Nikolina Korolija,J,Croatia,70.4,90,102.5,-110,102.5,,50,52.5,-55,52.5,,100,105,-110.5,105,,260,75,F,,1993,Wraps,SBD
2,Márta Fábián,J,Hungary,71,-100,100,107.5,107.5,,35,-37.5,37.5,37.5,,90,100,-105,100,,245,75,F,,1993,Wraps,SBD
1,Tina Gačnik,O,Slovenia,68.5,60,80,-90,80,,50,-55,55,55,,100,110,-120,110,,245,75,F,,1989,Wraps,SBD
1,Anja Kolarić,J,Croatia,78.1,115,130,-140,130,-140,55,65,70,70,,110,120,132.5,132.5,,332.5,82.5,F,,1992,Wraps,SBD
2,Gemella Davies,J,Australia,76.8,100,110,120,120,,42.5,47.5,52.5,52.5,,100,112.5,-117.5,112.5,,285,82.5,F,,1993,Wraps,SBD
1,Emma Bortolotto,O,Australia,81.1,-125,125,-135,125,,67.5,-75,,67.5,,110,125,-132.5,125,,317.5,82.5,F,,1985,Wraps,SBD
2,Vallerie Sweeney,O,South Africa,77.4,70,80,90,90,,50,-52.5,-52.5,50,,130,145,-155,145,,285,82.5,F,,1984,Wraps,SBD
1,Katalin Rohrmann,M5,Hungary,75.8,100,105,,105,,77.5,82.5,,82.5,,130,135,140,140,,327.5,82.5,F,,1953,Wraps,SBD
1,Tímea Szuromi,O,Hungary,83,130,140,-150,140,,85,92.5,-100,92.5,,130,140,155,155,,387.5,90,F,,1983,Wraps,SBD
2,Andreja Valant,O,Slovenia,84.7,125,-130,135,135,,50,55,-57.5,55,,135,145,150,150,,340,90,F,,1980,Wraps,SBD
1,Rebecca Zepackic,O,Australia,101.4,145,152.5,160,160,,62.5,67.5,-70,67.5,,155,165,-175,165,,392.5,90+,F,,1976,Wraps,SBD
1,Natalija Ņikitina,M1,Latvia,97.7,140,150,-165,150,-165,75,80,85,85,,140,155,165,165,-170,400,90+,F,,1971,Wraps,SBD
1,Daniel Jurč,T3,Slovakia,65.4,240,-255,260,260,267.5,145,152.5,157.5,157.5,,-205,205,-220,205,,622.5,67.5,M,,1994,Multi-ply,SBD
1,Yves Garcia,M7,France,66.7,125,135,145,145,,82.5,87.5,92.5,92.5,,125,140,150,150,,387.5,67.5,M,,1942,Multi-ply,SBD
1,Jozef Grega,T3,Slovakia,74.9,280,295,305,305,,180,192.5,195,195,-200,230,245,255,255,,755,75,M,,1993,Multi-ply,SBD
1,István Debus,J,Hungary,74.1,130,145,-160,145,,100,-150,-150,100,,140,160,-180,160,,405,75,M,,1990,Multi-ply,SBD
1,Branko Ostojič,O,Serbia,74.6,200,-220,-220,200,,140,150,-160,150,,200,230,,230,,580,75,M,,1979,Multi-ply,SBD
1,Gerard McNamara #1,M3,Ireland,75,300,,,300,,160,,,160,,220,-240,,220,,680,75,M,,1963,Multi-ply,SBD
1,Dominik Grega,T3,Slovakia,79.3,260,270,275,275,,140,155,162.5,162.5,,-245,245,255,255,,692.5,82.5,M,,1995,Multi-ply,SBD
1,Daniel Russell,J,UK,82.5,230,250,-260,250,,160,-170,-170,160,,230,250,260,260,,670,82.5,M,,1990,Multi-ply,SBD
1,Dalibor Ilijić,O,Serbia,82.2,285,295,-305,295,,210,217.5,222.5,222.5,,240,260,270,270,,787.5,82.5,M,,1978,Multi-ply,SBD
2,Jozef Čičvara,O,Slovakia,82.3,-260,260,-280,260,,200,-210,210,210,,240,245,252.5,252.5,,722.5,82.5,M,,1989,Multi-ply,SBD
3,Samuel Colgate,O,UK,80.7,-270,-290,290,290,,-160,-160,160,160,,240,-260,-260,240,,690,82.5,M,,1989,Multi-ply,SBD
4,Marko Dimitrov,O,Serbia,80.9,180,205,-215,205,,125,-135,-140,125,,175,185,190,190,,520,82.5,M,,1980,Multi-ply,SBD
1,Andreas Csiszar,M1,Hungary,80.6,200,230,250,250,,160,170,175,175,,200,240,260,260,,685,82.5,M,,1973,Multi-ply,SBD
1,John Dieter,M4,France,77.8,-210,210,,210,,100,110,-120,110,,200,220,-235,220,,540,82.5,M,,1955,Multi-ply,SBD
1,Alexander Papir,M6,Israel,76.5,120,140,155,155,,110,120,-125,120,,150,165,175,175,,450,82.5,M,,1945,Multi-ply,SBD
1,Csaba Keszthelyi,M8,Hungary,77,110,120,125,125,,-87.5,87.5,92.5,92.5,,130,140,147.5,147.5,,365,82.5,M,,1933,Multi-ply,SBD
1,Milan Vysoký,T3,Slovakia,86.9,-225,235,237.5,237.5,,150,160,167.5,167.5,,217.5,225,235,235,,640,90,M,,1995,Multi-ply,SBD
1,Maor Shuminov,J,Israel,88.8,235,-250,250,250,,155,-162.5,162.5,162.5,,215,235,-245,235,,647.5,90,M,,1991,Multi-ply,SBD
1,Marek Biroš,O,Slovakia,89.5,310,325,335,335,,205,220,225,225,,240,265,280,280,,840,90,M,,1980,Multi-ply,SBD
2,Scott Boardman,O,UK,89.7,250,270,-290,270,,-205,205,-220,205,,235,250,-262.5,250,,725,90,M,,1974,Multi-ply,SBD
DQ,David McGuinness,O,Ireland,90,-310,310,-320,310,,-240,-240,-240,,,,,,,,,90,M,,1979,Multi-ply,SBD
1,Pasi Koukkala,M1,Finland,88,275,300,,300,,140,155,-165,155,,265,285,295,295,,750,90,M,,1971,Multi-ply,SBD
2,Miliza Antić,M1,Serbia,89.6,150,170,-200,170,,120,-150,150,150,,160,200,220,220,,540,90,M,,1970,Multi-ply,SBD
1,Ivars Gerard,M2,France,87.7,215,230,-240,230,,142.5,150,-160,150,,220,230,-240,230,,610,90,M,,1966,Multi-ply,SBD
1,Sakari Selkäinaho,M3,Finland,84.6,305,330,,330,,190,200,210,210,,230,250,260,260,,800,90,M,,1962,Multi-ply,SBD
2,Adrian Tucker,M3,UK,87.7,-300,300,321,321,,180,-207,-207,180,,250,270,-292.5,270,,771,90,M,,1961,Multi-ply,SBD
3,Michal Červinka,M3,Slovakia,88.7,255,265,280,280,,145,155,160,160,,185,200,220,220,,660,90,M,,1960,Multi-ply,SBD
1,Jozef Vrábel,T3,Slovakia,96.1,270,-285,285,285,,195,207.5,212.5,212.5,,235,250,-260,250,,747.5,100,M,,1994,Multi-ply,SBD
1,Seppo Junttila,J,Finland,96.4,-230,230,-250,230,,117.5,190,210,210,,225,240,-250,240,,680,100,M,,1990,Multi-ply,SBD
2,Ádám Takács,J,Hungary,98.3,220,235,247.5,247.5,,115,-125,125,125,,205,-210,-210,205,,577.5,100,M,,1991,Multi-ply,SBD
1,Marcos Martinez,O,Argentina,96.2,-360,360,-380,360,,-200,200,-217.5,200,,322.5,335,340,340,,900,100,M,,1975,Multi-ply,SBD
1,Roman Zverev,O,Russia,99.9,305,330,350,350,,220,-230,-230,220,,312.5,330,-340,330,,900,100,M,Роман Зверев,1988,Multi-ply,SBD
3,Joseph Kalmanovitz,O,Israel,97.6,325,-335,-337.5,325,,-215,215,225,225,,-275,275,-290,275,,825,100,M,,1980,Multi-ply,SBD
4,Lukáš Jiruška,O,Czechia,97.4,-290,-300,300,300,,210,-215,220,220,,-265,265,-275,265,,785,100,M,,1983,Multi-ply,SBD
5,David McGuinness,O,Ireland,90.1,300,,,300,,200,215,225,225,,240,250,-260,250,,775,100,M,,1979,Multi-ply,SBD
6,Péter Czentye,O,Hungary,95,-265,-265,265,265,,165,170,-180,170,,235,250,270,270,,705,100,M,,1989,Multi-ply,SBD
7,James Cox,O,UK,99.1,-270,270,-285,270,,-170,170,-180,170,,205,220,235,235,,675,100,M,,1983,Multi-ply,SBD
8,Ristomatti Vaananen,O,Finland,97.1,220,240,255,255,,150,160,-170,160,,220,235,250,250,,665,100,M,,1987,Multi-ply,SBD
DQ,Kiavash Yousefi,O,Spain,98.9,-320,-320,320,320,,-230,,-240,,,,,,,,,100,M,,1974,Multi-ply,SBD
DQ,Gábor Penkó,O,Hungary,97,-340,-340,,,,,,,,,,,,,,,100,M,,1986,Multi-ply,SBD
DQ,Matthew Balfour,O,UK,99.4,-310,-310,-310,,,,,,,,,,,,,,100,M,,1987,Multi-ply,SBD
1,Benjamin Cuthbert,M1,USA,98.4,255,-275,-275,255,,215,230,-245,230,,215,235,-245,235,,720,100,M,,1973,Multi-ply,SBD
1,Michel Logli,M2,France,99.3,220,230,240,240,,200,210,-215,210,,190,220,-240,220,,670,100,M,,1966,Multi-ply,SBD
2,Sándor Jungwirth,M2,Hungary,90.1,190,210,-225,210,,130,140,-150,140,,190,-210,-210,190,,540,100,M,,1965,Multi-ply,SBD
DQ,Brian Johnston,M2,Canada,99.2,-330,-330,-330,,,,,,,,,,,,,,100,M,,1964,Multi-ply,SBD
1,Alan Tosh,M3,UK,97.2,200,-220,-230,200,,160,170,-180,170,,225,250,270,270,,640,100,M,,1960,Multi-ply,SBD
2,Pavel Kostyrko,M3,Russia,98.9,202.5,-230,245,245,,125,-140,-140,125,,227.5,252.5,-272.5,252.5,,622.5,100,M,Павел Костырко,1959,Multi-ply,SBD
1,Libor Hurdálek,M4,Czechia,98.9,220,250,-270,250,,155,165,-175,165,,200,220,-230,220,,635,100,M,,1954,Multi-ply,SBD
1,František Esser,M6,Czechia,92.5,110,-140,-156,110,,110,-141,-141,110,,130,170,-201,170,,390,100,M,,1946,Multi-ply,SBD
1,Jakub Velgos,T3,Slovakia,102,-275,275,285,285,,195,205,215,215,-232,-220,220,-250,220,,720,110,M,,1995,Multi-ply,SBD
1,Sándor Bordás,J,Hungary,107.4,290,305,320,320,,240,251.5,-260,251.5,,280,285,290,290,,861.5,110,M,,1990,Multi-ply,SBD
2,Dávid Papp,J,Hungary,106.5,310,325,-335,325,,170,180,-185,180,,270,-285,-285,270,,775,110,M,,1990,Multi-ply,SBD
1,Kyle Vauls,O,UK,109.3,350,377.5,,377.5,,280,295,-305,295,,280,300,,300,,972.5,110,M,,1974,Multi-ply,SBD
2,Adam Pickles,O,UK,105.4,-335,335,352.5,352.5,,225,235,-242.5,235,,300,-335,-335,300,,887.5,110,M,,1981,Multi-ply,SBD
3,Attila Szücs,O,Hungary,100.2,300,320,340,340,,-220,220,230,230,,242.5,250,260,260,,830,110,M,,1976,Multi-ply,SBD
4,David Anderson #2,O,UK,103.6,280,300,,300,,-235,235,242.5,242.5,,240,-255,-255,240,,782.5,110,M,,1978,Multi-ply,SBD
DQ,Gerard Halvey,O,Ireland,109.4,240,,,240,,-180,-180,-190,,,,,,,,,110,M,,1979,Multi-ply,SBD
1,Andrew Saunders,M2,UK,103.8,330,350,365,365,,240,-255,,240,,200,,,200,,805,110,M,,1967,Multi-ply,SBD
2,Václav Mareš,M2,Czechia,108.2,-250,250,,250,,150,,,150,,230,,,230,,630,110,M,,1968,Multi-ply,SBD
1,Michael Martin,M3,Canada,109.2,275,-305,-317.5,275,,120,142.5,-157.5,142.5,,205,255,-272.5,255,,672.5,110,M,,1963,Multi-ply,SBD
1,Klement Fekete,M5,Slovakia,109.7,210,230,-250,230,,140,152.5,160,160,,230,250,-260,250,,640,110,M,,1952,Multi-ply,SBD
1,Patrik Navara,J,Czechia,111.2,-335,350,-375,350,,235,245,255,255,,275,295,-315,295,,900,125,M,,1991,Multi-ply,SBD
2,Sándor Jónás,J,Hungary,122,270,310,335,335,,180,195,-205,195,,300,320,-340,320,,850,125,M,,1990,Multi-ply,SBD
1,László Hanusz,O,Hungary,124.4,360,380,-400,380,,-280,280,-300,280,,280,300,315,315,,975,125,M,,1976,Multi-ply,SBD
2,Andriy Yaremus,O,Ukraine,110.7,365,-385,-390,365,,-245,245,260,260,,310,330,-350,330,,955,125,M,Андрій Яремус,1977,Multi-ply,SBD
3,Janne Ihalainen,O,Finland,116,300,320,-335,320,,270,-280,-282.5,270,,-270,270,285,285,,875,125,M,,1987,Multi-ply,SBD
4,Ondrej Hudák,O,Slovakia,111.8,-310,310,325,325,,-235,235,-242.5,235,,280,300,310,310,,870,125,M,,1975,Multi-ply,SBD
DQ,Andis Kaspars,O,Latvia,110.7,-350,-360,-360,,,,,,,,,,,,,,125,M,,1976,Multi-ply,SBD
1,Lajos Kovács,M1,Hungary,119.9,-255,255,300,300,,-225,225,242.5,242.5,,190,207.5,212.5,212.5,,755,125,M,,1971,Multi-ply,SBD
2,Eric Bar,M1,France,125,-250,-250,250,250,,185,-195,200,200,,250,-270,-270,250,,700,125,M,,1969,Multi-ply,SBD
1,Gary Boulton,M2,UK,123,320,340,360,360,,200,215,-230,215,,240,275,290,290,,865,125,M,,1964,Multi-ply,SBD
2,Vendel Böjtös,M2,Hungary,113.6,-205,205,,205,,140,150,-155,150,,200,210,222.5,222.5,,577.5,125,M,,1965,Multi-ply,SBD
DQ,Lee Marshall,M3,UK,117.9,-380,-380,,,,,,,,,,,,,,,125,M,,1959,Multi-ply,SBD
1,Erik Karácsondi,T3,Hungary,130.9,260,-310,325,325,,230,-250,-250,230,,240,275,302.5,302.5,,857.5,140,M,,1995,Multi-ply,SBD
1,Johannes Impiö,O,Finland,139.6,375,410,-435,410,,270,-290,290,290,,200,260,300,300,,1000,140,M,,1988,Multi-ply,SBD
2,Zsolt Molnár,O,Hungary,125.3,-300,300,325,325,,190,-205,-205,190,,290,305,315,315,,830,140,M,,1979,Multi-ply,SBD
3,Marek Kerekes,O,Slovakia,126.4,290,310,,310,,155,-220,-220,155,,220,240,,240,,705,140,M,,1976,Multi-ply,SBD
1,István Debus,M2,Hungary,126.9,-180,200,-230,200,,150,160,170,170,,230,250,-270,250,,620,140,M,,1968,Multi-ply,SBD
1,Sándor Borbély,J,Hungary,150.1,-250,250,-302.5,250,,130,-180,180,180,,250,280,-300,280,,710,140+,M,,1991,Multi-ply,SBD
1,Elliott Keeling,O,UK,143.3,390,410,-430,410,,230,250,265,265,,270,-300,-300,270,,945,140+,M,,1988,Multi-ply,SBD
1,Sabine Guillaume,O,France,47,115,125,130,130,,62.5,-67.5,67.5,67.5,,140,150,-152.5,150,,347.5,48,F,,1963,Multi-ply,SBD
1,Erika Buzinkayová,T3,Slovakia,50.1,100,110,-120,110,120,55,-65,-65,55,,90,100,-107.5,100,,265,52,F,,1994,Multi-ply,SBD
1,Tímea Nagy,T1,Hungary,52.5,90,110,-120,110,,40,-50,-52.5,40,,90,100,-110,100,,250,56,F,,1998,Multi-ply,SBD
1,Ariela Amitay,M2,Israel,54.8,165,172.5,175,175,177.5,65,-97.5,97.5,97.5,-107.5,150,-157.5,-157.5,150,,422.5,56,F,,1964,Multi-ply,SBD
1,Tünde Stér,M1,Hungary,58.6,135,145,-162.5,145,,90,95,100,100,,150,160,165,165,,410,60,F,,1971,Multi-ply,SBD
1,Terezia Mila,O,Slovakia,61.8,-160,160,180,180,,110,-115,115,115,,120,130,140,140,,435,67.5,F,,1975,Multi-ply,SBD
1,Kiss Katalin Schindlerné,M1,Hungary,66.4,90,105,115,115,,70,77.5,-82.5,77.5,,120,-130,130,130,,322.5,67.5,F,,1970,Multi-ply,SBD
1,Nina Kondrashyova,M3,Russia,69.8,210,220,230,230,,135,150,-160,150,,160,175,185,185,,565,75,F,Нина Кондрашёва,1960,Multi-ply,SBD
1,Júlia Kostúrová,J,Slovakia,78.4,-250,250,-270,250,,155,167.5,175,175,,170,190,200,200,,625,82.5,F,,1989,Multi-ply,SBD
1,Katalin Rohrmann,M5,Hungary,75.6,102.5,107.5,110,110,,75,-80,80,80,,130,137.5,-140,137.5,,327.5,82.5,F,,1953,Multi-ply,SBD
1,Yevgen Nazukin,T1,Ukraine,50.8,,,,,,65,-70,70,70,,,,,,,70,52,M,Євген Назукін,1999,Raw,B
1,Krisztian Varhegyi,T2,Hungary,50.8,,,,,,50,60,-70,60,,,,,,,60,52,M,,1997,Raw,B
1,Károly Mező,J,Hungary,49.8,,,,,,80,85,90,90,,,,,,,90,52,M,,1991,Raw,B
1,Nándor Tunkel,O,Hungary,43.6,,,,,,130,135,140,140,,,,,,,140,52,M,,1988,Raw,B
1,Marek Herák,T2,Slovakia,54.7,,,,,,97.5,102.5,-105,102.5,,,,,,,102.5,56,M,,1995,Raw,B
1,Zsolt Matravolgyi,T3,Hungary,55.8,,,,,,90,100,102.5,102.5,,,,,,,102.5,56,M,,1994,Raw,B
1,László István Zsolt,O,Hungary,54.7,,,,,,-120,125,-127.5,125,,,,,,,125,56,M,,1984,Raw,B
1,Jean-Pierre Fragassi,M8,France,55.4,,,,,,72.5,-75,-75,72.5,,,,,,,72.5,56,M,,1937,Raw,B
1,Patrik Vasicek,T2,Czechia,57.5,,,,,,50,60,65,65,,,,,,,65,60,M,,1997,Raw,B
1,Krisztian Ambrus,T3,Hungary,57.6,,,,,,95,100,105,105,,,,,,,105,60,M,,1994,Raw,B
2,Marek Vadkerti,T3,Slovakia,58.4,,,,,,85,90,-95,90,,,,,,,90,60,M,,1995,Raw,B
1,István Tóth,M4,Hungary,58.8,,,,,,135,140,145,145,,,,,,,145,60,M,,1956,Raw,B
2,Antoni Kaliňski,M4,Poland,59.8,,,,,,90,95,102.5,102.5,,,,,,,102.5,60,M,,1953,Raw,B
1,Endre Bence Jankó,T1,Hungary,65.2,,,,,,80,90,,90,,,,,,,90,67.5,M,,1998,Raw,B
1,Peter Mihalik,T2,Slovakia,66.6,,,,,,100,107.5,112.5,112.5,,,,,,,112.5,67.5,M,,1996,Raw,B
2,Julian Vigh,T2,Germany,65.1,,,,,,-87.5,95,,95,,,,,,,95,67.5,M,,1997,Raw,B
DQ,Igor Jušta,T2,Croatia,64.9,,,,,,-85,-85,-85,,,,,,,,,67.5,M,,1996,Raw,B
1,Mihály Krizsán,T3,Hungary,63.1,,,,,,90,100,105,105,,,,,,,105,67.5,M,,1995,Raw,B
2,Jozef Stojka,T3,Slovakia,66.2,,,,,,102.5,-107.5,-107.5,102.5,,,,,,,102.5,67.5,M,,1995,Raw,B
3,Lukáš Vašíček,T3,Czechia,64.8,,,,,,80,-85,85,85,,,,,,,85,67.5,M,,1995,Raw,B
1,Róbert Végső,J,Hungary,65.9,,,,,,-135,-140,140,140,,,,,,,140,67.5,M,,1992,Raw,B
1,Sevak Manukyan,O,Armenia,66.1,,,,,,147.5,152.5,157.5,157.5,,,,,,,157.5,67.5,M,,1983,Raw,B
2,Krisztián Kaiser,O,Hungary,67.4,,,,,,127.5,-135,135,135,,,,,,,135,67.5,M,,1977,Raw,B
3,Goran Karamarković,O,Croatia,66.3,,,,,,122.5,-127.5,-127.5,122.5,,,,,,,122.5,67.5,M,,1979,Raw,B
4,Aidyn Mezgilbayev,O,Kazakhstan,67.2,,,,,,60,70,75,75,,,,,,,75,67.5,M,,1976,Raw,B
1,Zsolt Karlik,M1,Hungary,65.5,,,,,,120,-130,-130,120,,,,,,,120,67.5,M,,1972,Raw,B
1,István Tkálics,M4,Hungary,66.6,,,,,,100,107.5,-110,107.5,,,,,,,107.5,67.5,M,,1955,Raw,B
1,Miroslav Adamove,T2,Slovakia,70.9,,,,,,122.5,127.5,131,131,-135,,,,,,131,75,M,,1997,Raw,B
2,Tamas Somogyi,T2,Hungary,70.2,,,,,,100,-110,110,110,,,,,,,110,75,M,,1996,Raw,B
3,Roman Dobeš,T2,Czechia,74.7,,,,,,80,-85,85,85,,,,,,,85,75,M,,1996,Raw,B
1,Dusan Drinic,T3,Serbia,74.2,,,,,,100,110,-115,110,,,,,,,110,75,M,,1995,Raw,B
1,Josselin Dauxerre,J,France,74.1,,,,,,142.5,147.5,150,150,-158,,,,,,150,75,M,,1990,Raw,B
2,István Debus,J,Hungary,74,,,,,,100,110,120,120,,,,,,,120,75,M,,1990,Raw,B
1,Sergey Asaturov,O,Armenia,74.4,,,,,,155,162.5,167.5,167.5,-181,,,,,,167.5,75,M,,1984,Raw,B
2,Dávid Szukop,O,Hungary,73,,,,,,150,-160,,150,,,,,,,150,75,M,,1985,Raw,B
3,Máté Simon,O,Hungary,70,,,,,,125,132.5,-140,132.5,,,,,,,132.5,75,M,,1987,Raw,B
4,Pavol Glovacký,O,Slovakia,73.5,,,,,,120,-125,-125,120,,,,,,,120,75,M,,1977,Raw,B
5,Ivan Karas,O,Croatia,75,,,,,,105,115,-120,115,,,,,,,115,75,M,,1986,Raw,B
1,Lazslo Kotormann,M1,Hungary,73.5,,,,,,130,135,-140,135,,,,,,,135,75,M,,1970,Raw,B
2,Saša Antić,M1,Serbia,74.7,,,,,,105,115,120,120,,,,,,,120,75,M,,1972,Raw,B
1,Aleksandr Rabinovich,M2,Israel,72.4,,,,,,150,157.5,165,165,,,,,,,165,75,M,,1967,Raw,B
2,István Varga,M2,Hungary,73.5,,,,,,120,130,-135,130,,,,,,,130,75,M,,1968,Raw,B
1,József Németh,M4,Hungary,74.2,,,,,,90,100,,100,,,,,,,100,75,M,,1958,Raw,B
1,István Verebi,M5,Hungary,73.7,,,,,,105,112.5,-115,112.5,,,,,,,112.5,75,M,,1951,Raw,B
2,Joannis Sulime,M5,France,73.1,,,,,,105,-110,-112.5,105,,,,,,,105,75,M,,1951,Raw,B
1,Reinhold Sack,M6,Germany,75,,,,,,125,127.5,130,130,,,,,,,130,75,M,,1946,Raw,B
2,Guylhem Feraud,M6,France,72.5,,,,,,105,110,115,115,,,,,,,115,75,M,,1945,Raw,B
3,Andreas Vigh,M6,Germany,68.5,,,,,,85,90,,90,,,,,,,90,75,M,,1944,Raw,B
1,József Baranyai,M7,Hungary,72.4,,,,,,75,-80,,75,,,,,,,75,75,M,,1940,Raw,B
1,Grigori Rubin,M8,Israel,73.9,,,,,,90,95,97.5,97.5,-100,,,,,,97.5,75,M,,1936,Raw,B
1,Dominik Kiraly,T1,Hungary,80.5,,,,,,92.5,97.5,-102.5,97.5,,,,,,,97.5,82.5,M,,1999,Raw,B
1,Nándor Miklós Nagy,T2,Hungary,77.9,,,,,,132.5,140,142.5,142.5,-145.5,,,,,,142.5,82.5,M,,1997,Raw,B
2,Boban Stanojlović,T2,Serbia,75.7,,,,,,130,-140,-140,130,,,,,,,130,82.5,M,,1995,Raw,B
3,Jan Orosz Jr,T2,Slovakia,76.7,,,,,,90,95,100,100,,,,,,,100,82.5,M,,1995,Raw,B
1,Gabriel Kováč,T3,Slovakia,77.7,,,,,,170,180,-185,180,,,,,,,180,82.5,M,,1995,Raw,B
2,Márk Kurucz,T3,Hungary,81.5,,,,,,165,-170,170,170,,,,,,,170,82.5,M,,1993,Raw,B
3,Maksims Suščevskihs,T3,Latvia,78.7,,,,,,145,150,155,155,,,,,,,155,82.5,M,,1994,Raw,B
4,Zsolt Oláh,T3,Hungary,76.1,,,,,,115,125,130,130,,,,,,,130,82.5,M,,1994,Raw,B
1,Mateusz Gajewicz,J,Poland,81.9,,,,,,185,195,-200,195,,,,,,,195,82.5,M,,1993,Raw,B
2,Károly Szabó,J,Hungary,75.8,,,,,,170,175,-180,175,,,,,,,175,82.5,M,,1991,Raw,B
3,Bojan Stanojlović,J,Serbia,80.4,,,,,,120,-130,-130,120,,,,,,,120,82.5,M,,1993,Raw,B
1,Péter Piszák,O,Hungary,81.9,,,,,,207.5,215.5,-220,215.5,,,,,,,215.5,82.5,M,,1973,Raw,B
2,Vjačeslavs Letlans,O,Latvia,81,,,,,,190,195,-200,195,,,,,,,195,82.5,M,,1987,Raw,B
3,Attila Dudoma,O,Hungary,79.9,,,,,,170,177.5,180,180,,,,,,,180,82.5,M,,1988,Raw,B
4,Lajos Cseh,O,Hungary,82.1,,,,,,162.5,167.5,172.5,172.5,,,,,,,172.5,82.5,M,,1974,Raw,B
5,György Berecz,O,Hungary,81.4,,,,,,165,-170,-170,165,,,,,,,165,82.5,M,,1976,Raw,B
6,Tomko Slavomir,O,Slovakia,82.5,,,,,,150,160,-165,160,,,,,,,160,82.5,M,,1988,Raw,B
7,Sergey Lashkin,O,Russia,82.2,,,,,,-147.5,147.5,-152.5,147.5,,,,,,,147.5,82.5,M,Сергей Лашкин,1983,Raw,B
1,Jan Lindqvist,M1,Finland,81.5,,,,,,150,160,,160,,,,,,,160,82.5,M,,1971,Raw,B
2,Rafail Valiullin,M1,Kazakhstan,81.5,,,,,,147.5,152.5,155.5,155.5,,,,,,,155.5,82.5,M,,1971,Raw,B
3,Rafael Silva,M1,Argentina,78.2,,,,,,140,-155.5,-155.5,140,,,,,,,140,82.5,M,,1969,Raw,B
4,Stephane Bouton,M1,France,82,,,,,,125,-130,-130,125,,,,,,,125,82.5,M,,1972,Raw,B
5,Attila Nyikos-Kiss,M1,Hungary,81.6,,,,,,115,120,-125,120,,,,,,,120,82.5,M,,1970,Raw,B
1,Sergey Trukhnin,M2,Russia,76.2,,,,,,120,130,-140,130,,,,,,,130,82.5,M,Сергей Трухнин,1965,Raw,B
1,Jean Douliez,M3,France,81,,,,,,127.5,-135,-135,127.5,,,,,,,127.5,82.5,M,,1959,Raw,B
1,Ferenc Kelemen,M4,Hungary,82.1,,,,,,95,110,115,115,,,,,,,115,82.5,M,,1954,Raw,B
2,Thomas Wagner,M4,Germany,80.3,,,,,,105,110,112.5,112.5,,,,,,,112.5,82.5,M,,1956,Raw,B
1,Bill Healy,M5,Ireland,80.3,,,,,,130,146,,146,,,,,,,146,82.5,M,,1950,Raw,B
1,László István Jobbágy,M6,Hungary,81.5,,,,,,130.5,135,-140,135,,,,,,,135,82.5,M,,1947,Raw,B
2,Birchmans Pereira,M6,Canada,76.8,,,,,,65,67.5,70,70,,,,,,,70,82.5,M,,1946,Raw,B
1,István Réz,M7,Hungary,80.2,,,,,,105,115,,115,,,,,,,115,82.5,M,,1943,Raw,B
1,Pierre Contoli,M8,France,78.5,,,,,,80,82.5,85,85,,,,,,,85,82.5,M,,1934,Raw,B
1,Marcell Toth,T1,Hungary,84.6,,,,,,60,65,-70,65,,,,,,,65,90,M,,2000,Raw,B
1,Viktor Gergő Vakarcs,T2,Hungary,86.7,,,,,,165,175,-177.5,175,,,,,,,175,90,M,,1995,Raw,B
2,Bence Bugyi,T2,Hungary,86.1,,,,,,120,-130,-130,120,,,,,,,120,90,M,,1995,Raw,B
1,Aleksandar Arbutina,T3,Serbia,89.1,,,,,,-160,-160,160,160,,,,,,,160,90,M,,1994,Raw,B
2,Róbert Majoros,T3,Hungary,85.1,,,,,,142.5,152.5,-160,152.5,,,,,,,152.5,90,M,,1994,Raw,B
1,Márk Mészáros,J,Hungary,87.6,,,,,,170,-180,180,180,,,,,,,180,90,M,,1991,Raw,B
2,István Mester,J,Hungary,84.1,,,,,,160,170,-175,170,,,,,,,170,90,M,,1992,Raw,B
3,Zsolt Mák,J,Hungary,88.4,,,,,,170,-175,-175,170,,,,,,,170,90,M,,1992,Raw,B
4,Arnold Gavaj,J,Slovakia,89.6,,,,,,160,170,-177.5,170,,,,,,,170,90,M,,1993,Raw,B
5,Radovan Činčura,J,Slovakia,83.5,,,,,,140,145,150,150,,,,,,,150,90,M,,1991,Raw,B
6,Fabrice Logli,J,France,86.4,,,,,,145,-150,-150,145,,,,,,,145,90,M,,1990,Raw,B
1,János Örsi,O,Hungary,88.2,,,,,,210,-215,-215,210,,,,,,,210,90,M,,1977,Raw,B
2,Attila Gembiczki,O,Hungary,85.9,,,,,,200,-210,-210,200,,,,,,,200,90,M,,1986,Raw,B
3,János Fazekas,O,Hungary,88.1,,,,,,175,180,-185,180,,,,,,,180,90,M,,1987,Raw,B
4,Saša Deak,O,Croatia,88.9,,,,,,-150,150,-167.5,150,,,,,,,150,90,M,,1982,Raw,B
DQ,Cedric Changiuy,O,France,88.5,,,,,,-160,-170,,,,,,,,,,90,M,,1979,Raw,B
1,Eduards Saveļjevs,M1,Latvia,82.8,,,,,,160,170,-175,170,,,,,,,170,90,M,,1971,Raw,B
2,Miliza Antić,M1,Serbia,89.1,,,,,,120,130,,130,,,,,,,130,90,M,,1970,Raw,B
3,Tám Nguyen,M1,Slovakia,86.2,,,,,,100,,,100,,,,,,,100,90,M,,1970,Raw,B
1,Vyacheslav Gorbunov,M2,Ukraine,88.4,,,,,,145,155,160,160,165,,,,,,160,90,M,Вячеслав Горбунов,1967,Raw,B
2,Frantisek Vicourek,M2,Czechia,85.6,,,,,,145,155,-160,155,,,,,,,155,90,M,,1966,Raw,B
1,József Sztanke,M4,Hungary,89.6,,,,,,150,165,-170.5,165,,,,,,,165,90,M,,1954,Raw,B
2,František Jung,M4,Czechia,84.6,,,,,,50,60,-70,60,,,,,,,60,90,M,,1955,Raw,B
1,Jozef Völgyák,M5,Slovakia,87.5,,,,,,140,145,-150,145,,,,,,,145,90,M,,1951,Raw,B
1,Janusz Hauser,M6,Poland,88,,,,,,110,-117.5,-120.5,110,-120.5,,,,,,110,90,M,,1948,Raw,B
1,Béla Bolgárfalvi,M7,Hungary,88.7,,,,,,100,110,115,115,,,,,,,115,90,M,,1943,Raw,B
1,Attila Szekely,T1,Hungary,92.3,,,,,,115,120,-132.5,120,,,,,,,120,100,M,,1998,Raw,B
1,Pāvels Krūmins Pauls,T2,Latvia,99.5,,,,,,137.5,146,150,150,,,,,,,150,100,M,,1996,Raw,B
1,Werner Karow,T3,Germany,95.9,,,,,,145,152.5,-157.5,152.5,,,,,,,152.5,100,M,,1994,Raw,B
1,Dávid Mészáros,J,Hungary,97.7,,,,,,190,200,-213,200,,,,,,,200,100,M,,1993,Raw,B
2,Norbert Banko,J,Slovakia,98.1,,,,,,185,190,195,195,,,,,,,195,100,M,,1990,Raw,B
3,Adam Csaki,J,Hungary,96.1,,,,,,170,175,-177.5,175,,,,,,,175,100,M,,1993,Raw,B
4,Andrija Stankovic,J,Serbia,99.7,,,,,,150,155,-160,155,,,,,,,155,100,M,,1990,Raw,B
1,Gabor Berek,O,Hungary,97.5,,,,,,220,230,238,238,,,,,,,238,100,M,,1987,Raw,B
2,Zoltán Csepregi,O,Hungary,99,,,,,,220,-225,225,225,,,,,,,225,100,M,,1975,Raw,B
3,László Dobos,O,Hungary,97.9,,,,,,165,175,-180,175,,,,,,,175,100,M,,1989,Raw,B
4,Miloš Ćećanović,O,Montenegro,97.6,,,,,,162.5,172.5,-175,172.5,,,,,,,172.5,100,M,,1978,Raw,B
5,Christoph Poplawsky,O,France,97.8,,,,,,160,172.5,-177.5,172.5,,,,,,,172.5,100,M,,1977,Raw,B
6,Juris Gļaņenko,O,Latvia,95,,,,,,170,-180,,170,,,,,,,170,100,M,,1985,Raw,B
7,Marek Namešpetra,O,Slovakia,97.1,,,,,,170,-175,-175,170,,,,,,,170,100,M,,1978,Raw,B
8,Timothy Agnew,O,Canada,98.4,,,,,,117.5,-140,-140,117.5,,,,,,,117.5,100,M,,1987,Raw,B
DQ,Krcmar Nedjelko,O,Croatia,97.3,,,,,,-160,-160,-160,,,,,,,,,100,M,,1976,Raw,B
1,Imrich Klacso,M1,Slovakia,97.4,,,,,,185,190,195,195,,,,,,,195,100,M,,1970,Raw,B
2,Artūrs Mugdenko,M1,Latvia,92.7,,,,,,170,185,192.5,192.5,196,,,,,,192.5,100,M,,1971,Raw,B
3,Attila Tóth,M1,Hungary,99.2,,,,,,175,180,185,185,,,,,,,185,100,M,,1970,Raw,B
4,Sándor Bíró,M1,Hungary,95.3,,,,,,170,175,180,180,,,,,,,180,100,M,,1972,Raw,B
5,Philippe Jarnetin,M1,France,99.3,,,,,,162.5,172.5,-177.5,172.5,,,,,,,172.5,100,M,,1972,Raw,B
1,Zsolt Mohácsi,M2,Hungary,99.3,,,,,,165,175,180,180,,,,,,,180,100,M,,1966,Raw,B
2,László Bugyi,M2,Hungary,97.3,,,,,,160,170,-178,170,,,,,,,170,100,M,,1964,Raw,B
3,Juha Pukkila,M2,Finland,99.7,,,,,,140,150,-162.5,150,,,,,,,150,100,M,,1963,Raw,B
1,Igor Lebedev,M3,Russia,97.3,,,,,,175,180,187.5,187.5,190,,,,,,187.5,100,M,Игорь Лебедев,1962,Raw,B
2,Robert Brasseur,M3,France,99.9,,,,,,155,160,167.5,167.5,,,,,,,167.5,100,M,,1961,Raw,B
3,Janis Freibergs,M3,Latvia,97.8,,,,,,145,157.5,-165,157.5,,,,,,,157.5,100,M,,1960,Raw,B
4,Zoran Ećim,M3,Serbia,96.7,,,,,,155,-160,-160,155,,,,,,,155,100,M,,1958,Raw,B
5,Pavel Kostyrko,M3,Russia,99.1,,,,,,-125,125,,125,,,,,,,125,100,M,Павел Костырко,1959,Raw,B
1,Imrich Činčura,M4,Slovakia,98.9,,,,,,130,,,130,,,,,,,130,100,M,,1954,Raw,B
1,Ottó Dalos,M4,Hungary,96.5,,,,,,150,157.5,-160,157.5,,,,,,,157.5,100,M,,1954,Raw,B
2,Vladimír Svoboda,M5,Czechia,94.7,,,,,,115,120,125,125,,,,,,,125,100,M,,1952,Raw,B
1,László Kasza,M7,Hungary,98,,,,,,140,-150,-150,140,,,,,,,140,100,M,,1941,Raw,B
1,Martin Viktor,T1,Hungary,104.3,,,,,,120,125,-130,125,,,,,,,125,110,M,,1997,Raw,B
2,Arnold Udvardi,T1,Hungary,103.2,,,,,,85,92.5,-97.5,92.5,,,,,,,92.5,110,M,,1998,Raw,B
1,Janos Kiraly,T2,Hungary,109,,,,,,132.5,135,,135,142.5,,,,,,135,110,M,,1996,Raw,B
1,Balázs Fehér,T3,Hungary,107.5,,,,,,185,190,-195,190,,,,,,,190,110,M,,1995,Raw,B
2,Matej Veršec,T3,Croatia,102,,,,,,130,140,-147.5,140,,,,,,,140,110,M,,1994,Raw,B
1,Gábor Katona,J,Hungary,101.9,,,,,,220,231,,231,,,,,,,231,110,M,,1991,Raw,B
2,Norbert Váczi,J,Hungary,104.8,,,,,,195,200,202.5,202.5,,,,,,,202.5,110,M,,1990,Raw,B
3,Dávid Nagy,J,Slovakia,105.8,,,,,,180,187.5,192.5,192.5,,,,,,,192.5,110,M,,1992,Raw,B
4,János Fehér,J,Hungary,102,,,,,,187.5,-190,-195,187.5,,,,,,,187.5,110,M,,1992,Raw,B
5,Nathaniel Hodges,J,Australia,102.5,,,,,,142.5,150,-155,150,,,,,,,150,110,M,,1990,Raw,B
6,Ivan Lovrić,J,Croatia,102.9,,,,,,150,-157.5,-157.5,150,,,,,,,150,110,M,,1990,Raw,B
1,Ákos Oláh,O,Hungary,101.6,,,,,,215,227.5,-237.5,227.5,,,,,,,227.5,110,M,,1989,Raw,B
2,Oleksiy Solovyov,O,Ukraine,108.2,,,,,,220,227.5,-237.5,227.5,,,,,,,227.5,110,M,Олексій Соловйов,1975,Raw,B
3,Lars Stöwesandt,O,Germany,104.9,,,,,,207.5,215,217.5,217.5,,,,,,,217.5,110,M,,1979,Raw,B
4,Kalman Antal,O,Hungary,106.4,,,,,,200,210,217.5,217.5,,,,,,,217.5,110,M,,1978,Raw,B
5,Viktor Horeš,O,Slovakia,105.5,,,,,,195,205,210,210,,,,,,,210,110,M,,1985,Raw,B
6,Szabolcs Pandi,O,Hungary,106,,,,,,200,207.5,-212.5,207.5,,,,,,,207.5,110,M,,1981,Raw,B
7,Lajos Zsolt Kovács,O,Hungary,106.1,,,,,,185,192.5,197.5,197.5,,,,,,,197.5,110,M,,1978,Raw,B
8,Eduardo Elgart,O,Argentina,104.3,,,,,,180,190,-200,190,,,,,,,190,110,M,,1974,Raw,B
9,Yevgen Pavlov,O,Ukraine,105.7,,,,,,185,-192.5,-195,185,,,,,,,185,110,M,Євгеній Павлов,1976,Raw,B
10,Zsolt Vajda,O,Slovakia,101.3,,,,,,170,-180,-180,170,,,,,,,170,110,M,,1978,Raw,B
11,Milomir Bakrac,O,Montenegro,101.2,,,,,,155,-165,-165,155,,,,,,,155,110,M,,1983,Raw,B
12,Lajos Bán,O,Hungary,102.9,,,,,,140,150,-155,150,,,,,,,150,110,M,,1976,Raw,B
DQ,Miroslav Vlačinić,O,Croatia,108.2,,,,,,-170,-170,-175,,,,,,,,,110,M,,1975,Raw,B
1,Endre Jánkó,M1,Hungary,107.3,,,,,,195,202.5,205,205,,,,,,,205,110,M,,1971,Raw,B
2,Tamás Pfeifenróth,M1,Hungary,108,,,,,,190,200,205,205,,,,,,,205,110,M,,1973,Raw,B
1,István Hegedüs,M2,Hungary,107.3,,,,,,200,210,-220,210,,,,,,,210,110,M,,1967,Raw,B
2,Sergey Gromov,M2,Russia,104,,,,,,190,200,202.5,202.5,,,,,,,202.5,110,M,Сергей Громов,1966,Raw,B
3,Aleksandar Vujisic,M2,Montenegro,106.2,,,,,,200,-202.5,-202.5,200,,,,,,,200,110,M,,1967,Raw,B
4,Gvido Kohs,M2,Latvia,107.6,,,,,,180,190,-202.5,190,,,,,,,190,110,M,,1965,Raw,B
5,Vojtech Lázok,M2,Slovakia,108.1,,,,,,160,170,175,175,,,,,,,175,110,M,,1968,Raw,B
6,Michal Šafařík,M2,Czechia,106.9,,,,,,150,157.5,162.5,162.5,,,,,,,162.5,110,M,,1967,Raw,B
7,Václav Mareš,M2,Czechia,108.3,,,,,,150,160,-170,160,,,,,,,160,110,M,,1968,Raw,B
1,Hermann Haraldsson,M3,Iceland,101.9,,,,,,-170,170,-176,170,,,,,,,170,110,M,,1959,Raw,B
1,George Dzimas,M4,USA,102.9,,,,,,140,-147.5,147.5,147.5,,,,,,,147.5,110,M,,1956,Raw,B
2,Roman Denikaev,M4,Russia,101.8,,,,,,110,120,-140,120,,,,,,,120,110,M,Роман Деникаев,1955,Raw,B
1,Mihaly Hajdu,M5,Hungary,107,,,,,,160,-165,,160,,,,,,,160,110,M,,1950,Raw,B
2,Herve Pincemin,M5,France,103,,,,,,-125,125,130,130,,,,,,,130,110,M,,1950,Raw,B
1,Attila Lajos Jeremias,M7,Hungary,100.3,,,,,,120,125,130,130,,,,,,,130,110,M,,1943,Raw,B
2,Radomir Jovanović,M7,Serbia,106.2,,,,,,110,120,-130,120,,,,,,,120,110,M,,1943,Raw,B
1,Gabriel Csicso,T3,Slovakia,122.2,,,,,,162.5,167.5,-172.5,167.5,,,,,,,167.5,125,M,,1994,Raw,B
1,Benjamin Bodnar,J,Hungary,117.5,,,,,,192.5,-200,,192.5,,,,,,,192.5,125,M,,1991,Raw,B
2,Norbert Szigeti,J,Hungary,119.1,,,,,,165,175,180,180,,,,,,,180,125,M,,1992,Raw,B
1,Norbert Stranszki,O,Hungary,123.3,,,,,,-237.5,242.5,246,246,,,,,,,246,125,M,,1986,Raw,B
2,Christian Raidel,O,Austria,118.1,,,,,,235,-240,-242.5,235,,,,,,,235,125,M,,1982,Raw,B
3,Rikhard Snorrason,O,Iceland,124.5,,,,,,220,230,232.5,232.5,,,,,,,232.5,125,M,,1982,Raw,B
4,Mátyás Merkl,O,Hungary,114.1,,,,,,215,222.5,230,230,,,,,,,230,125,M,,1989,Raw,B
5,Csaba Kovács,O,Hungary,119.7,,,,,,205,215,-230,215,,,,,,,215,125,M,,1980,Raw,B
6,Miloš Šnajdr,O,Slovakia,124.9,,,,,,-215,215,-222.5,215,,,,,,,215,125,M,,1977,Raw,B
7,Andy Teitge,O,Germany,113.5,,,,,,200,210,-215,210,,,,,,,210,125,M,,1987,Raw,B
8,Milan Smiljanić,O,Serbia,122.8,,,,,,207.5,-215,-217.5,207.5,,,,,,,207.5,125,M,,1978,Raw,B
9,Francky Novak,O,Croatia,121,,,,,,-200,200,-207.5,200,,,,,,,200,125,M,,1988,Raw,B
1,Mariks Daugavets,M1,Latvia,122.1,,,,,,-225,225,233,233,,,,,,,233,125,M,,1971,Raw,B
2,Martinic Sreoko,M1,Croatia,118.5,,,,,,190,197.5,202.5,202.5,,,,,,,202.5,125,M,,1973,Raw,B
3,Tamás Szabó,M1,Hungary,120.8,,,,,,195,200,-205,200,,,,,,,200,125,M,,1971,Raw,B
4,Milan Pado,M1,Slovakia,111.4,,,,,,165,170,175,175,,,,,,,175,125,M,,1972,Raw,B
1,Ján Orosz,M2,Slovakia,123.6,,,,,,215,225,-230,225,,,,,,,225,125,M,,1964,Raw,B
2,Tibor Rácz,M2,Hungary,112.9,,,,,,190,200,205,205,,,,,,,205,125,M,,1968,Raw,B
3,Petri Billy Haavisto,M2,Finland,118.4,,,,,,175,-190,190,190,,,,,,,190,125,M,,1965,Raw,B
4,Saša Mašanović,M2,Montenegro,110.3,,,,,,115,120,-122.5,120,,,,,,,120,125,M,,1967,Raw,B
1,Sebastian Luciano,M3,USA,112.7,,,,,,180,186,190,190,-195,,,,,,190,125,M,,1961,Raw,B
2,František Makranský,M3,Slovakia,119.7,,,,,,160,-170,170,170,,,,,,,170,125,M,,1961,Raw,B
3,Michel Krzonkalla,M3,France,122.1,,,,,,170,-182.5,-186.5,170,,,,,,,170,125,M,,1963,Raw,B
DQ,Dieter Berghoff,M3,Germany,121.4,,,,,,-180,-187.5,-187.5,,,,,,,,,125,M,,1960,Raw,B
1,Christian Lucas,M4,France,119,,,,,,172.5,177.5,182.5,182.5,184,,,,,,182.5,125,M,,1956,Raw,B
1,Dominique Robillard,M5,France,112,,,,,,145,-152.5,,145,,,,,,,145,125,M,,1949,Raw,B
1,Arto Tapani Niemi-Nikkola,J,Finland,131.5,,,,,,180,200,,200,,,,,,,200,140,M,,1990,Raw,B
1,László Mészáros,O,Hungary,132,,,,,,280,290,303.5,303.5,,,,,,,303.5,140,M,,1968,Raw,B
2,Erik Susztay,O,Slovakia,129.7,,,,,,207.5,215,220,220,,,,,,,220,140,M,,1972,Raw,B
3,Jerome Hubert Pierre Reslinger,O,France,135.2,,,,,,200,210,-220,210,,,,,,,210,140,M,,1981,Raw,B
4,David Rdrazik,O,Czechia,135.4,,,,,,-170,180,195,195,,,,,,,195,140,M,,1979,Raw,B
1,Tomasz Drzewiecki,M1,Ireland,132,,,,,,200,205,210,210,,,,,,,210,140,M,,1973,Raw,B
2,Tamás Bartalos,M1,Hungary,125.5,,,,,,180,190,195,195,,,,,,,195,140,M,,1973,Raw,B
1,Sándor Béres,M2,Hungary,127.7,,,,,,260,-270,270,270,,,,,,,270,140,M,,1967,Raw,B
2,István Debus,M2,Hungary,127,,,,,,160,170,180,180,,,,,,,180,140,M,,1968,Raw,B
1,Petr Dubnický,M3,Czechia,136.8,,,,,,155,165,-170,165,,,,,,,165,140,M,,1962,Raw,B
1,Jozef Péter,M5,Slovakia,129.3,,,,,,175,180,-185,180,,,,,,,180,140,M,,1950,Raw,B
1,Freyded Rankyn Bejerano,O,Spain,171.3,,,,,,225,-245,-245,225,,,,,,,225,140+,M,,1975,Raw,B
2,Janos Sevcsik,O,Hungary,141.3,,,,,,200,-220,-225,200,,,,,,,200,140+,M,,1974,Raw,B
1,János Szabó Ozor,M1,Hungary,172,,,,,,205.5,212.5,220,220,,,,,,,220,140+,M,,1972,Raw,B
2,Zsolt Tóth,M2,Hungary,140.1,,,,,,180,190,200,200,,,,,,,200,140+,M,,1967,Raw,B
3,Jozsef Bukta,M1,Hungary,144.3,,,,,,170,182.5,192.5,192.5,,,,,,,192.5,140+,M,,1971,Raw,B
1,Veikko Yli-Rajala,M2,Finland,140.1,,,,,,200,210,217.5,217.5,,,,,,,217.5,140+,M,,1965,Raw,B
2,Gabor Fischer,M2,Hungary,147.1,,,,,,165,175,-182.5,175,,,,,,,175,140+,M,,1967,Raw,B
1,Dana Brusová,J,Slovakia,45.7,,,,,,60,62.5,65,65,,,,,,,65,48,F,,1992,Raw,B
1,Katalin Mezei,O,Hungary,46.9,,,,,,50,55,57.5,57.5,,,,,,,57.5,48,F,,1979,Raw,B
2,Gyöngyi Balogh,O,Hungary,46.9,,,,,,50,-55,-55,50,,,,,,,50,48,F,,1984,Raw,B
1,Dóra Schopf,O,Hungary,51.4,,,,,,67.5,70,72.5,72.5,,,,,,,72.5,52,F,,1974,Raw,B
2,Szilvia Kaiser,O,Hungary,51.3,,,,,,47.5,52.5,-55,52.5,,,,,,,52.5,52,F,,1982,Raw,B
1,Ruza Martinic,M1,Croatia,51.6,,,,,,52.5,55,-57.5,55,,,,,,,55,52,F,,1969,Raw,B
1,Beatrix Bíró,T2,Hungary,54,,,,,,70,75,77.5,77.5,,,,,,,77.5,56,F,,1997,Raw,B
1,Andrea Kovács,O,Hungary,53.3,,,,,,50,55,-57.5,55,,,,,,,55,56,F,,1979,Raw,B
2,Erika Rékásiné Gőz,O,Hungary,53.6,,,,,,52.5,55,-60,55,,,,,,,55,56,F,,1976,Raw,B
1,Sigrid Sack,M5,Germany,55.3,,,,,,52.5,55,-60,55,,,,,,,55,56,F,,1949,Raw,B
1,Martina Namešpetrova,O,Slovakia,58.5,,,,,,80,85,-87.5,85,,,,,,,85,60,F,,1984,Raw,B
1,Ilona Egri,M1,Hungary,58.3,,,,,,57.5,-60,-60,57.5,,,,,,,57.5,60,F,,1972,Raw,B
1,Heidi Grimaldi,M6,France,59.1,,,,,,60,65,67.5,67.5,,,,,,,67.5,60,F,,1948,Raw,B
1,Lorena Grcić,T2,Croatia,66,,,,,,50,52.5,55,55,,,,,,,55,67.5,F,,1997,Raw,B
1,Nikolina Korolija,J,Croatia,67.5,,,,,,52.5,-55,-55,52.5,,,,,,,52.5,67.5,F,,1993,Raw,B
1,Daria Krenn,O,Austria,65.4,,,,,,100,107.5,112.5,112.5,,,,,,,112.5,67.5,F,,1975,Raw,B
2,Maryna Soltanova,O,Ukraine,64.6,,,,,,80,-85,85,85,,,,,,,85,67.5,F,Марина Солтанова,1985,Raw,B
1,Anna Balko,M3,Hungary,65.5,,,,,,80,85,90,90,,,,,,,90,67.5,F,,1959,Raw,B
1,Zsuszana Németh,M4,Hungary,64.9,,,,,,50,55,-57.5,55,,,,,,,55,67.5,F,,1955,Raw,B
1,Jana Vašková,T3,Slovakia,71.2,,,,,,70,-72.5,-72.5,70,,,,,,,70,75,F,,1994,Raw,B
1,Marianna Berentei,O,Hungary,72.2,,,,,,45,52.5,57.5,57.5,,,,,,,57.5,75,F,,1977,Raw,B
1,Marianna Óvári,M1,Hungary,72.5,,,,,,117.5,-122.5,-122.5,117.5,,,,,,,117.5,75,F,,1973,Raw,B
1,Virpi Pukkila,M2,Finland,74,,,,,,80,92.5,-97.5,92.5,,,,,,,92.5,75,F,,1967,Raw,B
1,Nina Kondrashyova,M3,Russia,70.7,,,,,,90,95,100,100,,,,,,,100,75,F,Нина Кондрашёва,1960,Raw,B
1,Anja Kolarić,J,Croatia,78.2,,,,,,55,60,-70,60,,,,,,,60,82.5,F,,1992,Raw,B
1,Katalin Rohrmann,M5,Hungary,76.7,,,,,,75,80,,80,,,,,,,80,82.5,F,,1953,Raw,B
1,Minna Polujati,O,Finland,85.7,,,,,,80,95,102.5,102.5,,,,,,,102.5,90,F,,1981,Raw,B
1,Edina Ulveczki,O,Hungary,101.5,,,,,,130,135,-142.5,135,,,,,,,135,90+,F,,1981,Raw,B
1,Marek Herák,T2,Slovakia,56,,,,,,-125,130,140,140,,,,,,,140,56,M,,1995,Multi-ply,B
DQ,Zsolt Molnár,O,Hungary,56.2,,,,,,-110,-110,-110,,,,,,,,,60,M,,1982,Multi-ply,B
1,Miroslav Adamove,T2,Slovakia,74.7,,,,,,150,160,170,170,,,,,,,170,75,M,,1997,Multi-ply,B
2,Jaroslav Martiček,T2,Slovakia,73.6,,,,,,130,,-150,130,,,,,,,130,75,M,,1996,Multi-ply,B
1,Martin Hajdu,T3,Hungary,71.1,,,,,,145,-150,-150,145,,,,,,,145,75,M,,1994,Multi-ply,B
1,Róbert Paňko,O,Slovakia,74.9,,,,,,190,-202.5,-202.5,190,,,,,,,190,75,M,,1981,Multi-ply,B
1,Saša Antić,M1,Serbia,74.7,,,,,,120,-150,155,155,,,,,,,155,75,M,,1972,Multi-ply,B
1,Stanislav Kučerák,M2,Slovakia,73.5,,,,,,130,-140,-140,130,,,,,,,130,75,M,,1964,Multi-ply,B
1,Joannis Sulime,M5,France,72.8,,,,,,115,120,125,125,,,,,,,125,75,M,,1951,Multi-ply,B
1,Guylhem Feraud,M6,France,73.3,,,,,,-125,-125,125,125,,,,,,,125,75,M,,1945,Multi-ply,B
1,Grigori Rubin,M8,Israel,72.9,,,,,,113,-117.5,117.5,117.5,-120,,,,,,117.5,75,M,,1936,Multi-ply,B
1,Gabriel Kováč,T3,Slovakia,79.2,,,,,,220,,240,240,,,,,,,240,82.5,M,,1995,Multi-ply,B
1,Dániel Égei,J,Hungary,80.5,,,,,,210,220,231,231,,,,,,,231,82.5,M,,1992,Multi-ply,B
1,Dalibor Ilijić,O,Serbia,81.7,,,,,,217.5,-246,-250,217.5,,,,,,,217.5,82.5,M,,1978,Multi-ply,B
2,Andrey Bogatkov,O,Russia,82.4,,,,,,180,,,180,,,,,,,180,82.5,M,Андрей Богатков,1975,Multi-ply,B
3,Alan Fiore,O,France,76.2,,,,,,130,142.5,-150,142.5,,,,,,,142.5,82.5,M,,1982,Multi-ply,B
DQ,Patrice Jakumulski,M3,France,81,,,,,,-170,-170,,,,,,,,,,82.5,M,,1960,Multi-ply,B
1,Thomas Wagner,M4,Germany,82,,,,,,115,117.5,-122.5,117.5,,,,,,,117.5,82.5,M,,1956,Multi-ply,B
DQ,László István Jobbágy,M6,Hungary,81.5,,,,,,-170,-170,,,,,,,,,,82.5,M,,1947,Multi-ply,B
1,Viktor Gergő Vakarcs,T2,Hungary,89.2,,,,,,-205,205,-215,205,-225,,,,,,205,90,M,,1995,Multi-ply,B
1,Fabrice Logli,J,France,87.8,,,,,,170,-180,180,180,,,,,,,180,90,M,,1990,Multi-ply,B
1,Ján Matej,O,Slovakia,87.3,,,,,,245,262.5,-270,262.5,,,,,,,262.5,90,M,,1985,Multi-ply,B
2,Rodolfo Villalba,O,Argentina,90,,,,,,-200,200,-205,200,,,,,,,200,90,M,,1974,Multi-ply,B
DQ,János Örsi,O,Hungary,88.7,,,,,,,,,,,,,,,,,90,M,,1977,Multi-ply,B
1,Miliza Antić,M1,Serbia,89.2,,,,,,120,150,170,170,,,,,,,170,90,M,,1970,Multi-ply,B
2,Pasi Koukkala,M1,Finland,87.8,,,,,,145,152.5,-157.5,152.5,,,,,,,152.5,90,M,,1971,Multi-ply,B
1,Jean-Marc Albert,M2,France,89.7,,,,,,165,-175,-175,165,,,,,,,165,90,M,,1966,Multi-ply,B
1,József Sztanke,M4,Hungary,89.3,,,,,,200,212.5,220.5,220.5,-222.5,,,,,,220.5,90,M,,1954,Multi-ply,B
1,Jozef Völgyák,M5,Slovakia,88.5,,,,,,160,165,170,170,,,,,,,170,90,M,,1951,Multi-ply,B
1,Aleksandar Arbutina,T3,Serbia,90.6,,,,,,140,160,170,170,,,,,,,170,100,M,,1994,Multi-ply,B
1,Richárd Budai,J,Hungary,99.3,,,,,,270,-305,-305,270,,,,,,,270,100,M,,1993,Multi-ply,B
2,Tomáš Kríž,J,Slovakia,98.2,,,,,,220,-245,245,245,,,,,,,245,100,M,,1992,Multi-ply,B
3,Miroslav Čaba,J,Slovakia,90.8,,,,,,210,230,-240,230,,,,,,,230,100,M,,1993,Multi-ply,B
4,Seppo Junttila,J,Finland,97.1,,,,,,-190,190,-230,190,,,,,,,190,100,M,,1990,Multi-ply,B
DQ,Tamás Ábrahám,J,Hungary,94,,,,,,-180,-180,-180,,,,,,,,,100,M,,1990,Multi-ply,B
1,David Velička,O,Czechia,96.6,,,,,,250,260,-270,260,,,,,,,260,100,M,,1978,Multi-ply,B
2,György Szalai,O,Hungary,96.5,,,,,,230,240,-242.5,240,,,,,,,240,100,M,,1976,Multi-ply,B
3,Miloš Ćećanović,O,Montenegro,99.6,,,,,,212.5,230,-242.5,230,,,,,,,230,100,M,,1978,Multi-ply,B
4,Attila Sándor,O,Hungary,97.7,,,,,,210,-220,,210,,,,,,,210,100,M,,1981,Multi-ply,B
5,Yuriy Ustinov,O,Russia,98,,,,,,-200,200,,200,,,,,,,200,100,M,Юрий Устинов,1975,Multi-ply,B
6,Ristomatti Vaananen,O,Finland,98.6,,,,,,160,-170,,160,,,,,,,160,100,M,,1987,Multi-ply,B
DQ,Zoltán Csepregi,O,Hungary,99.8,,,,,,-355,-355,-355,,,,,,,,,100,M,,1975,Multi-ply,B
1,Imrich Klacso,M1,Slovakia,98.2,,,,,,220,230,235,235,,,,,,,235,100,M,,1970,Multi-ply,B
2,Marián Milý,M1,Slovakia,98.7,,,,,,200,-210,-220,200,,,,,,,200,100,M,,1973,Multi-ply,B
1,Zoran Ećim,M3,Serbia,97.4,,,,,,150,190,-200,190,,,,,,,190,100,M,,1958,Multi-ply,B
2,Pavel Kostyrko,M3,Russia,99.3,,,,,,115,140,-152.5,140,,,,,,,140,100,M,Павел Костырко,1959,Multi-ply,B
1,Vladimír Svoboda,M5,Czechia,93.3,,,,,,135,145,-150,145,,,,,,,145,100,M,,1952,Multi-ply,B
1,Henri Marion,M7,France,95.6,,,,,,140,147.5,150,150,,,,,,,150,100,M,,1943,Multi-ply,B
1,Gábor Katona,J,Hungary,102.5,,,,,,310,330,-341,330,,,,,,,330,110,M,,1991,Multi-ply,B
2,Michal Líška,J,Slovakia,106.1,,,,,,220,250,,250,,,,,,,250,110,M,,1993,Multi-ply,B
3,Milan Daniš,J,Slovakia,100.3,,,,,,-170,170,-190,170,,,,,,,170,110,M,,1990,Multi-ply,B
1,Kyle Vauls,O,UK,108.8,,,,,,-300,300,-310,300,,,,,,,300,110,M,,1974,Multi-ply,B
2,Sami Huhtala,O,Finland,108.6,,,,,,-260,260,-270,260,,,,,,,260,110,M,,1974,Multi-ply,B
3,Szabolcs Pandi,O,Hungary,106.7,,,,,,-240,240,255,255,,,,,,,255,110,M,,1981,Multi-ply,B
4,Róbert Csetényi,O,Hungary,102.8,,,,,,230,245,-250,245,,,,,,,245,110,M,,1976,Multi-ply,B
5,Zsolt Vajda,O,Slovakia,101,,,,,,225,235,-242.5,235,,,,,,,235,110,M,,1978,Multi-ply,B
6,Roman Szanyi,O,Slovakia,102,,,,,,220,230,-235,230,,,,,,,230,110,M,,1984,Multi-ply,B
7,Eduardo Elgart,O,Argentina,104.1,,,,,,-220,220,-230,220,,,,,,,220,110,M,,1974,Multi-ply,B
8,Josh Nelson,O,Canada,107,,,,,,-200,200,217.5,217.5,,,,,,,217.5,110,M,,1983,Multi-ply,B
9,Nicholas Chambers,O,UK,107.1,,,,,,160,170,-180,170,,,,,,,170,110,M,,1986,Multi-ply,B
DQ,Yevgen Pavlov,O,Ukraine,109.9,,,,,,-230,-240,-240,,,,,,,,,110,M,Євгеній Павлов,1976,Multi-ply,B
1,Endre Jánkó,M1,Hungary,108.2,,,,,,-260,260,-280,260,,,,,,,260,110,M,,1971,Multi-ply,B
2,Philippe Jarnetin,M1,France,102,,,,,,165,,,165,,,,,,,165,110,M,,1972,Multi-ply,B
1,Ľuboš Tylišcak,M2,Slovakia,104.5,,,,,,250,-260,260,260,,,,,,,260,110,M,,1967,Multi-ply,B
2,Sergey Gromov,M2,Russia,104.5,,,,,,230,-250,250,250,-265,,,,,,250,110,M,Сергей Громов,1966,Multi-ply,B
3,Juha Pukkila,M2,Finland,107.3,,,,,,215,-225,225,225,,,,,,,225,110,M,,1963,Multi-ply,B
4,Václav Mareš,M2,Czechia,107.7,,,,,,-220,-220,225,225,,,,,,,225,110,M,,1968,Multi-ply,B
5,Michel Logli,M2,France,100.3,,,,,,200,210,-220,210,,,,,,,210,110,M,,1966,Multi-ply,B
1,Tamás Brauner,M3,Hungary,103.8,,,,,,220,230,-241,230,,,,,,,230,110,M,,1960,Multi-ply,B
1,János Csatári,M4,Hungary,106.8,,,,,,180,,,180,,,,,,,180,110,M,,1956,Multi-ply,B
1,Attila Sándor,M5,Hungary,100.5,,,,,,157.5,170,-185,170,,,,,,,170,110,M,,1952,Multi-ply,B
1,Stefan Plundrak,T1,Czechia,113.8,,,,,,130,-145,,130,,,,,,,130,125,M,,1997,Multi-ply,B
1,Richard Szanyi,J,Slovakia,115.3,,,,,,235,245,250,250,,,,,,,250,125,M,,1992,Multi-ply,B
1,Csaba Kovács,O,Hungary,120.1,,,,,,-290,300,315,315,-331,,,,,,315,125,M,,1980,Multi-ply,B
2,Janne Ihalainen,O,Finland,117.6,,,,,,270,280,-300,280,,,,,,,280,125,M,,1987,Multi-ply,B
3,Marek Hlaváč,O,Czechia,119.9,,,,,,250,-260,-260,250,,,,,,,250,125,M,,1976,Multi-ply,B
4,Jani Toivo Kristian Ihalainen,O,Finland,114.5,,,,,,230,-250,-250,230,,,,,,,230,125,M,,1975,Multi-ply,B
5,Nenad Stojanović,O,Serbia,120,,,,,,210,-235,-250,210,,,,,,,210,125,M,,1982,Multi-ply,B
DQ,Sándor Vörös,O,Slovakia,123.1,,,,,,-325,-335,-340,,,,,,,,,125,M,,1975,Multi-ply,B
DQ,Antti Ruonaniemi,O,Finland,115.7,,,,,,-250,,,,,,,,,,,125,M,,1976,Multi-ply,B
1,Ferenc Balázs,M1,Hungary,114.4,,,,,,-305,310,-315,310,,,,,,,310,125,M,,1970,Multi-ply,B
1,Péter Szabó,M2,Slovakia,123.2,,,,,,185,195,205,205,,,,,,,205,125,M,,1964,Multi-ply,B
1,Marc Savoca,M3,France,114.5,,,,,,205,212.5,-217.5,212.5,,,,,,,212.5,125,M,,1961,Multi-ply,B
DQ,Sebastian Luciano,M3,USA,111.3,,,,,,-282.5,,,,,,,,,,,125,M,,1961,Multi-ply,B
1,László Kolozsvári,M4,Hungary,114.9,,,,,,-200,200,-210,200,,,,,,,200,125,M,,1956,Multi-ply,B
1,Gusztav Menyes,M7,Hungary,110.9,,,,,,150,-160,160,160,,,,,,,160,125,M,,1938,Multi-ply,B
DQ,Arto Tapani Niemi-Nikkola,J,Finland,131,,,,,,,,,,,,,,,,,140,M,,1990,Multi-ply,B
1,Jozef Saksa,O,Slovakia,127,,,,,,-265,265,270,270,,,,,,,270,140,M,,1985,Multi-ply,B
2,David Zdražil,O,Czechia,139,,,,,,250,-260,260,260,,,,,,,260,140,M,,1978,Multi-ply,B
3,Luboslav Velgos,O,Slovakia,127.8,,,,,,235,255,-267.5,255,,,,,,,255,140,M,,1973,Multi-ply,B
1,Sándor Béres,M2,Hungary,129.6,,,,,,320,340,350,350,,,,,,,350,140,M,,1967,Multi-ply,B
2,István Debus,M2,Hungary,126.3,,,,,,150,-210,-220,150,,,,,,,150,140,M,,1968,Multi-ply,B
1,Michel Krzonkalla,M3,France,125.3,,,,,,210,220,-246,220,,,,,,,220,140,M,,1963,Multi-ply,B
1,Jozef Péter,M5,Slovakia,126.9,,,,,,-195,-195,195,195,,,,,,,195,140,M,,1950,Multi-ply,B
1,Johannes Impiö,O,Finland,140.5,,,,,,-270,270,-282.5,270,,,,,,,270,140+,M,,1988,Multi-ply,B
2,Freyded Rankyn Bejerano,O,Spain,169.9,,,,,,255,-265,265,265,,,,,,,265,140+,M,,1975,Multi-ply,B
1,Csongor Kocsis,M2,Hungary,140.3,,,,,,250,-260,,250,,,,,,,250,140+,M,,1964,Multi-ply,B
1,Péter Mihály,M4,Slovakia,157.9,,,,,,230,,,230,,,,,,,230,140+,M,,1958,Multi-ply,B
DQ,Ariela Amitay,M2,Israel,54.9,,,,,,-107.5,-110,-110,,,,,,,,,56,F,,1964,Multi-ply,B
1,Terezia Mila,O,Slovakia,59.8,,,,,,110,-120,-132,110,,,,,,,110,60,F,,1975,Multi-ply,B
DQ,Maryna Soltanova,O,Ukraine,65.7,,,,,,-100,-100,-100,,,,,,,,,67.5,F,Марина Солтанова,1985,Multi-ply,B
1,Piroska Horvathné Balogh,M1,Hungary,66.6,,,,,,138.5,142.5,-147.5,142.5,,,,,,,142.5,67.5,F,,1971,Multi-ply,B
1,Zsuszana Németh,M4,Hungary,65.3,,,,,,60,62.5,-65.5,62.5,,,,,,,62.5,67.5,F,,1955,Multi-ply,B
1,Tina Gačnik,O,Slovenia,68.6,,,,,,40,70,75,75,,,,,,,75,75,F,,1989,Multi-ply,B
1,Virpi Pukkila,M2,Finland,74.8,,,,,,-145,147.5,152,152,,,,,,,152,75,F,,1967,Multi-ply,B
1,Anna Turaeva,O,Russia,81.2,,,,,,170,180,183,183,,,,,,,183,82.5,F,Анна Тураева,1978,Multi-ply,B
1,Katalin Rohrmann,M5,Hungary,75.5,,,,,,75,80,82.5,82.5,,,,,,,82.5,82.5,F,,1953,Multi-ply,B
1,Anita Mahony,M2,Ireland,111,,,,,,135,-142.5,-142.5,135,,,,,,,135,90+,F,,1966,Multi-ply,B
