Event,Sex,Division,WeightClassKg,TotalKg,Best3BenchKg,Best3DeadliftKg,Bench4Kg,Deadlift4Kg,Name,State,Country,Equipment,Place
BD,M,Class 1,75,327.5,135,192.5,,,Zachary Carter,ID,USA,Raw,1
BD,M,Class 1,82.5,337.5,132.5,205,,,Nick Hillman,CA,USA,Raw,1
BD,M,Class 1,90,315,125,190,,,Bryan Vandiver,OK,USA,Single-ply,1
BD,M,Class 1,90,355,160,195,,,Phillip Trotter,AR,USA,Raw,1
BD,M,Class 1,100,440,165,275,,,Austin Payne,WI,USA,Single-ply,1
BD,M,Class 1,100,415,187.5,227.5,,,Joey Lewis,OK,USA,Single-ply,2
BD,M,Class 1,100,455,272.5,182.5,,,Robert Villagomez,AZ,USA,Raw,1
BD,M,Class 1,110,427.5,,,,,Daniel Slatton,TN,USA,Raw,1
BD,M,Class 1,125,535,230,305,,,David Palmer,ME,USA,Single-ply,1
BD,F,Class 1,60,202.5,60,142.5,,,Anna Tamez,OR,USA,Raw,1
BD,F,Class 1,67.5,177.5,52.5,125,,,Danielle Moliassa,WA,USA,Raw,2
BD,F,Class 1,67.5,227.5,67.5,160,,,Rebecca Carter,ID,USA,Raw,1
BD,F,Class 1,75,205,67.5,137.5,,,Mesha Blackwell,IL,USA,Raw,1
BD,F,Class 1,82.5,212.5,65,147.5,,,Briana Lacey,AZ,USA,Raw,1
BD,F,Class 1,82.5,230,87.5,142.5,,152.5,DeAnna Dutton,WA,USA,Multi-ply,1
BD,F,Class 1,100,232.5,,,,,Karisha McAfee,TX,USA,Raw,1
BD,F,Class 1,100,225,75,150,,,Tamara Perry,HI,USA,Raw,2
BD,F,Class 1,100+,217.5,,,,,Bernice Valdez,AZ,USA,Raw,1
BD,M,Disabled 1 13-19,67.5,197.5,65,132.5,,140,Clarence Kehres,CA,USA,Raw,1
BD,M,Disabled 1 20-39,100,427.5,127.5,300,,,Dustin McFarland,OR,USA,Raw,1
BD,F,Disabled 1 60,90,75,,,,,Mary Rubcic-Tawzer,CA,USA,Raw,1
BD,M,Disabled 2 20-39,90,355,160,195,,,Phillip Trotter,AR,USA,Raw,1
BD,M,Disabled 2 20-39,100,387.5,145,242.5,,,Margarito Rodriguez,TX,USA,Raw,1
BD,M,Disabled 2 40-59,75,267.5,85,182.5,,,Chad McFarland,OR,USA,Raw,1
BD,M,Disabled 2 60,100,275,115,160,,,Gary Flood,OK,USA,Multi-ply,1
BD,F,Disabled 2 20-39,56,192.5,55,137.5,,,Jozee Hofman,MT,USA,Raw,1
BD,F,Disabled 2 20-39,100,230,80,150,,152.5,Chloe Kaalund,CA,USA,Raw,1
BD,F,Disabled 2 60,82.5,160,42.5,117.5,,,Marlene Wexler,MN,USA,Raw,1
BD,M,Juniors 20-25,48,217.5,97.5,120,,,Michael Pearson,WA,USA,Single-ply,1
BD,M,Juniors 20-25,67.5,327.5,100,227.5,,,Brian Miller,WI,USA,Raw,1
BD,M,Juniors 20-25,75,355,140,215,,,Julio Alfredo Fernnandez Rodriguez,,Guatemala,Single-ply,1
BD,M,Juniors 20-25,82.5,370,175,195,,,Travis Woods,CA,USA,Single-ply,1
BD,M,Juniors 20-25,82.5,457.5,165,292.5,,,Timothy Farris,TN,USA,Raw,1
BD,M,Juniors 20-25,90,405,,,,,Joel Sanchez-Mendoza,AZ,USA,Raw,1
BD,M,Juniors 20-25,100,492.5,195,297.5,,,Haroldo Daniel Zepeda Hernández,,Guatemala,Single-ply,1
BD,M,Juniors 20-25,100,372.5,,,,,Raymond Gutierrez,TX,USA,Raw,1
BD,M,Juniors 20-25,110,505,232.5,272.5,,,Andrew Levensalor,ME,USA,Single-ply,1
BD,M,Juniors 20-25,140+,507.5,210,297.5,,,Kyle Lockhart,ME,USA,Raw,1
BD,F,Juniors 20-25,67.5,202.5,,,,,Alexia Juarez,WA,USA,Raw,1
BD,F,Juniors 20-25,100,215,65,150,,,Shania Wood,WA,USA,Raw,1
BD,M,Law-Fire 40-47,90,360,167.5,192.5,,,Raymond Cullar,IL,USA,Raw,1
BD,M,Law-Fire 40-47,100,345,140,205,,,Nick Berriman,OR,USA,Raw,1
BD,M,Law-Fire 40-47,110,547.5,272.5,275,,,Freddy Crosby,IL,USA,Single-ply,1
BD,M,Law-Fire 40-47,140,562.5,287.5,275,,,Tommy Harrison,IL,USA,Single-ply,1
BD,M,Law-Fire 48-55,90,402.5,155,247.5,,,Jason Smith,OK,USA,Raw,1
BD,M,Law-Fire 48-55,140,432.5,227.5,205,,,Darren Kaleleiki,HI,USA,Single-ply,1
BD,M,Law-Fire 48-55,140+,275,124.5,150.5,,,Scott Von Bargen,CA,USA,Raw,1
BD,M,Law-Fire 56-63,90,355,110,245,,,Dan Guches,OR,USA,Raw,1
BD,M,Law-Fire 56-63,90,350,135,215,,,Scott Sciaretta,MT,USA,Raw,2
BD,M,Law-Fire 64+,60,220.5,95.5,125,,,Gary Miller #2,NV,USA,Raw,1
BD,M,Law-Fire 64+,82.5,357.5,125,232.5,,,Charles McFarland,OR,USA,Raw,1
BD,M,Law-Fire Open,90,355,110,245,,,Dan Guches,OR,USA,Raw,1
BD,M,Law-Fire Open,90,350,135,215,,,Scott Sciaretta,MT,USA,Raw,2
BD,M,Law-Fire Open,100,387.5,157.5,230,,,Robert Rasor,OK,USA,Raw,1
BD,M,Law-Fire Open,110,480,205,275,,,Freddy Crosby,IL,USA,Single-ply,1
BD,M,Law-Fire Open,140,562.5,287.5,275,,,Tommy Harrison,IL,USA,Single-ply,1
BD,M,Law-Fire Open,140+,505,200,305,,,Keoni Reich,HI,USA,Multi-ply,1
BD,F,Law-Fire Open,56,192.5,55,137.5,,,Jozee Hofman,MT,USA,Raw,1
BD,F,Law-Fire Open,100,409,171,238,,242.5,Alisha Howard,WA,USA,Single-ply,1
BD,M,Law-Fire Submasters,125,422.5,185,237.5,,240,Ryan Eamon,MT,USA,Raw,1
BD,F,Law-Fire Submasters,67.5,212.5,72.5,140,,145,Joi Kiel,HI,USA,Raw,1
BD,F,Law-Fire Submasters,75,132.5,45,87.5,,,Lacey Alvernaz,OR,USA,Raw,1
BD,M,Masters 40-46,82.5,430,165,265,,,Chad Medina,NM,USA,Raw,1
BD,M,Masters 40-46,90,375,137.5,237.5,,,Andy Lenon,NV,USA,Raw,1
BD,M,Masters 40-46,100,472.5,230,242.5,,,Jesse Avila,UT,USA,Single-ply,1
BD,M,Masters 40-46,100,392.5,165,227.5,,,Robert Saludares,HI,USA,Single-ply,2
BD,M,Masters 40-46,100,396,181,215,,,Randy Fry,WI,USA,Raw,1
BD,M,Masters 40-46,110,392.5,,,,,Kelly McKenzie,AZ,USA,Raw,1
BD,M,Masters 40-46,110,542.5,250,292.5,,,Eduardo Elgart,,Argentina,Multi-ply,1
BD,M,Masters 40-46,117.5,,,265,,,Tim Potteiger,OK,USA,Raw,DQ
BD,M,Masters 40-46,117.5,455,177.5,277.5,,,Juha Märsylä,,Finland,Raw,1
BD,M,Masters 40-46,125,477.5,217.5,260,,,Allen Heisler,MT,USA,Single-ply,1
BD,M,Masters 40-46,140,542.5,267.5,275,,,Jeremiah Johnson #3,UT,USA,Multi-ply,1
BD,M,Masters 40-46,140+,,,235,,,Robert Vick,NV,USA,Raw,DQ
BD,M,Masters 47-53,75,410,182.5,227.5,,,Chris Balanga,CA,USA,Single-ply,1
BD,M,Masters 47-53,75,386,161,225,,,Serafin de Simone,,Argentina,Raw,1
BD,M,Masters 47-53,82.5,390,130,260,,,Marchand Fleming,OK,USA,Raw,1
BD,M,Masters 47-53,82.5,349,146.5,202.5,,,Mike Stanchfield,MN,USA,Raw,2
BD,M,Masters 47-53,90,402,154.5,247.5,,,Jason Smith,OK,USA,Raw,1
BD,M,Masters 47-53,100,427.5,,,,,Charles Farmer,MT,USA,Raw,1
BD,M,Masters 47-53,100,310,112.5,197.5,,,Toby Levensalor,ME,USA,Raw,3
BD,M,Masters 47-53,100,387.5,177.5,210,,,Kim Päivöke,,Finland,Raw,2
BD,M,Masters 47-53,110,510,255,255,,,John Westleigh,ME,USA,Single-ply,1
BD,M,Masters 47-53,117.5,470.5,185,285.5,,295,Jon Gealon,OR,USA,Raw,1
BD,M,Masters 47-53,125,535,230,305,,,David Palmer,ME,USA,Single-ply,2
BD,M,Masters 47-53,125,560,272.5,287.5,,,David Lewis,IL,USA,Single-ply,1
BD,M,Masters 47-53,140+,495,240,255,,,Scott Bromeisl,WI,USA,Single-ply,1
BD,M,Masters 54-60,75,395,150,245,,,Fulton White,NV,USA,Single-ply,1
BD,M,Masters 54-60,75,381,150.5,230.5,,,Keith Cunningham,WA,USA,Multi-ply,1
BD,M,Masters 54-60,90,315,125,190,,,Bryan Vandiver,OK,USA,Single-ply,1
BD,M,Masters 54-60,110,430,155,275,,,Bob Miller,MN,USA,Raw,1
BD,M,Masters 54-60,110,382.5,177.5,205,,,John Regis,ID,USA,Raw,2
BD,M,Masters 54-60,110,387.5,165,222.5,,227.5,Jim Presley,CA,USA,Multi-ply,1
BD,M,Masters 54-60,125,290.5,117.5,173,,,Don Miskinis,OH,USA,Raw,1
BD,M,Masters 54-60,140,445.5,193,252.5,,,George Strutzel,MT,USA,Raw,1
BD,M,Masters 54-60,140+,,,205,,,James Mersberg,HI,USA,Multi-ply,DQ
BD,M,Masters 61-67,67.5,295,105,190,,,Dave Constantineau,WI,USA,Raw,1
BD,M,Masters 61-67,75,217.5,75,142.5,,,Gary Johnson,AL,USA,Raw,1
BD,M,Masters 61-67,82.5,357.5,125,232.5,,,Charles McFarland,OR,USA,Raw,1
BD,M,Masters 61-67,82.5,312.5,120,192.5,,,Ed Regua,NM,USA,Raw,2
BD,M,Masters 61-67,90,445,150,295,,,Leamon Woodley,WA,USA,Single-ply,1
BD,M,Masters 61-67,110,265,112.5,152.5,,,Gregg Ramsdell,GA,USA,Single-ply,1
BD,M,Masters 61-67,110,327.5,110,217.5,,,Mike Clason,OR,USA,Raw,3
BD,M,Masters 61-67,110,322.5,137.5,185,,,Wayne Sowers,ME,USA,Raw,4
BD,M,Masters 61-67,110,335,130,205,,,Mark Vainas,MA,USA,Raw,2
BD,M,Masters 61-67,110,310,112.5,197.5,,,Greg Sawyer,CA,USA,Raw,6
BD,M,Masters 61-67,110,314,97.5,216.5,,,Eugene Merrill,AR,USA,Raw,5
BD,M,Masters 61-67,110,360.5,178,182.5,,,Tom Gonnering,AL,USA,Raw,1
BD,M,Masters 61-67,117.5,395,137.5,257.5,,,Eddie Morgan,AR,USA,Single-ply,1
BD,M,Masters 61-67,140+,472.5,227.5,245,,,Joe Mickelson,WA,USA,Single-ply,1
BD,M,Masters 68-74,60,220.5,95.5,125,,,Gary Miller #2,NV,USA,Raw,1
BD,M,Masters 68-74,75,,,152.5,,,Gary Witzel,WA,USA,Multi-ply,DQ
BD,M,Masters 68-74,82.5,270,92.5,177.5,,,Mark Clark,OR,USA,Raw,2
BD,M,Masters 68-74,82.5,275,80,195,,,Robert Batko,MI,USA,Raw,1
BD,M,Masters 68-74,117.5,270,85,185,,,Tom Matlock,AZ,USA,Raw,1
BD,M,Masters 68-74,125,325,,,,,Tom Morgan,AR,USA,Raw,1
BD,M,Masters 75-79,60,130,42.5,87.5,,,Eugene Kawamata,HI,USA,Raw,1
BD,M,Masters 75-79,82.5,265,82.5,182.5,,,Tom Haggenmiller,MN,USA,Raw,1
BD,M,Masters 75-79,90,187.5,95,92.5,,,Mike Haigwood,NV,USA,Raw,1
BD,M,Masters 80-84,67.5,225,87.5,137.5,92.5,142.5,Larry Vincent,OR,USA,Multi-ply,1
BD,M,Masters 80-84,90,279,95,184,,,John Herbein,PA,USA,Single-ply,1
BD,M,Masters 85-89,67.5,123,40.5,82.5,,,Gerald Foster,FL,USA,Raw,1
BD,M,Masters 85-89,82.5,125,40,85,,,Cleophus Scrutchions,IL,USA,Raw,1
BD,F,Masters 40-46,56,235,92.5,142.5,,,Jamie Field,CA,USA,Single-ply,1
BD,F,Masters 40-46,60,205,85,120,,,Stacy Matsuyama-Sekioka,HI,USA,Single-ply,1
BD,F,Masters 40-46,60,225,75,150,,,Leilani Felipe,HI,USA,Raw,1
BD,F,Masters 40-46,67.5,212.5,65,147.5,,,Tonya Patrick,AZ,USA,Raw,1
BD,F,Masters 40-46,75,182.5,70,112.5,,,Sarah Johnson,MT,USA,Raw,1
BD,F,Masters 40-46,82.5,212.5,72.5,140,,,Brandi Kary,CA,USA,Single-ply,1
BD,F,Masters 40-46,82.5,197.5,57.5,140,,,Crystal Luiz-Jones,CA,USA,Raw,1
BD,F,Masters 40-46,100,409,171,238,,242.5,Alisha Howard,WA,USA,Single-ply,1
BD,F,Masters 40-46,100,225,75,150,,,Tamara Perry,HI,USA,Raw,1
BD,F,Masters 40-46,100+,330.5,140,190.5,,,Trisha Puou,HI,USA,Single-ply,1
BD,F,Masters 47-53,48,172.5,40,132.5,,,Elizabeth Cabe,HI,USA,Raw,1
BD,F,Masters 47-53,56,156,43.5,112.5,,,Barbara Perris,OR,USA,Raw,1
BD,F,Masters 47-53,67.5,232.5,67.5,165,,,Kathy Caraccioli,CA,USA,Single-ply,1
BD,F,Masters 47-53,75,160,,,,,Karma McMillian,WI,USA,Raw,3
BD,F,Masters 47-53,75,197.5,,,,,Melissa Benson,CO,USA,Raw,2
BD,F,Masters 47-53,75,240,70,170,,,Mirtha Delatorre,CA,USA,Raw,1
BD,F,Masters 47-53,82.5,300,95,205,,,Artemira Sobrinho,,Brazil,Raw,1
BD,F,Masters 47-53,90,245,82.5,162.5,85.5,,Akondaye Fountain,TX,USA,Raw,1
BD,F,Masters 54-60,52,145,,,,,Diana Fisler,CO,USA,Raw,1
BD,F,Masters 54-60,56,190,62.5,127.5,,,Griselda Soler,,Argentina,Raw,1
BD,F,Masters 54-60,60,215.5,57.5,158,,,Annette McBride,ID,USA,Raw,1
BD,F,Masters 54-60,60,196,82.5,113.5,,,Betty Hansen,CA,USA,Multi-ply,1
BD,F,Masters 54-60,67.5,197.5,85,112.5,,,Rebecca Moore,WA,USA,Multi-ply,1
BD,F,Masters 54-60,82.5,212.5,65,147.5,,,Terri Aiwohi,HI,USA,Raw,1
BD,F,Masters 54-60,82.5,230,87.5,142.5,,152.5,DeAnna Dutton,WA,USA,Multi-ply,1
BD,F,Masters 54-60,90,152.5,57.5,95,,102.5,Analia Zalopany,HI,USA,Raw,2
BD,F,Masters 54-60,90,160,55,105,,,Deborah Maxwell,CA,USA,Raw,1
BD,F,Masters 61-67,60,155,52.5,102.5,,,Susan Chloupek,WA,USA,Multi-ply,1
BD,F,Masters 61-67,67.5,245,70,175,,182.5,Jane McCubbin,WI,USA,Raw,1
BD,F,Masters 61-67,67.5,245,92.5,152.5,,,Nadine Brack,WA,USA,Raw,2
BD,F,Masters 61-67,67.5,252.5,100,152.5,,,Peach Presley,CA,USA,Multi-ply,1
BD,F,Masters 68-74,56,130.5,47.5,83,,,Leona Pereza,HI,USA,Raw,1
BD,F,Masters 68-74,75,125,30,95,,,Jacqueline Fendler,MN,USA,Raw,1
BD,F,Masters 68-74,82.5,160,42.5,117.5,,,Marlene Wexler,MN,USA,Raw,1
BD,F,Masters 75-79,75,192.5,82.5,110,,,Pat Robey,WA,USA,Single-ply,1
BD,F,Masters 80-84,60,139.5,41,98.5,,,Carrie Reese,CA,USA,Raw,1
BD,M,Open,67.5,360,145,215,,,Pablo Rodriguez,,Argentina,Single-ply,1
BD,M,Open,75,355,140,215,,,Julio Alfredo Fernnandez Rodriguez,,Guatemala,Single-ply,1
BD,M,Open,75,325,,,,,Alon Trevino,TX,USA,Raw,2
BD,M,Open,75,386,161,225,,,Serafin de Simone,,Argentina,Raw,1
BD,M,Open,82.5,450,170,280,,,Steven Bassetti,CA,USA,Single-ply,1
BD,M,Open,82.5,445,195,250,,,Burt Duer,CA,USA,Single-ply,2
BD,M,Open,90,482.5,185,297.5,,,Nick Rosencutter,WI,USA,Single-ply,1
BD,M,Open,90,450,,,,,Ryne Golesh,CO,USA,Single-ply,2
BD,M,Open,90,,,265,,,Max Panziera,CA,USA,Single-ply,DQ
BD,M,Open,90,375,137.5,237.5,,,Andy Lenon,NV,USA,Raw,1
BD,M,Open,100,492.5,195,297.5,,,Haroldo Daniel Zepeda Hernández,,Guatemala,Single-ply,2
BD,M,Open,100,,,355,,,Kalle Räsänen,,Finland,Single-ply,DQ
BD,M,Open,100,562.5,,,,,Mike Early,AZ,USA,Single-ply,1
BD,M,Open,100,396,181,215,,,Randy Fry,WI,USA,Raw,2
BD,M,Open,100,387.5,157.5,230,,,Robert Rasor,OK,USA,Raw,3
BD,M,Open,100,387.5,177.5,210,,,Kim Päivöke,,Finland,Raw,4
BD,M,Open,100,367.5,120,247.5,,,Antero Makila,,Finland,Raw,5
BD,M,Open,100,432.5,155,277.5,,,Mariano Miravalles,,Argentina,Raw,1
BD,M,Open,110,505,232.5,272.5,,,Andrew Levensalor,ME,USA,Single-ply,1
BD,M,Open,110,422.5,160,262.5,,,Donovan Ballo,HI,USA,Raw,1
BD,M,Open,110,542.5,250,292.5,,,Eduardo Elgart,,Argentina,Multi-ply,1
BD,M,Open,117.5,455,177.5,277.5,,,Juha Märsylä,,Finland,Raw,1
BD,M,Open,117.5,422.5,142.5,280,,,Tyler Frost,AL,USA,Raw,2
BD,M,Open,125,475,190,285,,,Gary Pantilla,AZ,USA,Raw,2
BD,M,Open,125,515.5,175,340.5,,,Alfredo Martín Rojas,,Argentina,Raw,1
BD,M,Open,140,,,242.5,,,River Newman,MT,USA,Single-ply,DQ
BD,M,Open,140,,,332.5,,,Jake Briles,ID,USA,Single-ply,DQ
BD,M,Open,140,590,257.5,332.5,,,Kamuela Wassman,HI,USA,Single-ply,1
BD,M,Open,140,542.5,267.5,275,,,Jeremiah Johnson #3,UT,USA,Multi-ply,1
BD,M,Open,140+,472.5,227.5,245,,,Joe Mickelson,WA,USA,Single-ply,1
BD,M,Open,140+,,,325,,,Ricardo Nort,,Brazil,Raw,DQ
BD,M,Open,140+,505,200,305,,,Keoni Reich,HI,USA,Multi-ply,1
BD,F,Open,44,200,60,140,,,Diana Vallinoto,,Argentina,Raw,1
BD,F,Open,48,207.5,67.5,140,,,Jade Bunk,WI,USA,Raw,1
BD,F,Open,48,205,57.5,147.5,,,Jennifer Genato,CA,USA,Raw,2
BD,F,Open,48,197.5,70,127.5,,,Micaela Lopez,,Argentina,Raw,3
BD,F,Open,52,215.5,65,150.5,,,April Hamon,TX,USA,Single-ply,1
BD,F,Open,52,,,165,,,Valesca Cristina Rocha,,Brazil,Single-ply,DQ
BD,F,Open,56,235,92.5,142.5,,,Jamie Field,CA,USA,Single-ply,1
BD,F,Open,56,190,62.5,127.5,,,Griselda Soler,,Argentina,Raw,1
BD,F,Open,60,270,100,170,,,Tracee Iranon,HI,USA,Single-ply,1
BD,F,Open,60,205,85,120,,,Stacy Matsuyama-Sekioka,HI,USA,Single-ply,2
BD,F,Open,67.5,322.5,152.5,170,,,Samantha Panziera,CA,USA,Single-ply,1
BD,F,Open,67.5,255,95,160,,,Marianne Hartio,,Finland,Raw,1
BD,F,Open,67.5,225,67.5,157.5,,,Alyssa Turose,AZ,USA,Raw,2
BD,F,Open,67.5,212.5,65,147.5,,,Tonya Patrick,AZ,USA,Raw,3
BD,F,Open,82.5,212.5,65,147.5,,,Terri Aiwohi,HI,USA,Raw,3
BD,F,Open,82.5,300,95,205,,,Artemira Sobrinho,,Brazil,Raw,1
BD,F,Open,82.5,277.5,,,,,Brittany Arriola,AZ,USA,Raw,2
BD,F,Open,100+,330.5,140,190.5,,,Trisha Puou,HI,USA,Single-ply,1
BD,F,Open,100+,357.5,117.5,240,,,Poha Henson,HI,USA,Raw,1
BD,F,Special Olympian,100,230,80,150,,152.5,Chloe Kaalund,CA,USA,Raw,1
BD,M,Submasters 33-39,67.5,242.5,85,157.5,,,Reece Bohlender,OK,USA,Raw,1
BD,M,Submasters 33-39,82.5,315,117.5,197.5,,,Humberto Rodriguez,AZ,USA,Raw,1
BD,M,Submasters 33-39,90,400,150,250,,,Kincaid Antolin,HI,USA,Raw,1
BD,M,Submasters 33-39,100,415,187.5,227.5,,,Joey Lewis,OK,USA,Single-ply,1
BD,M,Submasters 33-39,100,427.5,175,252.5,,,Joseph Adams,UT,USA,Raw,3
BD,M,Submasters 33-39,100,462.5,182.5,280,,,Nathan Ragragola,HI,USA,Raw,1
BD,M,Submasters 33-39,100,367.5,120,247.5,,,Antero Makila,,Finland,Raw,4
BD,M,Submasters 33-39,100,432.5,155,277.5,,,Mariano Miravalles,,Argentina,Raw,2
BD,M,Submasters 33-39,110,460,210,250,,,Tim Heisler,MT,USA,Single-ply,1
BD,M,Submasters 33-39,110,375,,,,,Roman Lara,AZ,USA,Raw,1
BD,M,Submasters 33-39,117.5,422.5,142.5,280,,,Tyler Frost,AL,USA,Raw,1
BD,M,Submasters 33-39,125,420.5,170.5,250,,,Rich Pierce,CA,USA,Raw,3
BD,M,Submasters 33-39,125,475,190,285,,,Gary Pantilla,AZ,USA,Raw,2
BD,M,Submasters 33-39,125,515.5,175,340.5,,,Alfredo Martín Rojas,,Argentina,Raw,1
BD,M,Submasters 33-39,140,,,332.5,,,Jake Briles,ID,USA,Single-ply,DQ
BD,M,Submasters 33-39,140+,417.5,147.5,270,,,Kelly Kolii,HI,USA,Raw,1
BD,F,Submasters 33-39,44,200,60,140,,,Diana Vallinoto,,Argentina,Raw,1
BD,F,Submasters 33-39,48,205,57.5,147.5,,,Jennifer Genato,CA,USA,Raw,1
BD,F,Submasters 33-39,52,215.5,65,150.5,,,April Hamon,TX,USA,Single-ply,1
BD,F,Submasters 33-39,75,235,,,,,Jamie Farmer,MT,USA,Multi-ply,1
BD,F,Submasters 33-39,100+,332.5,160,172.5,,,Annie Bowman,WA,USA,Single-ply,1
BD,M,Submasters 33-39,140+,242.5,102.5,140,,,Marquita Snow-Whiten,IL,USA,Raw,2
BD,F,Submasters 33-39,100+,357.5,117.5,240,,,Poha Henson,HI,USA,Raw,1
BD,M,Teen 12-13,44,132.5,42.5,90,,,Grady Springer,WA,USA,Raw,2
BD,M,Teen 12-13,44,120,,,,,Billy Farmer,MT,USA,Raw,3
BD,M,Teen 12-13,44,145.5,43,102.5,,107.5,Landon Villareal,HI,USA,Raw,1
BD,M,Teen 12-13,67.5,150,47.5,102.5,,,Sheriff Murrell,OK,USA,Raw,2
BD,M,Teen 12-13,67.5,180,72.5,107.5,,,Mikah Hall,HI,USA,Raw,1
BD,M,Teen 12-13,75,172.5,52.5,120,,,Joseph Straka,WA,USA,Raw,1
BD,M,Teen 12-13,90,152.5,52.5,100,,,David Decanini #1,TX,USA,Raw,1
BD,M,Teen 14-15,52,157.5,62.5,95,,,Brandon Newcomb,WA,USA,Raw,1
BD,M,Teen 14-15,60,215,67.5,147.5,,,Jeremy Sawyer,WA,USA,Raw,2
BD,M,Teen 14-15,60,237.5,80,157.5,,,Ramiro Yanez,TX,USA,Raw,1
BD,M,Teen 14-15,67.5,232.5,75,157.5,,,Trey Anderson,WA,USA,Raw,1
BD,M,Teen 14-15,75,222.5,70,152.5,,,Daniel Tupper,WA,USA,Raw,2
BD,M,Teen 14-15,75,255,95,160,96,,Zander McElroy,ID,USA,Raw,1
BD,M,Teen 14-15,82.5,282.5,97.5,185,,190,Mathew Sabo,TX,USA,Raw,1
BD,M,Teen 14-15,100,227.5,75,152.5,,,Mason Sorensen,WA,USA,Raw,1
BD,M,Teen 14-15,117.5,332.5,122.5,210,,,Nathan Ivey,WA,USA,Raw,1
BD,M,Teen 16-17,60,235,75,160,,,Logan Villareal,HI,USA,Raw,1
BD,M,Teen 16-17,82.5,382,149.5,232.5,,,Kaison Uehara,OR,USA,Raw,1
BD,M,Teen 16-17,90,325,115,210,,,Cory Wood,WI,USA,Single-ply,1
BD,M,Teen 18-19,67.5,337.5,,,,,Tyler Reopelle,MT,USA,Raw,1
BD,M,Teen 18-19,82.5,,,,,,Tarence Leggitt,TN,USA,Raw,DQ
BD,M,Teen 18-19,90,315,110,205,,,Joshua Quintanilla,TX,USA,Raw,1
BD,M,Teen 18-19,100,440,165,275,,,Austin Payne,WI,USA,Single-ply,1
BD,M,Teen 18-19,100,347.5,137.5,210,,,Jacob Meaker,TN,USA,Raw,1
BD,M,Teen 18-19,125,362.5,125,237.5,,,Fredrico Garcia,HI,USA,Raw,1
BD,F,Teen 14-15,52,180,47.5,132.5,,,Trulayna Ballo,HI,USA,Raw,1
BD,F,Teen 14-15,60,182.5,89.5,93,,,Iris Singleton,WA,USA,Raw,1
BD,F,Teen 14-15,75,225,72.5,152.5,,,Mataya Straka,WA,USA,Raw,1
BD,F,Teen 14-15,100,315,117.5,197.5,,,Tyara Straka,WA,USA,Raw,1
BD,F,Teen 16-17,44,120,40,80,,,Makalea Ramil,HI,USA,Raw,1
BD,F,Teen 16-17,52,128.5,45.5,83,,,Emma MacDonald,WA,USA,Raw,1
BD,F,Teen 16-17,82.5,150,47.5,102.5,,,Alaysha Whitehead,UT,USA,Raw,2
BD,F,Teen 16-17,82.5,158,52.5,105.5,,,Kamalio Kaleleiki,HI,USA,Raw,1
BD,F,Teen 16-17,100,203,65,138,,,Maudi Roscoe,WA,USA,Raw,1
BD,F,Teen 18-19,60,173,63,110,,,Isabella Theobald,HI,USA,Raw,1
BD,F,Teen 18-19,67.5,190,67.5,122.5,,,Geneveve Sawyer,WA,USA,Raw,1
BD,F,Teen 18-19,90,215.5,77.5,138,,,Brooklynn Hall,HI,USA,Raw,1
D,M,Class 1,67.5,225,,225,,,Jose Cabrera,CA,USA,Single-ply,1
D,M,Class 1,67.5,190,,190,,,Dave Constantineau,WI,USA,Raw,1
D,M,Class 1,75,192.5,,192.5,,,Zachary Carter,ID,USA,Raw,1
D,M,Class 1,82.5,205,,205,,,Nick Hillman,CA,USA,Raw,1
D,M,Class 1,90,190,,190,,,Bryan Vandiver,OK,USA,Single-ply,1
D,M,Class 1,90,230,,230,,,John Hickmott,UT,USA,Raw,1
D,M,Class 1,90,195,,195,,,Phillip Trotter,AR,USA,Raw,2
D,M,Class 1,90,142.5,,142.5,,,Darwin Cavanaugh,OK,USA,Raw,3
D,M,Class 1,100,275,,275,,,Austin Payne,WI,USA,Single-ply,1
D,M,Class 1,100,227.5,,227.5,,,Joey Lewis,OK,USA,Single-ply,2
D,M,Class 1,110,290,,290,,,Brian Fahrenfeld,NY,USA,Single-ply,1
D,M,Class 1,110,215,,215,,,Juan Romero,CA,USA,Raw,1
D,M,Class 1,117.5,275,,275,,,Matt Maini,AL,USA,Raw,1
D,M,Class 1,117.5,220,,220,,,Isaac Conde,TX,USA,Raw,2
D,M,Class 1,125,305,,305,,,David Palmer,ME,USA,Single-ply,1
D,M,Class 1,140,240,,240,,,Tarlus McDaniel,TX,USA,Single-ply,1
D,M,Class 1,140+,260,,260,,,Fred Riccardi,NY,USA,Single-ply,1
D,F,Class 1,56,110.5,,110.5,,,Bai'Lee Stovall,TN,USA,Raw,1
D,F,Class 1,56,77.5,,77.5,,,Christine Rich,WA,USA,Multi-ply,1
D,F,Class 1,60,142.5,,142.5,,,Anna Tamez,OR,USA,Raw,1
D,F,Class 1,60,102.5,,102.5,,,Susan Chloupek,WA,USA,Multi-ply,1
D,F,Class 1,67.5,160,,160,,,Rebecca Carter,ID,USA,Raw,1
D,F,Class 1,67.5,125,,125,,,Danielle Moliassa,WA,USA,Raw,2
D,F,Class 1,67.5,120,,120,,,Brittany Brown,TN,USA,Raw,3
D,F,Class 1,67.5,115,,115,,,Angie Buschman,CA,USA,Raw,4
D,F,Class 1,75,140,,140,,,Natalie Caughey,UT,USA,Single-ply,1
D,F,Class 1,75,137.5,,137.5,,,Mesha Blackwell,IL,USA,Raw,1
D,F,Class 1,82.5,130.5,,130.5,,,Amy Amber,CA,USA,Single-ply,1
D,F,Class 1,82.5,147.5,,147.5,,,Briana Lacey,AZ,USA,Raw,1
D,F,Class 1,82.5,142.5,,142.5,,152.5,DeAnna Dutton,WA,USA,Multi-ply,1
D,F,Class 1,90,125,,125,,,Kelley Deverall,UT,USA,Raw,1
D,F,Class 1,100,150,,150,,,Tamara Perry,HI,USA,Raw,1
D,M,Disabled 1 13-19,67.5,132.5,,132.5,,140,Clarence Kehres,CA,USA,Raw,1
D,M,Disabled 1 20-39,60,82.5,,82.5,,,Asif Chishi,CA,USA,Raw,1
D,M,Disabled 1 20-39,100,300,,300,,,Dustin McFarland,OR,USA,Raw,1
D,M,Disabled 1 40-59,100,212.5,,212.5,,,Steve Peña #1,CA,USA,Raw,1
D,M,Disabled 2 20-39,75,110,,110,,115,James Ferry,CA,USA,Raw,1
D,M,Disabled 2 20-39,82.5,215,,215,,,Martín San Felice,,Argentina,Raw,1
D,M,Disabled 2 20-39,90,195,,195,,,Phillip Trotter,AR,USA,Raw,1
D,M,Disabled 2 20-39,100,242.5,,242.5,,,Margarito Rodriguez,TX,USA,Raw,1
D,M,Disabled 2 40-59,75,182.5,,182.5,,,Chad McFarland,OR,USA,Raw,1
D,M,Disabled 2 40-59,125,173,,173,,,Don Miskinis,OH,USA,Raw,1
D,M,Disabled 2 60,75,120,,120,,122.5,Stan Miyahira,NV,USA,Single-ply,1
D,M,Disabled 2 60,90,,,,,,Alfred Franke,NV,USA,Multi-ply,DQ
D,M,Disabled 2 60,100,240.5,,240.5,,,Reid Solar,AZ,USA,Raw,1
D,M,Disabled 2 60,100,160,,160,,,Gary Flood,OK,USA,Multi-ply,1
D,M,Disabled 2 60,140+,170,,170,,,Alan Fraser,NV,USA,Single-ply,1
D,F,Disabled 2 20-39,56,137.5,,137.5,,,Jozee Hofman,MT,USA,Raw,1
D,F,Disabled 2 20-39,100,150,,150,,152.5,Chloe Kaalund,CA,USA,Raw,1
D,F,Disabled 2 60,82.5,117.5,,117.5,,,Marlene Wexler,MN,USA,Raw,1
D,M,Juniors 20-25,48,120,,120,,,Michael Pearson,WA,USA,Single-ply,1
D,M,Juniors 20-25,56,185,,185,,190,Travis Carr,MN,USA,Raw,1
D,M,Juniors 20-25,67.5,227.5,,227.5,,,Brian Miller,WI,USA,Raw,1
D,M,Juniors 20-25,67.5,172.5,,172.5,,,Joshua Wotherspoon,CA,USA,Raw,2
D,M,Juniors 20-25,75,215,,215,,,Julio Alfredo Fernnandez Rodriguez,,Guatemala,Single-ply,1
D,M,Juniors 20-25,75,227.5,,227.5,,,Logan Dalpoas,OK,USA,Raw,1
D,M,Juniors 20-25,82.5,195,,195,,,Travis Woods,CA,USA,Single-ply,1
D,M,Juniors 20-25,82.5,292.5,,292.5,,,Timothy Farris,TN,USA,Raw,1
D,M,Juniors 20-25,82.5,222.5,,222.5,,,Braden Jensen,UT,USA,Raw,2
D,M,Juniors 20-25,82.5,182.5,,182.5,,,Cody Washington,CA,USA,Raw,3
D,M,Juniors 20-25,90,227.5,,227.5,,,John Hickmott,UT,USA,Raw,1
D,M,Juniors 20-25,90,220,,220,,,Cody Mondeau,WI,USA,Raw,2
D,M,Juniors 20-25,100,297.5,,297.5,,,Haroldo Daniel Zepeda Hernández,,Guatemala,Single-ply,1
D,M,Juniors 20-25,100,190,,190,,,Caleb Rollins,AZ,USA,Raw,1
D,M,Juniors 20-25,110,272.5,,272.5,,,Andrew Levensalor,ME,USA,Single-ply,1
D,M,Juniors 20-25,140,350,,350,,,Alec Williamson,AZ,USA,Raw,1
D,M,Juniors 20-25,140+,297.5,,297.5,,,Kyle Lockhart,ME,USA,Raw,1
D,M,Juniors 20-25,140+,285,,285,,,Donald Loew,WI,USA,Raw,2
D,F,Juniors 20-25,56,98,,98,,100,Natalie Massa,CA,USA,Multi-ply,1
D,F,Juniors 20-25,90,152.5,,152.5,,,Christine Hipa,HI,USA,Raw,1
D,F,Juniors 20-25,100,150,,150,,,Shania Wood,WA,USA,Raw,1
D,M,Law-Fire 40-47,90,253,,253,,,Jeff Holz,NV,USA,Raw,1
D,M,Law-Fire 40-47,90,192.5,,192.5,,,Raymond Cullar,IL,USA,Raw,2
D,M,Law-Fire 40-47,100,205,,205,,,Nick Berriman,OR,USA,Raw,1
D,M,Law-Fire 40-47,110,275,,275,,,Freddy Crosby,IL,USA,Single-ply,1
D,M,Law-Fire 40-47,140,275,,275,,,Tommy Harrison,IL,USA,Single-ply,1
D,M,Law-Fire 40-47,140,275,,275,,,Chane Cline,OH,USA,Raw,1
D,F,Law-Fire 40-47,100+,102.5,,102.5,,,Kat Wiese,CA,USA,Raw,1
D,M,Law-Fire 48-55,82.5,265,,265,,272.5,Marcelo Lobo,,Argentina,Raw,1
D,M,Law-Fire 48-55,90,200,,200,,,Daniel Stewart,AR,USA,Single-ply,1
D,M,Law-Fire 48-55,90,247.5,,247.5,,,Jason Smith,OK,USA,Raw,1
D,M,Law-Fire 48-55,110,315,,315,,319,Wesley Beach,ID,USA,Single-ply,1
D,M,Law-Fire 48-55,110,227.5,,227.5,,,Lance Davis,UT,USA,Single-ply,2
D,M,Law-Fire 48-55,117.5,295,,295,,,Terry Putman,OK,USA,Single-ply,1
D,M,Law-Fire 48-55,117.5,162.5,,162.5,,182.5,Mark Rakestraw,CA,USA,Multi-ply,1
D,M,Law-Fire 48-55,140,205,,205,,,Darren Kaleleiki,HI,USA,Single-ply,1
D,M,Law-Fire 48-55,140,267.5,,267.5,,,Duke Gumpfar,HI,USA,Raw,1
D,M,Law-Fire 48-55,140+,150.5,,150.5,,,Scott Von Bargen,CA,USA,Raw,1
D,F,Law-Fire 48-55,67.5,120,,120,,,Monica Hagen,CA,USA,Raw,1
D,M,Law-Fire 56-63,82.5,200,,200,,,Larry Esquivel,CA,USA,Single-ply,1
D,M,Law-Fire 56-63,90,245,,245,,,Dan Guches,OR,USA,Raw,1
D,M,Law-Fire 56-63,90,215,,215,,,Scott Sciaretta,MT,USA,Raw,2
D,M,Law-Fire 56-63,125,147.5,,147.5,,,Michal Johnson,CA,USA,Multi-ply,1
D,M,Law-Fire 64+,60,125,,125,,,Gary Miller #2,NV,USA,Raw,1
D,M,Law-Fire 64+,82.5,232.5,,232.5,,,Charles McFarland,OR,USA,Raw,1
D,M,Law-Fire 64+,110,215,,215,,,Greg Prothman,WA,USA,Single-ply,1
D,M,Law-Fire Open,82.5,265,,265,,272.5,Marcelo Lobo,,Argentina,Raw,1
D,M,Law-Fire Open,90,253,,253,,,Jeff Holz,NV,USA,Raw,1
D,M,Law-Fire Open,90,245,,245,,,Dan Guches,OR,USA,Raw,2
D,M,Law-Fire Open,90,215,,215,,,Scott Sciaretta,MT,USA,Raw,3
D,M,Law-Fire Open,100,272.5,,272.5,,,Joseph Hamblock,IL,USA,Raw,1
D,M,Law-Fire Open,100,200,,200,,215,Wayne Peabody,CA,USA,Multi-ply,1
D,M,Law-Fire Open,110,315,,315,,319,Wesley Beach,ID,USA,Single-ply,1
D,M,Law-Fire Open,110,275,,275,,,Freddy Crosby,IL,USA,Single-ply,2
D,M,Law-Fire Open,110,182.5,,182.5,,191,Manny Burruel,CA,USA,Multi-ply,1
D,M,Law-Fire Open,140,275,,275,,,Tommy Harrison,IL,USA,Single-ply,1
D,M,Law-Fire Open,140,272.5,,272.5,,,Duke Gumpfar,HI,USA,Raw,1
D,M,Law-Fire Open,140+,305,,305,,,Anthony Marcus,HI,USA,Raw,1
D,M,Law-Fire Open,140+,305,,305,,,Keoni Reich,HI,USA,Multi-ply,1
D,F,Law-Fire Open,56,137.5,,137.5,,,Jozee Hofman,MT,USA,Raw,1
D,F,Law-Fire Open,100,238,,238,,242.5,Alisha Howard,WA,USA,Single-ply,1
D,M,Law-Fire Submasters,125,237.5,,237.5,,240,Ryan Eamon,MT,USA,Raw,1
D,M,Law-Fire Submasters,140+,305,,305,,,Anthony Marcus,HI,USA,Raw,1
D,F,Law-Fire Submasters,67.5,140,,140,,145,Joi Kiel,HI,USA,Raw,1
D,F,Law-Fire Submasters,75,87.5,,87.5,,,Lacey Alvernaz,OR,USA,Raw,1
D,M,Masters 40-46,82.5,265,,265,,,Chad Medina,NM,USA,Raw,1
D,M,Masters 40-46,82.5,240,,240,,,Ben Dehghan,WA,USA,Multi-ply,1
D,M,Masters 40-46,82.5,157.5,,157.5,,,Amit Bhardwaj,CA,USA,Multi-ply,2
D,M,Masters 40-46,90,237.5,,237.5,,,Andy Lenon,NV,USA,Raw,1
D,M,Masters 40-46,100,242.5,,242.5,,,Jesse Avila,UT,USA,Single-ply,1
D,M,Masters 40-46,100,227.5,,227.5,,,Robert Saludares,HI,USA,Single-ply,2
D,M,Masters 40-46,100,215,,215,,,Randy Fry,WI,USA,Raw,1
D,M,Masters 40-46,110,250,,250,,,Mel Lehano,HI,USA,Single-ply,1
D,M,Masters 40-46,110,230,,230,,,Wesley Briggs,AZ,USA,Raw,1
D,M,Masters 40-46,110,292.5,,292.5,,,Eduardo Elgart,,Argentina,Multi-ply,1
D,M,Masters 40-46,117.5,320,,320,,,Kari Pöntinen,,Finland,Single-ply,1
D,M,Masters 40-46,117.5,277.5,,277.5,,,Juha Märsylä,,Finland,Raw,1
D,M,Masters 40-46,117.5,265,,265,,,Tim Potteiger,OK,USA,Raw,2
D,M,Masters 40-46,125,260,,260,,,Allen Heisler,MT,USA,Single-ply,1
D,M,Masters 40-46,125,317.5,,317.5,,,Jeff Shellenberger,AZ,USA,Raw,1
D,M,Masters 40-46,125,280,,280,,,Jason Sacre,MT,USA,Raw,2
D,M,Masters 40-46,140,,,,,,Raul Valdez,TX,USA,Raw,DQ
D,M,Masters 40-46,140,275,,275,,,Jeremiah Johnson #3,UT,USA,Multi-ply,1
D,M,Masters 40-46,140+,325,,325,,,Ricardo Nort,,Brazil,Raw,1
D,M,Masters 40-46,140+,235,,235,,,Robert Vick,NV,USA,Raw,2
D,M,Masters 47-53,67.5,220.5,,220.5,,,Travis Collyar,AR,USA,Raw,1
D,M,Masters 47-53,75,227.5,,227.5,,,Chris Balanga,CA,USA,Single-ply,1
D,M,Masters 47-53,75,225,,225,,,Serafin de Simone,,Argentina,Raw,1
D,M,Masters 47-53,82.5,260,,260,,,Marchand Fleming,OK,USA,Raw,1
D,M,Masters 47-53,82.5,230,,230,,,Randal Gandeza,HI,USA,Raw,2
D,M,Masters 47-53,82.5,202.5,,202.5,,,Mike Stanchfield,MN,USA,Raw,3
D,M,Masters 47-53,90,247.5,,247.5,,,Jason Smith,OK,USA,Raw,1
D,M,Masters 47-53,90,142.5,,142.5,,,Darwin Cavanaugh,OK,USA,Raw,2
D,M,Masters 47-53,100,210,,210,,,Kim Päivöke,,Finland,Raw,1
D,M,Masters 47-53,100,197.5,,197.5,,,Toby Levensalor,ME,USA,Raw,2
D,M,Masters 47-53,110,305,,305,,,Tim Sparkes,AZ,USA,Single-ply,1
D,M,Masters 47-53,110,255,,255,,,John Westleigh,ME,USA,Single-ply,2
D,M,Masters 47-53,110,227.5,,227.5,,,Lance Davis,UT,USA,Single-ply,3
D,M,Masters 47-53,110,262.5,,262.5,,,John Thomas,FL,USA,Raw,1
D,M,Masters 47-53,110,292.5,,292.5,,,Robert Exum,CA,USA,Multi-ply,1
D,M,Masters 47-53,117.5,285.5,,285.5,,295,Jon Gealon,OR,USA,Raw,1
D,M,Masters 47-53,117.5,275,,275,,,Matt Maini,AL,USA,Raw,2
D,M,Masters 47-53,125,305,,305,,,David Palmer,ME,USA,Single-ply,1
D,M,Masters 47-53,125,287.5,,287.5,,,David Lewis,IL,USA,Single-ply,2
D,M,Masters 47-53,140,290,,290,,,Mike Dalpoas,OK,USA,Raw,1
D,M,Masters 47-53,140+,255,,255,,,John Heldt,NV,USA,Single-ply,1
D,M,Masters 47-53,140+,255,,255,,,Scott Bromeisl,WI,USA,Single-ply,2
D,M,Masters 47-53,140+,280,,280,,,Scott Wesley Jordan,AZ,USA,Raw,1
D,M,Masters 47-53,140+,252.5,,252.5,,,Thomas Guiney,OK,USA,Multi-ply,1
D,M,Masters 54-60,67.5,165,,165,,,James Needles,WA,USA,Raw,1
D,M,Masters 54-60,75,245,,245,,,Fulton White,NV,USA,Single-ply,1
D,M,Masters 54-60,75,205,,205,,,Nino Domingo,AZ,USA,Single-ply,2
D,M,Masters 54-60,75,230.5,,230.5,,,Keith Cunningham,WA,USA,Multi-ply,1
D,M,Masters 54-60,82.5,205,,205,,,David Brekke,CO,USA,Single-ply,1
D,M,Masters 54-60,82.5,187.5,,187.5,,,Rudy Lopez,CA,USA,Raw,1
D,M,Masters 54-60,90,190,,190,,,Bryan Vandiver,OK,USA,Single-ply,1
D,M,Masters 54-60,100,215,,215,,,Jim Williams #4,MN,USA,Raw,1
D,M,Masters 54-60,100,167.5,,167.5,,,Gene A Wenzel,OH,USA,Raw,2
D,M,Masters 54-60,100,,,,,,Percy Taylor,TX,USA,Multi-ply,DQ
D,M,Masters 54-60,110,275,,275,,,Bob Miller,MN,USA,Raw,1
D,M,Masters 54-60,110,205,,205,,,John Regis,ID,USA,Raw,2
D,M,Masters 54-60,110,222.5,,222.5,,227.5,Jim Presley,CA,USA,Multi-ply,1
D,M,Masters 54-60,117.5,295,,295,,,Terry Putman,OK,USA,Single-ply,1
D,M,Masters 54-60,125,297.5,,297.5,,,Tom Pennella,WA,USA,Single-ply,1
D,M,Masters 54-60,125,173,,173,,,Don Miskinis,OH,USA,Raw,1
D,M,Masters 54-60,140,207.5,,207.5,,,Steve Johnson #1,MN,USA,Single-ply,1
D,M,Masters 54-60,140,252.5,,252.5,,,George Strutzel,MT,USA,Raw,1
D,M,Masters 54-60,140,210,,210,,,Ray Gandeza Jr,HI,USA,Raw,2
D,M,Masters 54-60,140+,205,,205,,,James Mersberg,HI,USA,Multi-ply,1
D,M,Masters 61-67,60,125,,125,,,Chetram Mangra,NY,USA,Single-ply,1
D,M,Masters 61-67,67.5,190,,190,,,Dave Constantineau,WI,USA,Raw,1
D,M,Masters 61-67,67.5,90,,90,,,Raul Gerardo Rivas Lizano,,Peru,Raw,2
D,M,Masters 61-67,75,208,,208,,,John Clay,CO,USA,Single-ply,1
D,M,Masters 61-67,75,142.5,,142.5,,,Gary Johnson,AL,USA,Raw,1
D,M,Masters 61-67,82.5,232.5,,232.5,,,Charles McFarland,OR,USA,Raw,1
D,M,Masters 61-67,90,300.5,,300.5,,,Tom Eiseman,NJ,USA,Single-ply,1
D,M,Masters 61-67,90,295,,295,,,Leamon Woodley,WA,USA,Single-ply,2
D,M,Masters 61-67,90,165,,165,,,Randy Waldorf,MN,USA,Raw,1
D,M,Masters 61-67,90,137.5,,137.5,,,John Hammond,NV,USA,Raw,2
D,M,Masters 61-67,90,240,,240,,,David Bertier,CA,USA,Multi-ply,1
D,M,Masters 61-67,100,240.5,,240.5,,,Reid Solar,AZ,USA,Raw,1
D,M,Masters 61-67,100,215,,215,,,Jim Curley,CO,USA,Multi-ply,1
D,M,Masters 61-67,110,215,,215,,,Greg Prothman,WA,USA,Single-ply,1
D,M,Masters 61-67,110,152.5,,152.5,,,Gregg Ramsdell,GA,USA,Single-ply,2
D,M,Masters 61-67,110,217.5,,217.5,,,Mike Clason,OR,USA,Raw,1
D,M,Masters 61-67,110,216.5,,216.5,,,Eugene Merrill,AR,USA,Raw,2
D,M,Masters 61-67,110,205,,205,,,Mark Vainas,MA,USA,Raw,3
D,M,Masters 61-67,110,197.5,,197.5,,,Greg Sawyer,CA,USA,Raw,4
D,M,Masters 61-67,110,185,,185,,,Wayne Sowers,ME,USA,Raw,5
D,M,Masters 61-67,110,182.5,,182.5,,,Tom Gonnering,AL,USA,Raw,6
D,M,Masters 61-67,110,182.5,,182.5,,,Tom Gonnering,AL,USA,Raw,7
D,M,Masters 61-67,117.5,257.5,,257.5,,,Eddie Morgan,AR,USA,Single-ply,1
D,M,Masters 61-67,140+,245,,245,,,Joe Mickelson,WA,USA,Single-ply,1
D,M,Masters 68-74,56,122.5,,122.5,,,Frank Principati,AZ,USA,Raw,1
D,M,Masters 68-74,60,125,,125,,,Gary Miller #2,NV,USA,Raw,1
D,M,Masters 68-74,75,160,,160,,,James Christian #1,TX,USA,Single-ply,1
D,M,Masters 68-74,75,152.5,,152.5,,,Gary Witzel,WA,USA,Multi-ply,1
D,M,Masters 68-74,82.5,195,,195,,,Robert Batko,MI,USA,Raw,1
D,M,Masters 68-74,82.5,192.5,,192.5,,,Ed Regua,NM,USA,Raw,2
D,M,Masters 68-74,82.5,177.5,,177.5,,,Mark Clark,OR,USA,Raw,3
D,M,Masters 68-74,90,220,,220,,,Peter Murphy,CA,USA,Multi-ply,1
D,M,Masters 68-74,117.5,185,,185,,,Tom Matlock,AZ,USA,Raw,1
D,M,Masters 68-74,140+,170,,170,,182.5,Alan Fraser,NV,USA,Single-ply,1
D,M,Masters 75-79,60,87.5,,87.5,,,Eugene Kawamata,HI,USA,Raw,1
D,M,Masters 75-79,75,160,,160,,,Ray Gandeza Sr,HI,USA,Raw,1
D,M,Masters 75-79,82.5,182.5,,182.5,,,Tom Haggenmiller,MN,USA,Raw,1
D,M,Masters 75-79,90,147.5,,147.5,,,Tom Henslin,CA,USA,Raw,1
D,M,Masters 75-79,90,92.5,,92.5,,,Mike Haigwood,NV,USA,Raw,2
D,M,Masters 75-79,110,110,,110,,,William Coleman,HI,USA,Raw,1
D,M,Masters 80-84,67.5,137.5,,137.5,,142.5,Larry Vincent,OR,USA,Multi-ply,1
D,M,Masters 80-84,90,184,,184,,,John Herbein,PA,USA,Single-ply,1
D,M,Masters 85-89,67.5,82.5,,82.5,,,Gerald Foster,FL,USA,Raw,1
D,M,Masters 85-89,82.5,85,,85,,,Cleophus Scrutchions,IL,USA,Raw,1
D,M,Masters 85-89,90,147.5,,147.5,,,Ray Muller,AZ,USA,Raw,1
D,M,Masters 85-89,90,137.5,,137.5,,,William Leedy,CA,USA,Raw,2
D,M,Masters 90-94,75,52.5,,52.5,,58,Robert Fornachon,CA,USA,Raw,1
D,M,Masters 90-94,90,62.5,,62.5,,,James Weiss,CA,USA,Raw,1
D,F,Masters 40-46,56,142.5,,142.5,,,Jamie Field,CA,USA,Single-ply,1
D,F,Masters 40-46,60,120,,120,,,Stacy Matsuyama-Sekioka,HI,USA,Single-ply,1
D,F,Masters 40-46,60,150,,150,,,Leilani Felipe,HI,USA,Raw,1
D,F,Masters 40-46,60,102.5,,102.5,,,Heather Fry,WI,USA,Raw,2
D,F,Masters 40-46,67.5,157.5,,157.5,,,Fayelyn Kamiko,HI,USA,Raw,1
D,F,Masters 40-46,67.5,147.5,,147.5,,,Tonya Patrick,AZ,USA,Raw,2
D,F,Masters 40-46,75,112.5,,112.5,,,Sarah Johnson,MT,USA,Raw,1
D,F,Masters 40-46,75,90,,90,,,Natalie McChesney,CA,USA,Raw,2
D,F,Masters 40-46,82.5,140,,140,,,Brandi Kary,CA,USA,Single-ply,1
D,F,Masters 40-46,82.5,140,,140,,,Crystal Luiz-Jones,CA,USA,Raw,1
D,F,Masters 40-46,100,238,,238,,242.5,Alisha Howard,WA,USA,Single-ply,1
D,F,Masters 40-46,100,150,,150,,,Tamara Perry,HI,USA,Raw,1
D,F,Masters 40-46,100+,190.5,,190.5,,,Trisha Puou,HI,USA,Single-ply,1
D,F,Masters 40-46,100+,182.5,,182.5,,,Leilana McKindra,KS,USA,Raw,1
D,F,Masters 47-53,48,132.5,,132.5,,,Elizabeth Cabe,HI,USA,Raw,1
D,F,Masters 47-53,52,165,,165,,,Valesca Cristina Rocha,,Brazil,Single-ply,1
D,F,Masters 47-53,52,110,,110,,,Yu-Xin Hao,OH,USA,Raw,1
D,F,Masters 47-53,56,112.5,,112.5,,,Barbara Perris,OR,USA,Raw,1
D,F,Masters 47-53,56,65,,65,,,Amy Furman,CA,USA,Raw,2
D,F,Masters 47-53,60,120.5,,120.5,,127.5,Sagui Macias,CA,USA,Multi-ply,1
D,F,Masters 47-53,67.5,165,,165,,,Kathy Caraccioli,CA,USA,Single-ply,1
D,F,Masters 47-53,67.5,150,,150,,,Dede Soekardi,CA,USA,Single-ply,2
D,F,Masters 47-53,67.5,97.5,,97.5,,,Lori Barlow,CA,USA,Single-ply,3
D,F,Masters 47-53,75,170,,170,,,Mirtha Delatorre,CA,USA,Raw,1
D,F,Masters 47-53,82.5,205,,205,,,Artemira Sobrinho,,Brazil,Raw,1
D,F,Masters 47-53,90,162.5,,162.5,,,Akondaye Fountain,TX,USA,Raw,1
D,F,Masters 47-53,90,122.5,,122.5,,,Amy Kalal,MN,USA,Raw,2
D,F,Masters 54-60,52,120,,120,,,Miriam Bucks,CA,USA,Single-ply,1
D,F,Masters 54-60,52,95,,95,,97.5,Shirley Lopez,CA,USA,Raw,1
D,F,Masters 54-60,56,127.5,,127.5,,,Griselda Soler,,Argentina,Raw,1
D,F,Masters 54-60,56,72.5,,72.5,,,Judy Veloz,CA,USA,Raw,2
D,F,Masters 54-60,56,77.5,,77.5,,,Christine Rich,WA,USA,Multi-ply,1
D,F,Masters 54-60,60,158,,158,,,Annette McBride,ID,USA,Raw,1
D,F,Masters 54-60,60,110.5,,110.5,,,Ardith Stitt,UT,USA,Raw,2
D,F,Masters 54-60,60,130,,130,,132.5,Martha Godinez-Shim,HI,USA,Multi-ply,1
D,F,Masters 54-60,60,113.5,,113.5,,,Betty Hansen,CA,USA,Multi-ply,2
D,F,Masters 54-60,67.5,112.5,,112.5,,,Rebecca Moore,WA,USA,Multi-ply,1
D,F,Masters 54-60,82.5,142.5,,142.5,,,Josefina Jackson,TX,USA,Single-ply,1
D,F,Masters 54-60,82.5,147.5,,147.5,,,Terri Aiwohi,HI,USA,Raw,1
D,F,Masters 54-60,82.5,142.5,,142.5,,152.5,DeAnna Dutton,WA,USA,Multi-ply,1
D,F,Masters 54-60,90,105,,105,,,Deborah Maxwell,CA,USA,Raw,1
D,F,Masters 54-60,90,95,,95,,102.5,Analia Zalopany,HI,USA,Raw,2
D,F,Masters 61-67,44,61,,61,,65,Pamela Robinson,CA,USA,Raw,1
D,F,Masters 61-67,48,105,,105,,,Debbie Rogers,WA,USA,Raw,1
D,F,Masters 61-67,48,68,,68,,,Lynne Nakama,HI,USA,Raw,2
D,F,Masters 61-67,60,102.5,,102.5,,,Susan Chloupek,WA,USA,Multi-ply,1
D,F,Masters 61-67,67.5,175,,175,,182.5,Jane McCubbin,WI,USA,Raw,1
D,F,Masters 61-67,67.5,152.5,,152.5,,,Nadine Brack,WA,USA,Raw,2
D,F,Masters 61-67,67.5,152.5,,152.5,,,Peach Presley,CA,USA,Multi-ply,1
D,F,Masters 61-67,75,110,,110,,,Jeanne Morris,WA,USA,Raw,1
D,F,Masters 61-67,75,97.5,,97.5,,100,Kim Grimes,CA,USA,Multi-ply,1
D,F,Masters 61-67,100,110,,110,,,Sue Vaterlaus,CA,USA,Single-ply,1
D,F,Masters 61-67,100,130.5,,130.5,,,Margie Huston,WA,USA,Raw,1
D,F,Masters 68-74,52,83.5,,83.5,,,Sherry Abblett,CA,USA,Raw,1
D,F,Masters 68-74,56,83,,83,,,Leona Pereza,HI,USA,Raw,1
D,F,Masters 68-74,75,137.5,,137.5,,,Judith Petray,CA,USA,Single-ply,1
D,F,Masters 68-74,75,95,,95,,,Jacqueline Fendler,MN,USA,Raw,1
D,F,Masters 68-74,82.5,117.5,,117.5,,,Marlene Wexler,MN,USA,Raw,1
D,F,Masters 75-79,56,57.5,,57.5,,60,Patricia Hamamoto,HI,USA,Raw,1
D,F,Masters 75-79,75,110,,110,,,Pat Robey,WA,USA,Single-ply,1
D,F,Masters 75-79,82.5,65,,65,,,Virginia Brookins-Brown,CA,USA,Raw,1
D,F,Masters 80-84,60,98.5,,98.5,,,Carrie Reese,CA,USA,Raw,1
D,F,Masters 90,90,,,,,,Gloria Mighell,OR,USA,Raw,DQ
D,M,Open,52,,,,,,Landon Sakai,HI,USA,Single-ply,DQ
D,M,Open,67.5,215,,215,,,Pablo Rodriguez,,Argentina,Single-ply,1
D,M,Open,67.5,117.5,,117.5,,,Tavit Karabetyan,CA,USA,Raw,1
D,M,Open,75,215,,215,,,Julio Alfredo Fernnandez Rodriguez,,Guatemala,Single-ply,1
D,M,Open,75,267.5,,267.5,,,Derrick Cooper,ME,USA,Raw,1
D,M,Open,75,225,,225,,,Serafin de Simone,,Argentina,Raw,2
D,M,Open,75,167.5,,167.5,,,Jordan Rogers,OK,USA,Raw,3
D,M,Open,82.5,280,,280,,,Steven Bassetti,CA,USA,Single-ply,1
D,M,Open,82.5,250,,250,,,Burt Duer,CA,USA,Single-ply,2
D,M,Open,82.5,240,,240,,,Ben Dehghan,WA,USA,Multi-ply,1
D,M,Open,90,300.5,,300.5,,,Tom Eiseman,NJ,USA,Single-ply,1
D,M,Open,90,297.5,,297.5,,,Nick Rosencutter,WI,USA,Single-ply,2
D,M,Open,90,265,,265,,,Max Panziera,CA,USA,Single-ply,3
D,M,Open,90,237.5,,237.5,,,Andy Lenon,NV,USA,Raw,1
D,M,Open,100,355,,355,,,Kalle Räsänen,,Finland,Single-ply,1
D,M,Open,100,297.5,,297.5,,,Haroldo Daniel Zepeda Hernández,,Guatemala,Single-ply,2
D,M,Open,100,282.5,,282.5,,,Marks Labostrie,TX,USA,Single-ply,3
D,M,Open,100,237.5,,237.5,,,Jake Romo,CA,USA,Single-ply,4
D,M,Open,100,210,,210,,,Jack Rogers,OK,USA,Single-ply,5
D,M,Open,100,277.5,,277.5,,,Mariano Miravalles,,Argentina,Raw,1
D,M,Open,100,247.5,,247.5,,,Antero Makila,,Finland,Raw,2
D,M,Open,100,215,,215,,,Randy Fry,WI,USA,Raw,3
D,M,Open,100,210,,210,,,Kim Päivöke,,Finland,Raw,4
D,M,Open,110,305,,305,,,Tim Sparkes,AZ,USA,Single-ply,1
D,M,Open,110,272.5,,272.5,,,Andrew Levensalor,ME,USA,Single-ply,2
D,M,Open,110,287.5,,287.5,,,Ira Kekaualua,WA,USA,Raw,1
D,M,Open,110,262.5,,262.5,,,Donovan Ballo,HI,USA,Raw,2
D,M,Open,110,292.5,,292.5,,,Robert Exum,CA,USA,Multi-ply,1
D,M,Open,110,292.5,,292.5,,,Eduardo Elgart,,Argentina,Multi-ply,2
D,M,Open,117.5,320,,320,,,Kari Pöntinen,,Finland,Single-ply,1
D,M,Open,117.5,280,,280,,,Tyler Frost,AL,USA,Raw,1
D,M,Open,117.5,277.5,,277.5,,,Juha Märsylä,,Finland,Raw,2
D,M,Open,125,340.5,,340.5,,,Alfredo Martín Rojas,,Argentina,Raw,1
D,M,Open,125,285,,285,,,Gary Pantilla,AZ,USA,Raw,2
D,M,Open,125,280,,280,,,Jason Sacre,MT,USA,Raw,3
D,M,Open,140,332.5,,332.5,,,Jake Briles,ID,USA,Single-ply,1
D,M,Open,140,332.5,,332.5,,,Kamuela Wassman,HI,USA,Single-ply,2
D,M,Open,140,242.5,,242.5,,,River Newman,MT,USA,Single-ply,3
D,M,Open,140,275,,275,,,Jeremiah Johnson #3,UT,USA,Multi-ply,1
D,M,Open,140+,245,,245,,,Joe Mickelson,WA,USA,Single-ply,1
D,M,Open,140+,325,,325,,,Ricardo Nort,,Brazil,Raw,1
D,M,Open,140+,280,,280,,,Scott Wesley Jordan,AZ,USA,Raw,2
D,M,Open,140+,305,,305,,,Keoni Reich,HI,USA,Multi-ply,1
D,M,Open,140+,252.5,,252.5,,,Thomas Guiney,OK,USA,Multi-ply,2
D,F,Open,44,140,,140,,,Diana Vallinoto,,Argentina,Raw,1
D,F,Open,44,72.5,,72.5,,,Hannah Furman,CA,USA,Raw,2
D,F,Open,48,147.5,,147.5,,,Jennifer Genato,CA,USA,Raw,1
D,F,Open,48,140,,140,,,Jade Bunk,WI,USA,Raw,2
D,F,Open,48,127.5,,127.5,,,Micaela Lopez,,Argentina,Raw,3
D,F,Open,48,77.5,,77.5,,,Vanessa Furman,CA,USA,Raw,4
D,F,Open,52,165,,165,,,Valesca Cristina Rocha,,Brazil,Single-ply,1
D,F,Open,52,,,,,,April Hamon,TX,USA,Single-ply,DQ
D,F,Open,56,142.5,,142.5,,,Jamie Field,CA,USA,Single-ply,1
D,F,Open,56,127.5,,127.5,,,Griselda Soler,,Argentina,Raw,1
D,F,Open,60,170,,170,,,Tracee Iranon,HI,USA,Single-ply,1
D,F,Open,60,120,,120,,,Stacy Matsuyama-Sekioka,HI,USA,Single-ply,2
D,F,Open,60,150,,150,,,Leilani Felipe,HI,USA,Raw,1
D,F,Open,60,130,,130,,132.5,Martha Godinez-Shim,HI,USA,Multi-ply,1
D,F,Open,67.5,177.5,,177.5,,,Janesa Yadao,HI,USA,Single-ply,1
D,F,Open,67.5,170,,170,,,Samantha Panziera,CA,USA,Single-ply,2
D,F,Open,67.5,175,,175,,182.5,Jane McCubbin,WI,USA,Raw,1
D,F,Open,67.5,160,,160,,,Marianne Hartio,,Finland,Raw,2
D,F,Open,67.5,157.5,,157.5,,,Alyssa Turose,AZ,USA,Raw,3
D,F,Open,67.5,147.5,,147.5,,,Tonya Patrick,AZ,USA,Raw,4
D,F,Open,67.5,120,,120,,,Brittany Brown,TN,USA,Raw,5
D,F,Open,82.5,205,,205,,,Artemira Sobrinho,,Brazil,Raw,1
D,F,Open,82.5,147.5,,147.5,,,Terri Aiwohi,HI,USA,Raw,2
D,F,Open,82.5,145,,145,,,Victoria Woods,CA,USA,Raw,3
D,F,Open,100+,190.5,,190.5,,,Trisha Puou,HI,USA,Single-ply,1
D,F,Open,100+,240,,240,,,Poha Henson,HI,USA,Raw,1
D,F,Open,100+,215,,215,,,Makala Davis,AZ,USA,Raw,2
D,F,Special Olympian,100,150,,150,,152.5,Chloe Kaalund,CA,USA,Raw,1
D,M,Submasters 33-39,67.5,157.5,,157.5,,,Reece Bohlender,OK,USA,Raw,1
D,M,Submasters 33-39,75,295,,295,,318,Edwin Manmano,HI,USA,Single-ply,1
D,M,Submasters 33-39,75,285.5,,285.5,,,Ryan Snelling,MO,USA,Single-ply,2
D,M,Submasters 33-39,75,267.5,,267.5,,,Derrick Cooper,ME,USA,Raw,1
D,M,Submasters 33-39,82.5,227.5,,227.5,,,Willard Crossen III,WA,USA,Single-ply,1
D,M,Submasters 33-39,82.5,197.5,,197.5,,,Humberto Rodriguez,AZ,USA,Raw,1
D,M,Submasters 33-39,90,250,,250,,,Kincaid Antolin,HI,USA,Raw,1
D,M,Submasters 33-39,100,227.5,,227.5,,,Joey Lewis,OK,USA,Single-ply,1
D,M,Submasters 33-39,100,280,,280,,,Nathan Ragragola,HI,USA,Raw,1
D,M,Submasters 33-39,100,277.5,,277.5,,,Mariano Miravalles,,Argentina,Raw,2
D,M,Submasters 33-39,100,252.5,,252.5,,,Joseph Adams,UT,USA,Raw,3
D,M,Submasters 33-39,100,247.5,,247.5,,,Antero Makila,,Finland,Raw,4
D,M,Submasters 33-39,110,250,,250,,,Tim Heisler,MT,USA,Single-ply,1
D,M,Submasters 33-39,110,287.5,,287.5,,,Ira Kekaualua,WA,USA,Raw,1
D,M,Submasters 33-39,117.5,280,,280,,,Tyler Frost,AL,USA,Raw,1
D,M,Submasters 33-39,125,340.5,,340.5,,,Alfredo Martín Rojas,,Argentina,Raw,1
D,M,Submasters 33-39,125,285,,285,,,Gary Pantilla,AZ,USA,Raw,2
D,M,Submasters 33-39,125,250,,250,,,Rich Pierce,CA,USA,Raw,3
D,M,Submasters 33-39,140,332.5,,332.5,,,Jake Briles,ID,USA,Single-ply,1
D,M,Submasters 33-39,140+,270,,270,,,Kelly Kolii,HI,USA,Raw,1
D,F,Submasters 33-39,44,140,,140,,,Diana Vallinoto,,Argentina,Raw,1
D,F,Submasters 33-39,48,147.5,,147.5,,,Jennifer Genato,CA,USA,Raw,1
D,F,Submasters 33-39,52,150.5,,150.5,,,April Hamon,TX,USA,Single-ply,1
D,F,Submasters 33-39,67.5,152.5,,152.5,,,Jennifer Ayala,CA,USA,Raw,1
D,F,Submasters 33-39,67.5,115,,115,,120.5,Marisa Boyns,CA,USA,Raw,2
D,F,Submasters 33-39,82.5,145,,145,,,Nicole Campbell,CA,USA,Single-ply,1
D,F,Submasters 33-39,100+,172.5,,172.5,,,Annie Bowman,WA,USA,Single-ply,1
D,F,Submasters 33-39,100+,240,,240,,,Poha Henson,HI,USA,Raw,1
D,M,Submasters 33-39,140+,140,,140,,,Marquita Snow-Whiten,IL,USA,Raw,2
D,M,Teen 12-13,44,102.5,,102.5,,107.5,Landon Villareal,HI,USA,Raw,1
D,M,Teen 12-13,44,90,,90,,,Grady Springer,WA,USA,Raw,2
D,M,Teen 12-13,48,80.5,,80.5,,,Casen Ramirez,MN,USA,Raw,1
D,M,Teen 12-13,67.5,107.5,,107.5,,,Mikah Hall,HI,USA,Raw,1
D,M,Teen 12-13,67.5,102.5,,102.5,,,Sheriff Murrell,OK,USA,Raw,2
D,M,Teen 12-13,75,120,,120,,,Joseph Straka,WA,USA,Raw,1
D,M,Teen 12-13,90,100,,100,,,David Decanini #1,TX,USA,Raw,1
D,M,Teen 14-15,52,95,,95,,,Brandon Newcomb,WA,USA,Raw,1
D,M,Teen 14-15,60,157.5,,157.5,,,Ramiro Yanez,TX,USA,Raw,1
D,M,Teen 14-15,60,147.5,,147.5,,,Jeremy Sawyer,WA,USA,Raw,2
D,M,Teen 14-15,67.5,157.5,,157.5,,,Trey Anderson,WA,USA,Raw,1
D,M,Teen 14-15,67.5,117.5,,117.5,,,Wyatt Dawson Cavanaugh,OK,USA,Raw,2
D,M,Teen 14-15,75,198,,198,,,Ethan Williams,MN,USA,Raw,1
D,M,Teen 14-15,75,160,,160,,,Zander McElroy,ID,USA,Raw,2
D,M,Teen 14-15,75,152.5,,152.5,,,Daniel Tupper,WA,USA,Raw,3
D,M,Teen 14-15,82.5,185,,185,,190,Mathew Sabo,TX,USA,Raw,1
D,M,Teen 14-15,100,152.5,,152.5,,,Mason Sorensen,WA,USA,Raw,1
D,M,Teen 14-15,110,183,,183,,,Blake Lemasters,OK,USA,Raw,1
D,M,Teen 14-15,117.5,210,,210,,,Nathan Ivey,WA,USA,Raw,1
D,M,Teen 14-15,125,160,,160,,,Robert Vick Jr,NV,USA,Raw,1
D,M,Teen 16-17,60,160,,160,,,Logan Villareal,HI,USA,Raw,1
D,M,Teen 16-17,82.5,232.5,,232.5,,,Kaison Uehara,OR,USA,Raw,1
D,M,Teen 16-17,90,210,,210,,,Cory Wood,WI,USA,Single-ply,1
D,M,Teen 16-17,125,202.5,,202.5,,,Martin Rodriguez,TX,USA,Raw,1
D,M,Teen 18-19,67.5,182.5,,182.5,,,Tyler Farmer,MT,USA,Raw,1
D,M,Teen 18-19,82.5,167.5,,167.5,,,Ethan Tawater,HI,USA,Raw,1
D,M,Teen 18-19,90,205,,205,,,Joshua Quintanilla,TX,USA,Raw,1
D,M,Teen 18-19,90,,,,,,Jacques Le Duc,WI,USA,Raw,DQ
D,M,Teen 18-19,100,275,,275,,,Austin Payne,WI,USA,Single-ply,1
D,M,Teen 18-19,100,237.5,,237.5,,,Jake Romo,CA,USA,Single-ply,2
D,M,Teen 18-19,100,197.5,,197.5,,,Tony Delgado,WA,USA,Raw,1
D,M,Teen 18-19,125,237.5,,237.5,,,Fredrico Garcia,HI,USA,Raw,1
D,F,Teen 12-13,48,82.5,,82.5,,,Carys Urasaki,HI,USA,Raw,1
D,F,Teen 14-15,52,132.5,,132.5,,,Trulayna Ballo,HI,USA,Raw,1
D,F,Teen 14-15,60,120,,120,,,Iris Singleton,WA,USA,Raw,1
D,F,Teen 14-15,60,78,,78,,,Amanda Brown,CA,USA,Multi-ply,1
D,F,Teen 14-15,75,152.5,,152.5,,,Mataya Straka,WA,USA,Raw,1
D,F,Teen 14-15,100,197.5,,197.5,,,Tyara Straka,WA,USA,Raw,1
D,F,Teen 16-17,44,80,,80,,,Makalea Ramil,HI,USA,Raw,1
D,F,Teen 16-17,52,83,,83,,,Emma MacDonald,WA,USA,Raw,1
D,F,Teen 16-17,56,110.5,,110.5,,,Bai'Lee Stovall,TN,USA,Raw,1
D,F,Teen 16-17,56,122.5,,122.5,,132.5,Katee Peabody,CA,USA,Multi-ply,1
D,F,Teen 16-17,75,138,,138,,,Keilani Davis,FL,USA,Raw,1
D,F,Teen 16-17,82.5,125,,125,,132.5,Jazzmin White,HI,USA,Raw,1
D,F,Teen 16-17,82.5,105.5,,105.5,,115,Kamalio Kaleleiki,HI,USA,Raw,2
D,F,Teen 16-17,82.5,102.5,,102.5,,,Alaysha Whitehead,UT,USA,Raw,3
D,F,Teen 16-17,100,151,,151,,155,Sophie Larson,WI,USA,Raw,1
D,F,Teen 16-17,100,138,,138,,,Maudi Roscoe,WA,USA,Raw,2
D,F,Teen 18-19,60,110,,110,,,Isabella Theobald,HI,USA,Raw,1
D,F,Teen 18-19,67.5,122.5,,122.5,,,Geneveve Sawyer,WA,USA,Raw,1
D,F,Teen 18-19,90,138,,138,,140,Brooklynn Hall,HI,USA,Raw,1
B,M,Class 1,67.5,135,135,,,,Jose Cabrera,CA,USA,Single-ply,1
B,M,Class 1,75,150,150,,,,Nick Buck,WI,USA,Single-ply,1
B,M,Class 1,75,135,135,,,,Zachary Carter,ID,USA,Raw,1
B,M,Class 1,82.5,147.5,147.5,,,,Chakkaphong Artwichai,TN,USA,Raw,1
B,M,Class 1,82.5,135.5,135.5,,,,Tanner Bogart,WA,USA,Raw,2
B,M,Class 1,82.5,132.5,132.5,,,,Nick Hillman,CA,USA,Raw,3
B,M,Class 1,90,125,125,,,,Bryan Vandiver,OK,USA,Single-ply,1
B,M,Class 1,90,120,120,,,,Darwin Cavanaugh,OK,USA,Single-ply,2
B,M,Class 1,90,190,190,,,,Bryson Murata,HI,USA,Raw,1
B,M,Class 1,90,170,170,,,,Mark Shasteen,TN,USA,Raw,2
B,M,Class 1,90,160,160,,,,Phillip Trotter,AR,USA,Raw,3
B,M,Class 1,90,,,,,,John Hickmott,UT,USA,Raw,DQ
B,M,Class 1,100,187.5,187.5,,,,Joey Lewis,OK,USA,Single-ply,1
B,M,Class 1,100,170,170,,,,Dave Wallentine,WA,USA,Single-ply,2
B,M,Class 1,100,165,165,,,,Austin Payne,WI,USA,Single-ply,3
B,M,Class 1,100,182.5,182.5,,,,Robert Villagomez,AZ,USA,Raw,1
B,M,Class 1,110,207.5,207.5,,,,Michael Happach,IL,USA,Single-ply,1
B,M,Class 1,110,152.5,152.5,,,,Juan Romero,CA,USA,Raw,1
B,M,Class 1,117.5,147.5,147.5,,,,Isaac Conde,TX,USA,Raw,1
B,M,Class 1,125,230,230,,,,David Palmer,ME,USA,Single-ply,1
B,M,Class 1,125,130,130,,,,Byron Leyritz,WA,USA,Raw,1
B,M,Class 1,125,100,100,,,,John Solleder,TX,USA,Raw,2
B,M,Class 1,140+,195,195,,,,Marcus Hannah,IL,USA,Raw,1
B,M,Class 1,140+,175,175,,,,Kalen Tobey,AR,USA,Raw,2
B,F,Class 1,60,60,60,,,,Anna Tamez,OR,USA,Raw,1
B,F,Class 1,67.5,67.5,67.5,,,,Rebecca Carter,ID,USA,Raw,1
B,F,Class 1,67.5,55,55,,,,Kellye Millrany,TN,USA,Raw,2
B,F,Class 1,67.5,52.5,52.5,,,,Danielle Moliassa,WA,USA,Raw,3
B,F,Class 1,75,67.5,67.5,,,,Mesha Blackwell,IL,USA,Raw,1
B,F,Class 1,82.5,65,65,,,,Briana Lacey,AZ,USA,Raw,1
B,F,Class 1,82.5,42.5,42.5,,,,Amy Amber,CA,USA,Raw,2
B,F,Class 1,82.5,87.5,87.5,,,,DeAnna Dutton,WA,USA,Multi-ply,1
B,F,Class 1,100,75,75,,,,Tamara Perry,HI,USA,Raw,1
B,F,Class 1,100+,85,85,,,,Dot Sosnicki,AZ,USA,Raw,1
B,M,Disabled 1 13-19,67.5,65,65,,70,,Clarence Kehres,CA,USA,Raw,1
B,M,Disabled 1 20-39,60,90,90,,92.5,,Asif Chishi,CA,USA,Raw,1
B,M,Disabled 1 20-39,100,180,180,,182.5,,Keith Stich,PA,USA,Single-ply,1
B,M,Disabled 1 20-39,100,127.5,127.5,,,,Dustin McFarland,OR,USA,Raw,1
B,M,Disabled 1 40-59,56,85,85,,,,Gerardo Merino Jaramillo,,Ecuador,Raw,1
B,M,Disabled 1 40-59,75,97.5,97.5,,,,Jimmy Mora,,Ecuador,Raw,1
B,M,Disabled 1 60,117.5,67.5,67.5,,,,Mac McClatchey,WI,USA,Raw,1
B,F,Disabled 1 60,67.5,48,48,,48.5,,Susan Rosenquist,CA,USA,Raw,1
B,M,Disabled 2 20-39,75,62.5,62.5,,70,,James Ferry,CA,USA,Raw,1
B,M,Disabled 2 20-39,90,160,160,,,,Phillip Trotter,AR,USA,Raw,1
B,M,Disabled 2 20-39,100,145,145,,152.5,,Margarito Rodriguez,TX,USA,Raw,1
B,M,Disabled 2 40-59,75,85,85,,,,Chad McFarland,OR,USA,Raw,1
B,M,Disabled 2 60,90,93.5,93.5,,94,,Alfred Franke,NV,USA,Multi-ply,1
B,M,Disabled 2 60,100,152.5,152.5,,,,Dan Swift,IL,USA,Multi-ply,1
B,M,Disabled 2 60,100,115,115,,,,Gary Flood,OK,USA,Multi-ply,2
B,M,Disabled 2 60,140+,117.5,117.5,,,,Alan Fraser,NV,USA,Single-ply,1
B,F,Disabled 2 20-39,56,55,55,,,,Jozee Hofman,MT,USA,Raw,1
B,F,Disabled 2 20-39,100,80,80,,,,Chloe Kaalund,CA,USA,Raw,1
B,F,Disabled 2 60,82.5,42.5,42.5,,,,Marlene Wexler,MN,USA,Raw,1
B,M,Elite Open,52,,,,,,Landon Sakai,HI,USA,Single-ply,DQ
B,M,Elite Open,75,240,240,,,,Donald Ramil,HI,USA,Single-ply,1
B,M,Elite Open,75,235.5,235.5,,,,Deron Agaran,HI,USA,Single-ply,2
B,M,Elite Open,82.5,,,,,,Willard Crossen III,WA,USA,Single-ply,DQ
B,M,Elite Open,100,340,340,,,,Greg Powell,TX,USA,Single-ply,1
B,M,Elite Open,100,337.5,337.5,,,,Ryan Marble,UT,USA,Single-ply,2
B,M,Juniors 20-25,48,97.5,97.5,,,,Michael Pearson,WA,USA,Single-ply,1
B,M,Juniors 20-25,56,90,90,,,,Travis Carr,MN,USA,Raw,1
B,M,Juniors 20-25,67.5,100,100,,,,Brian Miller,WI,USA,Raw,1
B,M,Juniors 20-25,67.5,82.5,82.5,,,,Joshua Wotherspoon,CA,USA,Raw,2
B,M,Juniors 20-25,75,140,140,,,,Julio Alfredo Fernnandez Rodriguez,,Guatemala,Single-ply,1
B,M,Juniors 20-25,82.5,175,175,,,,Travis Woods,CA,USA,Single-ply,1
B,M,Juniors 20-25,82.5,127.5,127.5,,,,Cody Washington,CA,USA,Raw,1
B,M,Juniors 20-25,90,112.5,112.5,,,,Cody Mondeau,WI,USA,Raw,1
B,M,Juniors 20-25,90,,,,,,John Hickmott,UT,USA,Raw,DQ
B,M,Juniors 20-25,100,195,195,,,,Haroldo Daniel Zepeda Hernández,,Guatemala,Single-ply,1
B,M,Juniors 20-25,100,137.5,137.5,,,,Caleb Rollins,AZ,USA,Raw,1
B,M,Juniors 20-25,110,232.5,232.5,,,,Andrew Levensalor,ME,USA,Single-ply,1
B,M,Juniors 20-25,140+,210,210,,,,Kyle Lockhart,ME,USA,Raw,1
B,M,Juniors 20-25,140+,140,140,,,,Donald Loew,WI,USA,Raw,2
B,F,Juniors 20-25,90,72.5,72.5,,,,Christine Hipa,HI,USA,Raw,1
B,F,Juniors 20-25,100,65,65,,,,Shania Wood,WA,USA,Raw,1
B,M,Law-Fire 40-47,90,167.5,167.5,,,,Raymond Cullar,IL,USA,Raw,1
B,M,Law-Fire 40-47,100,148.5,148.5,,,,Wayne Peabody,CA,USA,Raw,1
B,M,Law-Fire 40-47,100,140,140,,,,Nick Berriman,OR,USA,Raw,2
B,M,Law-Fire 40-47,110,272.5,272.5,,,,Freddy Crosby,IL,USA,Single-ply,1
B,M,Law-Fire 40-47,140,,,,,,Tommy Harrison,IL,USA,Single-ply,DQ
B,M,Law-Fire 48-55,117.5,115,115,,,,Mark Rakestraw,CA,USA,Raw,1
B,M,Law-Fire 48-55,140,227.5,227.5,,,,Darren Kaleleiki,HI,USA,Single-ply,1
B,M,Law-Fire 48-55,140+,215,215,,,,Warren Orr,,Canada,Single-ply,1
B,M,Law-Fire 48-55,140+,125,125,,,,Scott Von Bargen,CA,USA,Raw,1
B,F,Law-Fire 48-55,67.5,50,50,,,,Monica Hagen,CA,USA,Raw,1
B,M,Law-Fire 56-63,90,135,135,,,,Scott Sciaretta,MT,USA,Raw,1
B,M,Law-Fire 56-63,90,110,110,,112.5,,Dan Guches,OR,USA,Raw,2
B,M,Law-Fire 56-63,100,195,195,,,,Gary McFarland,CA,USA,Raw,1
B,M,Law-Fire 56-63,117.5,137.5,137.5,,,,Donald Bryant,WA,USA,Raw,1
B,M,Law-Fire 56-63,125,177.5,177.5,,,,Rudolf Schaap,CA,USA,Raw,1
B,M,Law-Fire 56-63,125,87.5,87.5,,92.5,,Michal Johnson,CA,USA,Raw,2
B,M,Law-Fire 56-63,140,182.5,182.5,,183,,Eric Jones,MI,USA,Raw,1
B,M,Law-Fire 64+,60,95.5,95.5,,,,Gary Miller #2,NV,USA,Raw,1
B,M,Law-Fire 64+,82.5,125,125,,,,Charles McFarland,OR,USA,Raw,1
B,M,Law-Fire 64+,100,125,125,,,,David Martinez #7,CA,USA,Raw,1
B,M,Law-Fire 64+,117.5,140,140,,,,Ken Tawzer,CA,USA,Raw,1
B,M,Law-Fire 64+,125,125.5,125.5,,,,Ed Acey,UT,USA,Raw,1
B,M,Law-Fire Open,90,195,195,,,,Darren Carr,UT,USA,Single-ply,1
B,M,Law-Fire Open,90,135,135,,,,Scott Sciaretta,MT,USA,Raw,1
B,M,Law-Fire Open,90,110,110,,112.5,,Dan Guches,OR,USA,Raw,2
B,M,Law-Fire Open,100,337.5,337.5,,352.5,,Ryan Marble,UT,USA,Single-ply,1
B,M,Law-Fire Open,110,205,205,,,,Freddy Crosby,IL,USA,Single-ply,1
B,M,Law-Fire Open,140,287.5,287.5,,,,Tommy Harrison,IL,USA,Single-ply,1
B,M,Law-Fire Open,140+,,,,,,Keoni Reich,HI,USA,Multi-ply,DQ
B,F,Law-Fire Open,56,55,55,,57.5,,Jozee Hofman,MT,USA,Raw,1
B,F,Law-Fire Open,100,171,171,,,,Alisha Howard,WA,USA,Single-ply,1
B,M,Law-Fire Submasters,125,185,185,,,,Ryan Eamon,MT,USA,Raw,1
B,M,Law-Fire Submasters,75,147.5,147.5,,,,Richard Brickey,MS,USA,Raw,1
B,F,Law-Fire Submasters,67.5,72.5,72.5,,,,Joi Kiel,HI,USA,Raw,1
B,F,Law-Fire Submasters,75,45,45,,,,Lacey Alvernaz,OR,USA,Raw,1
B,M,Masters 40-46,75,240,240,,,,Donald Ramil,HI,USA,Single-ply,1
B,M,Masters 40-46,82.5,165,165,,,,Chad Medina,NM,USA,Raw,1
B,M,Masters 40-46,82.5,80,80,,,,Amit Bhardwaj,CA,USA,Multi-ply,1
B,M,Masters 40-46,90,137.5,137.5,,,,Andy Lenon,NV,USA,Raw,1
B,M,Masters 40-46,100,230,230,,,,Jesse Avila,UT,USA,Single-ply,1
B,M,Masters 40-46,100,165,165,,,,Robert Saludares,HI,USA,Single-ply,2
B,M,Masters 40-46,100,,,,,,Coby Washburn,TX,USA,Single-ply,DQ
B,M,Masters 40-46,100,197.5,197.5,,,,Jason Carson,IL,USA,Raw,1
B,M,Masters 40-46,100,181,181,,,,Randy Fry,WI,USA,Raw,2
B,M,Masters 40-46,100,165,165,,,,Dennis Garcia,AZ,USA,Raw,3
B,M,Masters 40-46,110,,,,,,Mel Lehano,HI,USA,Raw,DQ
B,M,Masters 40-46,110,250,250,,,,Eduardo Elgart,,Argentina,Multi-ply,1
B,M,Masters 40-46,117.5,195,195,,,,Malcolm Lehano,NV,USA,Raw,1
B,M,Masters 40-46,117.5,177.5,177.5,,,,Juha Märsylä,,Finland,Raw,2
B,M,Masters 40-46,117.5,,,,,,Tim Potteiger,OK,USA,Raw,DQ
B,M,Masters 40-46,125,217.5,217.5,,,,Allen Heisler,MT,USA,Single-ply,1
B,M,Masters 40-46,125,177.5,177.5,,,,Jason Sacre,MT,USA,Raw,1
B,M,Masters 40-46,140,267.5,267.5,,,,Jeremiah Johnson #3,UT,USA,Multi-ply,1
B,M,Masters 40-46,140+,,,,,,Robert Vick,NV,USA,Single-ply,DQ
B,M,Masters 40-46,140+,212.5,212.5,,,,Marvin Bishop,OH,USA,Raw,1
B,M,Masters 47-53,67.5,125,125,,,,Travis Collyar,AR,USA,Raw,1
B,M,Masters 47-53,75,182.5,182.5,,,,Chris Balanga,CA,USA,Single-ply,1
B,M,Masters 47-53,75,152.5,152.5,,,,Craig Furman,CA,USA,Single-ply,2
B,M,Masters 47-53,75,165,165,,,,David R Smith,TX,USA,Raw,1
B,M,Masters 47-53,75,161,161,,,,Serafin de Simone,,Argentina,Raw,2
B,M,Masters 47-53,82.5,146.5,146.5,,,,Mike Stanchfield,MN,USA,Raw,1
B,M,Masters 47-53,82.5,130,130,,,,Marchand Fleming,OK,USA,Raw,2
B,M,Masters 47-53,90,120,120,,,,Darwin Cavanaugh,OK,USA,Single-ply,1
B,M,Masters 47-53,90,185,185,,,,Tommie Gentry,IL,USA,Raw,1
B,M,Masters 47-53,90,172.5,172.5,,,,Mark Shasteen,TN,USA,Raw,2
B,M,Masters 47-53,100,170,170,,,,Dave Wallentine,WA,USA,Single-ply,1
B,M,Masters 47-53,100,177.5,177.5,,,,Kim Päivöke,,Finland,Raw,1
B,M,Masters 47-53,100,112.5,112.5,,,,Toby Levensalor,ME,USA,Raw,2
B,M,Masters 47-53,110,277.5,277.5,,,,Joey Murphy,GA,USA,Single-ply,1
B,M,Masters 47-53,110,255,255,,,,John Westleigh,ME,USA,Single-ply,2
B,M,Masters 47-53,110,232.5,232.5,,,,Brant Bishop,AL,USA,Single-ply,3
B,M,Masters 47-53,110,207.5,207.5,,,,Michael Happach,IL,USA,Single-ply,4
B,M,Masters 47-53,117.5,232.5,232.5,,,,Mick Quilici,NV,USA,Single-ply,1
B,M,Masters 47-53,117.5,185,185,,,,Jon Gealon,OR,USA,Raw,1
B,M,Masters 47-53,125,275,275,,,,Glenn Machado,OR,USA,Single-ply,1
B,M,Masters 47-53,125,272.5,272.5,,,,David Lewis,IL,USA,Single-ply,2
B,M,Masters 47-53,125,230,230,,,,David Palmer,ME,USA,Single-ply,3
B,M,Masters 47-53,140,215,215,,,,Mike Dalpoas,OK,USA,Raw,1
B,M,Masters 47-53,140+,240,240,,,,Scott Bromeisl,WI,USA,Single-ply,1
B,M,Masters 47-53,140+,215,215,,,,Warren Orr,,Canada,Single-ply,2
B,M,Masters 47-53,140+,207.5,207.5,,,,Nathan Nash,SC,USA,Raw,1
B,M,Masters 47-53,140+,195,195,,,,Al Tanner,OK,USA,Raw,2
B,M,Masters 54-60,56,85,85,,,,Gerardo Merino Jaramillo,,Ecuador,Raw,1
B,M,Masters 54-60,75,235.5,235.5,,,,Deron Agaran,HI,USA,Single-ply,1
B,M,Masters 54-60,75,150,150,,,,Fulton White,NV,USA,Single-ply,2
B,M,Masters 54-60,75,115,115,,,,Nino Domingo,AZ,USA,Raw,1
B,M,Masters 54-60,75,97.5,97.5,,,,Jimmy Mora,,Ecuador,Raw,2
B,M,Masters 54-60,75,150.5,150.5,,,,Keith Cunningham,WA,USA,Multi-ply,1
B,M,Masters 54-60,82.5,130,130,,,,Patrick Young,ID,USA,Single-ply,1
B,M,Masters 54-60,82.5,152.5,152.5,,,,Kris Matsumoto,HI,USA,Raw,1
B,M,Masters 54-60,90,237.5,237.5,,,,Tony Coduto,IL,USA,Single-ply,1
B,M,Masters 54-60,90,125,125,,,,Bryan Vandiver,OK,USA,Single-ply,2
B,M,Masters 54-60,100,195,195,,,,Gary McFarland,CA,USA,Raw,1
B,M,Masters 54-60,100,157.5,157.5,,,,Randy Hilmer,AR,USA,Raw,2
B,M,Masters 54-60,100,107.5,107.5,,,,Gene A Wenzel,OH,USA,Raw,3
B,M,Masters 54-60,100,,,,,,Percy Taylor,TX,USA,Multi-ply,DQ
B,M,Masters 54-60,110,306,306,,,,Kenneth Millrany,TN,USA,Single-ply,1
B,M,Masters 54-60,110,177.5,177.5,,,,John Regis,ID,USA,Raw,1
B,M,Masters 54-60,110,155,155,,,,Bob Miller,MN,USA,Raw,2
B,M,Masters 54-60,110,165,165,,,,Jim Presley,CA,USA,Multi-ply,1
B,M,Masters 54-60,117.5,210,210,,,,Dave Sickler,WI,USA,Single-ply,1
B,M,Masters 54-60,125,177.5,177.5,,,,Rudolf Schaap,CA,USA,Raw,1
B,M,Masters 54-60,125,142.5,142.5,,,,Dana Everson,WI,USA,Raw,2
B,M,Masters 54-60,125,117.5,117.5,,,,Don Miskinis,OH,USA,Raw,3
B,M,Masters 54-60,125,100,100,,,,John Solleder,TX,USA,Raw,4
B,M,Masters 54-60,140,325,325,,,,Tim Moon,GA,USA,Single-ply,1
B,M,Masters 54-60,140,193,193,,,,George Strutzel,MT,USA,Raw,1
B,M,Masters 54-60,140,182.5,182.5,,,,Eric Jones,MI,USA,Raw,2
B,M,Masters 54-60,140+,80,80,,82.5,,Keith Sayles,TX,USA,Raw,1
B,M,Masters 54-60,140+,288.5,288.5,,,,Gary Shim,HI,USA,Multi-ply,1
B,M,Masters 54-60,140+,,,,,,James Mersberg,HI,USA,Multi-ply,DQ
B,M,Masters 61-67,60,100,100,,,,Chetram Mangra,NY,USA,Single-ply,1
B,M,Masters 61-67,67.5,105,105,,,,Dave Constantineau,WI,USA,Raw,1
B,M,Masters 61-67,67.5,62.5,62.5,,65,,Raul Gerardo Rivas Lizano,,Peru,Raw,2
B,M,Masters 61-67,75,115,115,,,,Steve Garbush,WA,USA,Raw,1
B,M,Masters 61-67,75,110,110,,,,Robert Dye,OH,USA,Raw,2
B,M,Masters 61-67,75,107.5,107.5,,,,Clotario Portuga Neto,,Brazil,Raw,3
B,M,Masters 61-67,75,102.5,102.5,,,,John Pastorius,OH,USA,Raw,4
B,M,Masters 61-67,75,75,75,,,,Gary Johnson,AL,USA,Raw,5
B,M,Masters 61-67,82.5,112.5,112.5,,,,Bob Baker,ID,USA,Raw,1
B,M,Masters 61-67,90,150,150,,,,Leamon Woodley,WA,USA,Single-ply,1
B,M,Masters 61-67,100,125,125,,,,David Martinez #7,CA,USA,Raw,1
B,M,Masters 61-67,110,112.5,112.5,,,,Gregg Ramsdell,GA,USA,Single-ply,1
B,M,Masters 61-67,110,178,178,,,,Tom Gonnering,AL,USA,Raw,1
B,M,Masters 61-67,110,177.5,177.5,,,,Don Rygh,MN,USA,Raw,2
B,M,Masters 61-67,110,137.5,137.5,,,,Wayne Sowers,ME,USA,Raw,3
B,M,Masters 61-67,110,112.5,112.5,,,,Greg Sawyer,CA,USA,Raw,4
B,M,Masters 61-67,110,110,110,,,,Mike Clason,OR,USA,Raw,5
B,M,Masters 61-67,110,87.5,87.5,,,,William B Caughey,UT,USA,Multi-ply,1
B,M,Masters 61-67,140,200,200,,210.5,,Forest Hofer,WA,USA,Raw,1
B,M,Masters 61-67,140+,227.5,227.5,,,,Joe Mickelson,WA,USA,Single-ply,1
B,M,Masters 61-67,140+,147.5,147.5,,,,Joe Morales,AZ,USA,Raw,1
B,M,Masters 68-74,60,95.5,95.5,,,,Gary Miller #2,NV,USA,Raw,1
B,M,Masters 68-74,75,132.5,132.5,,,,Keith Ha,HI,USA,Raw,1
B,M,Masters 68-74,75,,,,,,Gary Witzel,WA,USA,Multi-ply,DQ
B,M,Masters 68-74,82.5,120,120,,,,Ed Regua,NM,USA,Raw,1
B,M,Masters 68-74,82.5,107.5,107.5,,,,Daniel Hawkinson,MN,USA,Raw,2
B,M,Masters 68-74,82.5,107.5,107.5,,,,Jack Crouse,AZ,USA,Raw,3
B,M,Masters 68-74,82.5,97.5,97.5,,,,Bob Hochstein,IL,USA,Raw,4
B,M,Masters 68-74,82.5,92.5,92.5,,,,Mark Clark,OR,USA,Raw,5
B,M,Masters 68-74,82.5,80,80,,,,Robert Batko,MI,USA,Raw,6
B,M,Masters 68-74,117.5,140,140,,,,Ken Tawzer,CA,USA,Raw,1
B,M,Masters 68-74,117.5,85,85,,,,Tom Matlock,AZ,USA,Raw,2
B,M,Masters 75-79,60,42.5,42.5,,,,Eugene Kawamata,HI,USA,Raw,1
B,M,Masters 75-79,67.5,42.5,42.5,,,,Raymond Katayama,HI,USA,Raw,1
B,M,Masters 75-79,82.5,97.5,97.5,,,,John Bretz,PA,USA,Raw,1
B,M,Masters 75-79,82.5,82.5,82.5,,,,Tom Haggenmiller,MN,USA,Raw,2
B,M,Masters 75-79,82.5,67.5,67.5,,,,Arnold Pereza,HI,USA,Raw,3
B,M,Masters 75-79,90,95,95,,,,Mike Haigwood,NV,USA,Raw,1
B,M,Masters 75-79,110,92.5,92.5,,,,Daniel Smith III,CA,USA,Raw,1
B,M,Masters 75-79,125,125.5,125.5,,,,Ed Acey,UT,USA,Raw,1
B,M,Masters 80-84,67.5,87.5,87.5,,92.5,,Larry Vincent,OR,USA,Multi-ply,1
B,M,Masters 80-84,82.5,95,95,,,,William Prince,NV,USA,Multi-ply,1
B,M,Masters 80-84,82.5,80,80,,82.5,,Larry Joiner,CA,USA,Multi-ply,2
B,M,Masters 80-84,90,95,95,,,,John Herbein,PA,USA,Single-ply,1
B,M,Masters 85-89,67.5,40.5,40.5,,,,Gerald Foster,FL,USA,Raw,1
B,M,Masters 85-89,75,65,65,,,,Charles Vause,HI,USA,Raw,1
B,M,Masters 85-89,82.5,40,40,,,,Cleophus Scrutchions,IL,USA,Raw,1
B,M,Masters 85-89,90,82.5,82.5,,,,Joseph Di Gregorio,NV,USA,Raw,1
B,M,Masters 90,90,55.5,55.5,,,,James Weiss,CA,USA,Raw,1
B,F,Masters 40-46,56,92.5,92.5,,,,Jamie Field,CA,USA,Single-ply,1
B,F,Masters 40-46,60,85,85,,,,Stacy Matsuyama-Sekioka,HI,USA,Single-ply,1
B,F,Masters 40-46,60,75,75,,,,Leilani Felipe,HI,USA,Raw,1
B,F,Masters 40-46,60,48,48,,,,Heather Fry,WI,USA,Raw,2
B,F,Masters 40-46,67.5,65,65,,,,Tonya Patrick,AZ,USA,Raw,1
B,F,Masters 40-46,67.5,55,55,,,,Kellye Millrany,TN,USA,Raw,2
B,F,Masters 40-46,75,72.5,72.5,,,,Brandi Kary,CA,USA,Single-ply,1
B,F,Masters 40-46,75,70,70,,,,Sarah Johnson,MT,USA,Raw,1
B,F,Masters 40-46,75,52.5,52.5,,,,Natalie McChesney,CA,USA,Raw,2
B,F,Masters 40-46,82.5,57.5,57.5,,,,Crystal Luiz-Jones,CA,USA,Raw,1
B,F,Masters 40-46,100,171,171,,,,Alisha Howard,WA,USA,Single-ply,1
B,F,Masters 40-46,100,75,75,,,,Tamara Perry,HI,USA,Raw,1
B,F,Masters 40-46,100+,140,140,,,,Trisha Puou,HI,USA,Single-ply,1
B,F,Masters 47-53,48,40,40,,,,Elizabeth Cabe,HI,USA,Raw,1
B,F,Masters 47-53,52,57.5,57.5,,60,,Valesca Cristina Rocha,,Brazil,Raw,1
B,F,Masters 47-53,56,43.5,43.5,,,,Barbara Perris,OR,USA,Raw,1
B,F,Masters 47-53,67.5,110,110,,,,Dede Soekardi,CA,USA,Single-ply,1
B,F,Masters 47-53,67.5,67.5,67.5,,,,Kathy Caraccioli,CA,USA,Single-ply,2
B,F,Masters 47-53,67.5,77.5,77.5,,,,Tonya Shaffer,MT,USA,Raw,1
B,F,Masters 47-53,67.5,52.5,52.5,,,,Buffy Belin,HI,USA,Raw,2
B,F,Masters 47-53,75,70,70,,,,Mirtha Delatorre,CA,USA,Raw,1
B,F,Masters 47-53,82.5,95,95,,,,Artemira Sobrinho,,Brazil,Raw,1
B,F,Masters 47-53,82.5,116,116,,,,Amy Rudder,TN,USA,Multi-ply,1
B,F,Masters 47-53,90,82.5,82.5,,85.5,,Akondaye Fountain,TX,USA,Raw,1
B,F,Masters 47-53,100+,85,85,,,,Evon Schuenke,WI,USA,Raw,1
B,F,Masters 54-60,56,62.5,62.5,,65,,Griselda Soler,,Argentina,Raw,1
B,F,Masters 54-60,56,42.5,42.5,,,,Judy Veloz,CA,USA,Raw,2
B,F,Masters 54-60,60,57.5,57.5,,,,Annette McBride,ID,USA,Raw,1
B,F,Masters 54-60,60,82.5,82.5,,,,Betty Hansen,CA,USA,Multi-ply,1
B,F,Masters 54-60,67.5,85,85,,,,Rebecca Moore,WA,USA,Multi-ply,1
B,F,Masters 54-60,82.5,80,80,,,,Josefina Jackson,TX,USA,Single-ply,1
B,F,Masters 54-60,82.5,65,65,,,,Terri Aiwohi,HI,USA,Raw,1
B,F,Masters 54-60,82.5,87.5,87.5,,,,DeAnna Dutton,WA,USA,Multi-ply,1
B,F,Masters 54-60,90,65,65,,,,Stacy Whetstone,NV,USA,Single-ply,1
B,F,Masters 54-60,90,57.5,57.5,,,,Analia Zalopany,HI,USA,Raw,1
B,F,Masters 54-60,90,55,55,,,,Deborah Maxwell,CA,USA,Raw,2
B,F,Masters 54-60,100+,85,85,,,,Dot Sosnicki,AZ,USA,Raw,1
B,F,Masters 54-60,100+,97.5,97.5,,,,Gloria Caughey,UT,USA,Multi-ply,1
B,F,Masters 61-67,44,45,45,,,,Pamela Robinson,CA,USA,Raw,1
B,F,Masters 61-67,48,25,25,,,,Lynne Nakama,HI,USA,Raw,1
B,F,Masters 61-67,60,52.5,52.5,,,,Susan Chloupek,WA,USA,Multi-ply,1
B,F,Masters 61-67,67.5,92.5,92.5,,,,Nadine Brack,WA,USA,Raw,1
B,F,Masters 61-67,67.5,70,70,,,,Jane McCubbin,WI,USA,Raw,2
B,F,Masters 61-67,67.5,100,100,,,,Peach Presley,CA,USA,Multi-ply,1
B,F,Masters 61-67,75,40,40,,,,Kim Grimes,CA,USA,Raw,1
B,F,Masters 61-67,100,58.5,58.5,,,,Sue Vaterlaus,CA,USA,Raw,1
B,F,Masters 68-74,56,47.5,47.5,,,,Leona Pereza,HI,USA,Raw,1
B,F,Masters 68-74,56,33,33,,,,Jean Santivasci,NV,USA,Raw,2
B,F,Masters 68-74,75,48,48,,,,Jeanne Mustille,CA,USA,Raw,1
B,F,Masters 68-74,75,30,30,,,,Jacqueline Fendler,MN,USA,Raw,2
B,F,Masters 68-74,82.5,42.5,42.5,,,,Marlene Wexler,MN,USA,Raw,1
B,F,Masters 68-74,100+,52.5,52.5,,,,Susan Arnett,HI,USA,Raw,1
B,F,Masters 75-79,67.5,45,45,,,,Kaye Donnelly,CA,USA,Raw,1
B,F,Masters 75-79,75,82.5,82.5,,,,Pat Robey,WA,USA,Single-ply,1
B,F,Masters 80-84,60,41,41,,,,Carrie Reese,CA,USA,Raw,1
B,F,Masters 90,90,21.5,21.5,,,,Gloria Mighell,OR,USA,Raw,1
B,M,Open,48,97.5,97.5,,,,Michael Pearson,WA,USA,Single-ply,1
B,M,Open,67.5,145,145,,,,Pablo Rodriguez,,Argentina,Single-ply,1
B,M,Open,75,200,200,,,,Ryan Sandoval,UT,USA,Single-ply,1
B,M,Open,75,140,140,,,,Julio Alfredo Fernnandez Rodriguez,,Guatemala,Single-ply,2
B,M,Open,75,165,165,,,,David R Smith,TX,USA,Raw,1
B,M,Open,75,161,161,,,,Serafin de Simone,,Argentina,Raw,2
B,M,Open,75,150,150,,,,Javier Taffetani,,Argentina,Raw,3
B,M,Open,75,107.5,107.5,,,,Jordan Rogers,OK,USA,Raw,4
B,M,Open,82.5,230.5,230.5,,,,Daniel Sisneros,CA,USA,Single-ply,1
B,M,Open,82.5,195,195,,,,Burt Duer,CA,USA,Single-ply,2
B,M,Open,82.5,170,170,,,,Steven Bassetti,CA,USA,Single-ply,3
B,M,Open,82.5,160,160,,,,Jukka-Pekka Tiilikka,,Finland,Raw,1
B,M,Open,82.5,147.5,147.5,,,,Chakkaphong Artwichai,TN,USA,Raw,2
B,M,Open,90,,,,,,Max Panziera,CA,USA,Single-ply,DQ
B,M,Open,90,137.5,137.5,,,,Andy Lenon,NV,USA,Raw,1
B,M,Open,100,260,260,,,,Jeremiah Lopez,CA,USA,Single-ply,1
B,M,Open,100,250,250,,,,Jake Romo,CA,USA,Single-ply,2
B,M,Open,100,195,195,,,,Haroldo Daniel Zepeda Hernández,,Guatemala,Single-ply,3
B,M,Open,100,,,,,,Jack Rogers,OK,USA,Single-ply,DQ
B,M,Open,100,,,,,,Kalle Räsänen,,Finland,Single-ply,DQ
B,M,Open,100,,,,,,Coby Washburn,TX,USA,Single-ply,DQ
B,M,Open,100,235,235,,,,Atte Poikonen,,Finland,Raw,1
B,M,Open,100,197.5,197.5,,,,Jason Carson,IL,USA,Raw,2
B,M,Open,100,181,181,,,,Randy Fry,WI,USA,Raw,3
B,M,Open,100,177.5,177.5,,,,Kim Päivöke,,Finland,Raw,4
B,M,Open,100,157.5,157.5,,,,Robert Rasor,OK,USA,Raw,5
B,M,Open,100,155,155,,,,Mariano Miravalles,,Argentina,Raw,6
B,M,Open,100,120,120,,,,Antero Makila,,Finland,Raw,7
B,M,Open,110,306,306,,,,Kenneth Millrany,TN,USA,Single-ply,1
B,M,Open,110,277.5,277.5,,,,Joey Murphy,GA,USA,Single-ply,2
B,M,Open,110,232.5,232.5,,,,Andrew Levensalor,ME,USA,Single-ply,3
B,M,Open,110,182.5,182.5,,,,Taylor Stermitz,MT,USA,Raw,1
B,M,Open,110,160,160,,,,Donovan Ballo,HI,USA,Raw,2
B,M,Open,110,250,250,,,,Eduardo Elgart,,Argentina,Multi-ply,1
B,M,Open,117.5,232.5,232.5,,,,Mick Quilici,NV,USA,Single-ply,1
B,M,Open,117.5,177.5,177.5,,,,Juha Märsylä,,Finland,Raw,1
B,M,Open,117.5,142.5,142.5,,,,Tyler Frost,AL,USA,Raw,2
B,M,Open,125,275,275,,,,Glenn Machado,OR,USA,Single-ply,1
B,M,Open,125,185,185,,,,Billy Caughey,UT,USA,Single-ply,2
B,M,Open,125,190,190,,,,Gary Pantilla,AZ,USA,Raw,1
B,M,Open,125,177.5,177.5,,,,Jason Sacre,MT,USA,Raw,2
B,M,Open,125,175,175,,,,Alfredo Martín Rojas,,Argentina,Raw,3
B,M,Open,125,117.5,117.5,,,,Don Miskinis,OH,USA,Raw,4
B,M,Open,140,257.5,257.5,,,,Kamuela Wassman,HI,USA,Single-ply,1
B,M,Open,140,,,,,,River Newman,MT,USA,Single-ply,DQ
B,M,Open,140,,,,,,Jake Briles,ID,USA,Single-ply,DQ
B,M,Open,140,200,200,,,,Forest Hofer,WA,USA,Raw,1
B,M,Open,140,187.5,187.5,,,,Vincent Perez,AZ,USA,Raw,2
B,M,Open,140,267.5,267.5,,,,Jeremiah Johnson #3,UT,USA,Multi-ply,1
B,M,Open,140,200,200,,,,Keoni Reich,HI,USA,Multi-ply,2
B,M,Open,140+,240,240,,,,Scott Bromeisl,WI,USA,Single-ply,1
B,M,Open,140+,227.5,227.5,,,,Joe Mickelson,WA,USA,Single-ply,2
B,M,Open,140+,245,245,,,,Mike McElroy,ID,USA,Raw,1
B,M,Open,140+,212.5,212.5,,,,Marvin Bishop,OH,USA,Raw,2
B,M,Open,140+,288.5,288.5,,,,Gary Shim,HI,USA,Multi-ply,1
B,M,Open,82.5,170,170,,,,Steven Bassetti,CA,USA,Single-ply,4
B,F,Open,44,60,60,,,,Diana Vallinoto,,Argentina,Raw,1
B,F,Open,44,40,40,,,,Makalea Ramil,HI,USA,Raw,2
B,F,Open,48,70,70,,,,Micaela Lopez,,Argentina,Raw,1
B,F,Open,48,67.5,67.5,,,,Jade Bunk,WI,USA,Raw,2
B,F,Open,48,57.5,57.5,,,,Jennifer Genato,CA,USA,Raw,3
B,F,Open,52,65,65,,,,April Hamon,TX,USA,Single-ply,1
B,F,Open,52,57.5,57.5,,,,Valesca Cristina Rocha,,Brazil,Raw,1
B,F,Open,56,92.5,92.5,,,,Jamie Field,CA,USA,Single-ply,1
B,F,Open,56,62.5,62.5,,,,Griselda Soler,,Argentina,Raw,1
B,F,Open,60,100,100,,,,Tracee Iranon,HI,USA,Single-ply,1
B,F,Open,60,85,85,,,,Stacy Matsuyama-Sekioka,HI,USA,Single-ply,2
B,F,Open,60,75,75,,,,Leilani Felipe,HI,USA,Raw,1
B,F,Open,67.5,152.5,152.5,,,,Samantha Panziera,CA,USA,Single-ply,1
B,F,Open,67.5,95,95,,,,Marianne Hartio,,Finland,Raw,1
B,F,Open,67.5,77.5,77.5,,,,Tonya Shaffer,MT,USA,Raw,2
B,F,Open,67.5,75.5,75.5,,,,Brittney Pasion-Almeida,HI,USA,Raw,3
B,F,Open,67.5,65,65,,,,Tonya Patrick,AZ,USA,Raw,4
B,F,Open,82.5,95,95,,,,Artemira Sobrinho,,Brazil,Raw,1
B,F,Open,82.5,65,65,,,,Terri Aiwohi,HI,USA,Raw,2
B,F,Open,82.5,116,116,,,,Amy Rudder,TN,USA,Multi-ply,1
B,F,Open,100+,160,160,,,,Annie Bowman,WA,USA,Single-ply,1
B,F,Open,100+,140,140,,,,Trisha Puou,HI,USA,Single-ply,2
B,F,Open,100+,117.5,117.5,,120,,Poha Henson,HI,USA,Raw,1
B,F,Open,100+,100.5,100.5,,,,Makala Davis,AZ,USA,Raw,2
B,F,Open,100+,85,85,,,,Evon Schuenke,WI,USA,Raw,3
B,F,Open,100+,97.5,97.5,,,,Gloria Caughey,UT,USA,Multi-ply,1
B,F,Special Olympian,100,80,80,,,,Chloe Kaalund,CA,USA,Raw,1
B,M,Submasters 33-39,67.5,85,85,,,,Reece Bohlender,OK,USA,Raw,1
B,M,Submasters 33-39,75,150,150,,,,Javier Taffetani,,Argentina,Raw,1
B,M,Submasters 33-39,82.5,175.5,175.5,,176,,Bobby Chanthavong,AR,USA,Raw,1
B,M,Submasters 33-39,82.5,117.5,117.5,,,,Humberto Rodriguez,AZ,USA,Raw,2
B,M,Submasters 33-39,90,150,150,,,,Kincaid Antolin,HI,USA,Raw,1
B,M,Submasters 33-39,100,187.5,187.5,,,,Joey Lewis,OK,USA,Single-ply,1
B,M,Submasters 33-39,100,235,235,,,,Atte Poikonen,,Finland,Raw,1
B,M,Submasters 33-39,100,175,175,,,,Joseph Adams,UT,USA,Raw,2
B,M,Submasters 33-39,100,155,155,,,,Mariano Miravalles,,Argentina,Raw,3
B,M,Submasters 33-39,100,120,120,,,,Antero Makila,,Finland,Raw,4
B,M,Submasters 33-39,110,210,210,,,,Tim Heisler,MT,USA,Single-ply,1
B,M,Submasters 33-39,110,182.5,182.5,,,,Taylor Stermitz,MT,USA,Raw,1
B,M,Submasters 33-39,117.5,142.5,142.5,,,,Tyler Frost,AL,USA,Raw,1
B,M,Submasters 33-39,125,190,190,,,,Gary Pantilla,AZ,USA,Raw,1
B,M,Submasters 33-39,125,175,175,,,,Alfredo Martín Rojas,,Argentina,Raw,2
B,M,Submasters 33-39,125,170.5,170.5,,,,Rich Pierce,CA,USA,Raw,3
B,M,Submasters 33-39,140,,,,,,Jake Briles,ID,USA,Single-ply,DQ
B,M,Submasters 33-39,140,228,228,,,,Isaac Manipon-Silva,HI,USA,Raw,1
B,F,Submasters 33-39,44,60,60,,,,Diana Vallinoto,,Argentina,Raw,1
B,F,Submasters 33-39,48,57.5,57.5,,,,Jennifer Genato,CA,USA,Raw,1
B,F,Submasters 33-39,52,65,65,,,,April Hamon,TX,USA,Single-ply,1
B,F,Submasters 33-39,67.5,55,55,,,,Marisa Boyns,CA,USA,Raw,1
B,F,Submasters 33-39,75,105,105,,,,Lynn Gilpin-Parks,WI,USA,Single-ply,1
B,F,Submasters 33-39,82.5,125,125,,138,,Nicole Campbell,CA,USA,Single-ply,1
B,F,Submasters 33-39,100+,160,160,,,,Annie Bowman,WA,USA,Single-ply,1
B,F,Submasters 33-39,100+,117.5,117.5,,120,,Poha Henson,HI,USA,Raw,1
B,M,Submasters 33-39,140+,102.5,102.5,,,,Marquita Snow-Whiten,IL,USA,Raw,1
B,M,Teen 12-13,44,43,43,,,,Landon Villareal,HI,USA,Raw,1
B,M,Teen 12-13,44,42.5,42.5,,43.5,,Grady Springer,WA,USA,Raw,2
B,M,Teen 12-13,67.5,72.5,72.5,,,,Mikah Hall,HI,USA,Raw,1
B,M,Teen 12-13,67.5,47.5,47.5,,,,Sheriff Murrell,OK,USA,Raw,2
B,M,Teen 12-13,75,52.5,52.5,,,,Joseph Straka,WA,USA,Raw,1
B,M,Teen 12-13,90,52.5,52.5,,,,David Decanini #1,TX,USA,Raw,1
B,M,Teen 12-13,100,62.5,62.5,,,,Kaiden Fuhrman,WI,USA,Raw,1
B,M,Teen 14-15,52,62.5,62.5,,,,Brandon Newcomb,WA,USA,Raw,1
B,M,Teen 14-15,60,80,80,,,,Ramiro Yanez,TX,USA,Raw,1
B,M,Teen 14-15,60,67.5,67.5,,,,Jeremy Sawyer,WA,USA,Raw,2
B,M,Teen 14-15,67.5,75,75,,,,Trey Anderson,WA,USA,Raw,1
B,M,Teen 14-15,75,95,95,,96,,Zander McElroy,ID,USA,Raw,1
B,M,Teen 14-15,75,70,70,,,,Daniel Tupper,WA,USA,Raw,2
B,M,Teen 14-15,82.5,97.5,97.5,,,,Mathew Sabo,TX,USA,Raw,1
B,M,Teen 14-15,90,115,115,,,,Issac Brandt,WA,USA,Raw,1
B,M,Teen 14-15,100,75,75,,,,Mason Sorensen,WA,USA,Raw,1
B,M,Teen 14-15,117.5,122.5,122.5,,,,Nathan Ivey,WA,USA,Raw,1
B,M,Teen 14-15,125,102.5,102.5,,,,Robert Vick Jr,NV,USA,Raw,1
B,M,Teen 16-17,56,97.5,97.5,,,,Gregor Hocher,,Brazil,Raw,1
B,M,Teen 16-17,60,75,75,,,,Logan Villareal,HI,USA,Raw,1
B,M,Teen 16-17,60,71,71,,,,Luke Check,WI,USA,Raw,2
B,M,Teen 16-17,82.5,137.5,137.5,,,,Kaison Uehara,OR,USA,Raw,1
B,M,Teen 16-17,90,115,115,,,,Cory Wood,WI,USA,Single-ply,1
B,M,Teen 16-17,125,122.5,122.5,,,,Martin Rodriguez,TX,USA,Raw,1
B,M,Teen 18-19,67.5,75,75,,,,Tyler Farmer,MT,USA,Raw,1
B,M,Teen 18-19,82.5,,,,,,Tarence Leggitt,TN,USA,Raw,DQ
B,M,Teen 18-19,90,110,110,,,,Joshua Quintanilla,TX,USA,Raw,1
B,M,Teen 18-19,100,250,250,,,,Jake Romo,CA,USA,Single-ply,1
B,M,Teen 18-19,100,165,165,,,,Austin Payne,WI,USA,Single-ply,2
B,M,Teen 18-19,100,137.5,137.5,,,,Jacob Meaker,TN,USA,Raw,1
B,M,Teen 18-19,100,,,,,,Tony Delgado,WA,USA,Raw,DQ
B,M,Teen 18-19,125,125,125,,133,,Fredrico Garcia,HI,USA,Raw,1
B,F,Teen 14-15,52,47.5,47.5,,,,Trulayna Ballo,HI,USA,Raw,1
B,F,Teen 14-15,60,62.5,62.5,,,,Iris Singleton,WA,USA,Raw,1
B,F,Teen 14-15,75,72.5,72.5,,,,Mataya Straka,WA,USA,Raw,1
B,F,Teen 14-15,100,117.5,117.5,,,,Tyara Straka,WA,USA,Raw,1
B,F,Teen 16-17,44,40,40,,,,Makalea Ramil,HI,USA,Raw,1
B,F,Teen 16-17,52,45.5,45.5,,,,Emma MacDonald,WA,USA,Raw,1
B,F,Teen 16-17,56,67.5,67.5,,,,Katee Peabody,CA,USA,Multi-ply,1
B,F,Teen 16-17,60,60.5,60.5,,,,Kylie Sandoval,UT,USA,Raw,1
B,F,Teen 16-17,82.5,52.5,52.5,,,,Kamalio Kaleleiki,HI,USA,Raw,1
B,F,Teen 16-17,82.5,47.5,47.5,,,,Alaysha Whitehead,UT,USA,Raw,2
B,F,Teen 16-17,100,73,73,,75,,Sophie Larson,WI,USA,Raw,1
B,F,Teen 16-17,100,65,65,,,,Maudi Roscoe,WA,USA,Raw,2
B,F,Teen 18-19,60,63,63,,65,,Isabella Theobald,HI,USA,Raw,1
B,F,Teen 18-19,67.5,67.5,67.5,,,,Geneveve Sawyer,WA,USA,Raw,1
B,F,Teen 18-19,90,77.5,77.5,,,,Brooklynn Hall,HI,USA,Raw,1
