Division,WeightClassKg,Place,Name,Team,BodyweightKg,Best3SquatKg,Best3BenchKg,Best3DeadliftKg,TotalKg,Equipment,Event,Sex
Girls,44.23,1,Kirsten Boyd,Alvarado,41.64,106.59,49.9,106.59,263.08,Single-ply,SBD,F
Girls,44.23,2,Angie Herrera,Glen Rose,43.27,77.11,38.56,97.52,213.19,Single-ply,SBD,F
Girls,44.23,3,Kimberley Kolls,Lorena,42.18,70.31,43.09,79.38,192.78,Single-ply,SBD,F
Girls,44.23,4,Kylee Rutledge,Lampasas,41,61.23,22.68,72.57,156.49,Single-ply,SBD,F
Girls,44.23,5,Elyssia Sotelo,Stephenville,41.73,31.75,20.41,43.09,95.25,Single-ply,SBD,F
Girls,44.23,NS,Alicia Pecina,Taylor,,,,,,Single-ply,SBD,F
Girls,44.23,DQ,Alexis Lira,Mexia,42.46,,,,,Single-ply,SBD,F
Girls,44.23,DQ,Jessica Duque,Hillsboro,41.28,,,,,Single-ply,SBD,F
Girls,47.85,1,Blaine Gluck,Stephenville,46.72,131.54,47.63,131.54,310.71,Single-ply,SBD,F
Girls,47.85,2,Guadalupe Gobellan,Hillsboro,46.36,106.59,58.97,115.67,281.23,Single-ply,SBD,F
Girls,47.85,3,Katy Gibson,Liberty Hill,46.45,108.86,49.9,106.59,265.35,Single-ply,SBD,F
Girls,47.85,4,Olivia Hernandez,Alvarado,47.45,104.33,47.63,99.79,251.74,Single-ply,SBD,F
Girls,47.85,5,Jena Pina,Liberty Hill,46.9,92.99,36.29,102.06,231.33,Single-ply,SBD,F
Girls,47.85,6,Aislinn Venegas,Mexia,47.36,97.52,40.82,92.99,231.33,Single-ply,SBD,F
Girls,47.85,7,Marina Kingery,Llano,46.63,90.72,36.29,92.99,219.99,Single-ply,SBD,F
Girls,47.85,8,Reigh Neudorf,Llano,46.63,86.18,47.63,83.91,217.72,Single-ply,SBD,F
Girls,47.85,DQ,Diandra Tejada,Stephenville,47.72,,,,,Single-ply,SBD,F
Girls,47.85,DQ,Morgan Mays,Salado,46.72,,,,,Single-ply,SBD,F
Girls,47.85,DQ,Madison Sanchez,Taylor,46.81,,,,,Single-ply,SBD,F
Girls,47.85,NS,Amaya Geotzman,Smithville,,,,,,Single-ply,SBD,F
Girls,47.85,NS,Laina Bodovsky,Hillsboro,,,,,,Single-ply,SBD,F
Girls,51.94,1,Alyssa Ayers,Lampasas,51.44,127.01,88.45,138.35,353.8,Single-ply,SBD,F
Girls,51.94,2,Kylie Rystad,Gatesville,50.35,113.4,58.97,113.4,285.76,Single-ply,SBD,F
Girls,51.94,3,Morgan Squires,Godley,51.53,113.4,45.36,122.47,281.23,Single-ply,SBD,F
Girls,51.94,4,Samantha Vargas,Salado,50.62,111.13,52.16,115.67,278.96,Single-ply,SBD,F
Girls,51.94,5,Leanna Limon,Liberty Hill,51.89,113.4,49.9,115.67,278.96,Single-ply,SBD,F
Girls,51.94,6,Alyssa Ford,Taylor,50.98,113.4,47.63,106.59,267.62,Single-ply,SBD,F
Girls,51.94,7,Amiah Rodriguez,Stephenville,49.71,102.06,52.16,106.59,260.82,Single-ply,SBD,F
Girls,51.94,8,Jayla Anthony,Mexia,49.71,102.06,47.63,102.06,251.74,Single-ply,SBD,F
Girls,51.94,9,Caelan Teer,Salado,51.89,102.06,49.9,92.99,244.94,Single-ply,SBD,F
Girls,51.94,10,Ellie Lindsay,Fredericksburg,51.89,86.18,52.16,92.99,231.33,Single-ply,SBD,F
Girls,51.94,DQ,Judith Marcos,Hillsboro,50.44,,,,,Single-ply,SBD,F
Girls,51.94,DQ,Victoria Perez,Taylor,50.71,120.2,,,,Single-ply,SBD,F
Girls,51.94,NS,Abby Green,Glen Rose,,,,,,Single-ply,SBD,F
Girls,51.94,NS,Harlee Owen,Alvarado,,,,,,Single-ply,SBD,F
Girls,56.02,1,Karen Ruiz,Venus,55.61,136.08,68.04,127.01,331.12,Single-ply,SBD,F
Girls,56.02,2,Alayna Washington,Gatesville,54.7,120.2,65.77,136.08,322.05,Single-ply,SBD,F
Girls,56.02,3,Bene Martinez,Hillsboro,54.79,127.01,58.97,113.4,299.37,Single-ply,SBD,F
Girls,56.02,4,Audrey Carranza,Taylor,53.89,113.4,49.9,122.47,285.76,Single-ply,SBD,F
Girls,56.02,5,Armonie Haywood,Hillsboro,54.25,99.79,61.23,120.2,281.23,Single-ply,SBD,F
Girls,56.02,6,Elisa Chutes,Waco La Vega,54.52,111.13,54.43,104.33,269.89,Single-ply,SBD,F
Girls,56.02,7,Kelsey Creech,Hillsboro,55.88,113.4,56.7,97.52,267.62,Single-ply,SBD,F
Girls,56.02,8,Libbi Showman,Lampasas,55.52,102.06,58.97,102.06,263.08,Single-ply,SBD,F
Girls,56.02,9,Emery Brewer,Glen Rose,55.79,90.72,45.36,113.4,249.48,Single-ply,SBD,F
Girls,56.02,10,McKynna Oliver,Robinson,55.43,92.99,34.02,108.86,235.87,Single-ply,SBD,F
Girls,56.02,DQ,Hannah Okafor,Robinson,55.79,,,,,Single-ply,SBD,F
Girls,56.02,DQ,DezJ'nae Hodge,Smithville,53.8,,,,,Single-ply,SBD,F
Girls,60.1,1,Mia Rodriguez,Taylor,57.61,149.69,56.7,142.88,349.27,Single-ply,SBD,F
Girls,60.1,2,Reginia Deen,Salado,59.15,131.54,70.31,145.15,347,Single-ply,SBD,F
Girls,60.1,3,Victoria Martinez #2,Lampasas,59.87,129.27,81.65,136.08,347,Single-ply,SBD,F
Girls,60.1,4,Anjelica Sanchez,Alvarado,58.97,138.35,68.04,131.54,337.93,Single-ply,SBD,F
Girls,60.1,5,Gissel Bustos,Venus,59.33,124.74,65.77,133.81,324.32,Single-ply,SBD,F
Girls,60.1,6,Rebekah Moseley,Lorena,59.69,129.27,61.23,127.01,317.51,Single-ply,SBD,F
Girls,60.1,7,Kynlee Bartosh,Lorena,59.69,117.93,61.23,127.01,306.17,Single-ply,SBD,F
Girls,60.1,8,Ariawna Burt,Stephenville,59.24,124.74,65.77,113.4,303.91,Single-ply,SBD,F
Girls,60.1,9,Isabel Mayorga,Hillsboro,57.7,117.93,65.77,111.13,294.84,Single-ply,SBD,F
Girls,60.1,10,Jaqueline Aguilar,Alvarado,59.06,122.47,52.16,115.67,290.3,Single-ply,SBD,F
Girls,60.1,11,Kayshawna Fields,Taylor,56.88,104.33,40.82,138.35,283.5,Single-ply,SBD,F
Girls,60.1,DQ,Maggie Ryines,Taylor,58.6,,,,,Single-ply,SBD,F
Girls,67.36,1,Kaci Donaldson,Lorena,64.59,149.69,92.99,142.88,385.55,Single-ply,SBD,F
Girls,67.36,2,Kayla Gonzalez,Venus,66.04,156.49,70.31,147.42,374.21,Single-ply,SBD,F
Girls,67.36,3,Lynda Farmer,Lorena,65.95,147.42,81.65,142.88,371.95,Single-ply,SBD,F
Girls,67.36,4,Emalie Arnold,Alvarado,64.32,140.61,77.11,133.81,351.53,Single-ply,SBD,F
Girls,67.36,5,Monica Garza,Lampasas,64.32,129.27,70.31,131.54,331.12,Single-ply,SBD,F
Girls,67.36,6,Taiya Galvan,Godley,64.86,120.2,52.16,124.74,297.1,Single-ply,SBD,F
Girls,67.36,7,Natalie Hernandez,Waco La Vega,66.04,120.2,52.16,120.2,292.57,Single-ply,SBD,F
Girls,67.36,8,Jaden Monterrubio,Hillsboro,66.77,104.33,65.77,117.93,288.03,Single-ply,SBD,F
Girls,67.36,9,Stacey Bastardo,Brownwood,65.95,99.79,68.04,113.4,281.23,Single-ply,SBD,F
Girls,67.36,10,Madison Gardiner,Lorena,63.59,108.86,61.23,102.06,272.16,Single-ply,SBD,F
Girls,67.36,NS,Harley Earp,Smithville,,,,,,Single-ply,SBD,F
Girls,67.36,NS,Hailey Tindell,Burnet,,,,,,Single-ply,SBD,F
Girls,67.36,DQ,Jessica Ramírez #1,Alvarado,66.13,99.79,,,,Single-ply,SBD,F
Girls,75.07,1,Sheila Flores,Hillsboro,70.4,183.7,92.99,136.08,412.77,Single-ply,SBD,F
Girls,75.07,2,Alexandra Arias,Taylor,72.94,161.03,54.43,142.88,358.34,Single-ply,SBD,F
Girls,75.07,3,Carolina Rodriguez,Bellville,71.03,156.49,61.23,131.54,349.27,Single-ply,SBD,F
Girls,75.07,4,Monserrat Serrano,Hillsboro,72.94,158.76,70.31,115.67,344.73,Single-ply,SBD,F
Girls,75.07,5,Madison Pierce,Lorena,74.84,136.08,65.77,142.88,344.73,Single-ply,SBD,F
Girls,75.07,6,Mikayla Whitus,Burnet,69.94,124.74,83.91,127.01,335.66,Single-ply,SBD,F
Girls,75.07,7,Salma Ramirez,Hillsboro,67.77,131.54,72.57,129.27,333.39,Single-ply,SBD,F
Girls,75.07,8,Deondria Brandyburg,Smithville,72.03,120.2,65.77,142.88,328.85,Single-ply,SBD,F
Girls,75.07,9,Taylor Sims,Liberty Hill,74.93,131.54,63.5,120.2,315.25,Single-ply,SBD,F
Girls,75.07,10,Kenzie Mayes,Stephenville,73.66,117.93,68.04,113.4,299.37,Single-ply,SBD,F
Girls,75.07,11,Lea Wagner,Godley,70.03,120.2,52.16,124.74,297.1,Single-ply,SBD,F
Girls,75.07,DQ,Jackie Brown,Venus,69.76,,,,,Single-ply,SBD,F
Girls,82.33,1,Dorislynn Edmondson,Salado,80.1,142.88,65.77,158.76,367.41,Single-ply,SBD,F
Girls,82.33,2,Elizabeth Sebera,Fredericksburg,78.83,138.35,86.18,140.61,365.14,Single-ply,SBD,F
Girls,82.33,3,Mallory Gunter,Stephenville,81.65,136.08,88.45,136.08,360.61,Single-ply,SBD,F
Girls,82.33,4,Yvette Gutierrez,Taylor,80.47,154.22,52.16,142.88,349.27,Single-ply,SBD,F
Girls,82.33,5,Kendall Wenzel,Llano,75.57,136.08,68.04,131.54,335.66,Single-ply,SBD,F
Girls,82.33,6,Sidney Reyes,Burnet,79.65,120.2,65.77,142.88,328.85,Single-ply,SBD,F
Girls,82.33,7,Jayla Banks,Mexia,76.29,129.27,58.97,138.35,326.59,Single-ply,SBD,F
Girls,82.33,8,Valentina Morua,Lampasas,79.74,117.93,70.31,129.27,317.51,Single-ply,SBD,F
Girls,82.33,9,Rylea Whitus,Burnet,77.93,113.4,79.38,120.2,312.98,Single-ply,SBD,F
Girls,82.33,10,Arianna Rosati,Stephenville,80.29,106.59,68.04,138.35,312.98,Single-ply,SBD,F
Girls,82.33,DQ,Versonyca Reeves,Mexia,75.21,,,,,Single-ply,SBD,F
Girls,82.33,DQ,Lillian Izquierdo,Hillsboro,81.92,,,,,Single-ply,SBD,F
Girls,82.33,DQ,Kara Spence,Llano,76.29,,,,,Single-ply,SBD,F
Girls,90.04,1,Jessica Ebeling,Stephenville,84.82,179.17,83.91,161.03,424.11,Single-ply,SBD,F
Girls,90.04,2,Aubreyanna Ziegler,Stephenville,87.27,147.42,65.77,158.76,371.95,Single-ply,SBD,F
Girls,90.04,3,Izabella Vidales,Taylor,86.73,149.69,58.97,154.22,362.87,Single-ply,SBD,F
Girls,90.04,4,Hailey Reiss,Lampasas,85.91,124.74,77.11,138.35,340.19,Single-ply,SBD,F
Girls,90.04,5,Courtney Chapman,Glen Rose,88.18,136.08,54.43,140.61,331.12,Single-ply,SBD,F
Girls,90.04,6,Vanessa Martinez,Waco La Vega,83.37,136.08,56.7,127.01,319.78,Single-ply,SBD,F
Girls,90.04,7,Taylor Kimberling,Lorena,87.72,136.08,70.31,102.06,308.44,Single-ply,SBD,F
Girls,90.04,8,Jamie Comer,Mexia,85.55,104.33,63.5,115.67,283.5,Single-ply,SBD,F
Girls,90.04,DQ,Skylyn Flores,Navasota,88.36,,,,,Single-ply,SBD,F
Girls,90.04,DQ,Ariel Lopez,Giddings,86.27,,,,,Single-ply,SBD,F
Girls,90.04,NS,Jaeden Campos,Hillsboro,,,,,,Single-ply,SBD,F
Girls,90.04,NS,Zariahya Carter,Mexia,,,,,,Single-ply,SBD,F
Girls,100.02,1,Danielle Carrizales,Lorena,95.25,197.31,90.72,154.22,442.25,Single-ply,SBD,F
Girls,100.02,2,Alyssa Preston,Brownwood,95.62,158.76,102.06,167.83,428.64,Single-ply,SBD,F
Girls,100.02,3,Zyria Basey,Navasota,99.61,142.88,77.11,145.15,365.14,Single-ply,SBD,F
Girls,100.02,4,Austyn Montemayor,Salado,90.17,147.42,88.45,127.01,362.87,Single-ply,SBD,F
Girls,100.02,5,Hailey Hambrice,Godley,95.16,154.22,56.7,151.95,362.87,Single-ply,SBD,F
Girls,100.02,6,Takiya Alexander,Waco La Vega,90.45,131.54,79.38,147.42,358.34,Single-ply,SBD,F
Girls,100.02,7,Hope Goodrich,Mexia,93.89,120.2,86.18,124.74,331.12,Single-ply,SBD,F
Girls,100.02,8,Zariah Sanders,Smithville,91.63,127.01,63.5,127.01,317.51,Single-ply,SBD,F
Girls,100.02,9,Carlie Groves,Lampasas,97.7,120.2,68.04,127.01,315.25,Single-ply,SBD,F
Girls,100.02,10,Amy Lorenz,Lorena,95.44,122.47,65.77,120.2,308.44,Single-ply,SBD,F
Girls,100.02,DQ,Addison DeBerry,Godley,91.53,,,,,Single-ply,SBD,F
Girls,100.02,DQ,Norma Hernandez,Stephenville,97.98,149.69,77.11,,,Single-ply,SBD,F
Girls,117.71,1,Kaylee Shilling,Waco La Vega,113.67,210.92,106.59,151.95,469.47,Single-ply,SBD,F
Girls,117.71,2,Savannah Ford,Gatesville,116.3,172.37,102.06,172.37,446.79,Single-ply,SBD,F
Girls,117.71,3,Dezne Taylor,Alvarado,105.41,154.22,79.38,163.29,396.89,Single-ply,SBD,F
Girls,117.71,4,Cally Reding,Lampasas,102.15,140.61,92.99,136.08,369.68,Single-ply,SBD,F
Girls,117.71,5,Xjiani Miller,China Spring,109.23,136.08,90.72,136.08,362.87,Single-ply,SBD,F
Girls,117.71,6,Whitney Adams,Smithville,102.15,115.67,72.57,142.88,331.12,Single-ply,SBD,F
Girls,117.71,7,Aaliyah Lewis,Giddings,103.06,142.88,65.77,113.4,322.05,Single-ply,SBD,F
Girls,117.71,8,Sabrina Terrill,Sealy,115.76,136.08,74.84,104.33,315.25,Single-ply,SBD,F
Girls,117.71,9,Lila Walling,Lampasas,106.96,120.2,63.5,127.01,310.71,Single-ply,SBD,F
Girls,117.71,10,Delaney Turner,Giddings,112.76,124.74,65.77,106.59,297.1,Single-ply,SBD,F
Girls,117.71,11,Madison Klement,Robinson,105.87,117.93,58.97,106.59,283.5,Single-ply,SBD,F
Girls,117.71,12,Heavenly Turner,Taylor,104.6,99.79,47.63,129.27,276.69,Single-ply,SBD,F
Girls,117.71,NS,Courtney Reina,Llano,,,,,,Single-ply,SBD,F
Girls,117.71+,1,Aliyah Allison,Waco La Vega,153.95,217.72,113.4,170.1,501.22,Single-ply,SBD,F
Girls,117.71+,2,Valerie Lee,Alvarado,131.18,195.04,83.91,161.03,439.98,Single-ply,SBD,F
Girls,117.71+,3,Carmen Frausto,Waco Connally,132,167.83,102.06,120.2,390.09,Single-ply,SBD,F
Girls,117.71+,4,Mallory Alexander,Glen Rose,119.11,122.47,54.43,108.86,285.76,Single-ply,SBD,F
Girls,117.71+,DQ,Aiyana Ramos,Smithville,123.92,,,,,Single-ply,SBD,F
