Division,WeightClassKg,Place,Name,Team,BodyweightKg,Best3SquatKg,Best3BenchKg,Best3DeadliftKg,TotalKg,Equipment,Event,Sex
Boys,51.71,1,Trenton Thedford,Vanderbilt Industrial,50.35,113.4,63.5,99.79,276.69,Single-ply,SBD,M
Boys,51.71,2,Alfred Aparicio,Palacios,51.26,102.06,56.7,113.4,272.16,Single-ply,SBD,M
Boys,51.71,3,Mark Livesay,Floresville,47.85,99.79,47.63,113.4,260.82,Single-ply,SBD,M
Boys,51.71,4,Tyler Hessler,Victoria East,48.76,90.72,56.7,113.4,260.82,Single-ply,SBD,M
Boys,55.79,1,Dallas de la Cruz,Mathis,55.57,167.83,86.18,174.63,428.64,Single-ply,SBD,M
Boys,55.79,2,Michael Latapie,Palacios,52.62,136.08,99.79,129.27,365.14,Single-ply,SBD,M
Boys,55.79,3,Bryan Priddy,Skidmore-Tynan,53.3,120.2,77.11,140.61,337.93,Single-ply,SBD,M
Boys,55.79,4,Robert Grey,Cuero,54.43,113.4,79.38,131.54,324.32,Single-ply,SBD,M
Boys,55.79,5,Rhett Musser,Vanderbilt Industrial,53.98,142.88,54.43,117.93,315.25,Single-ply,SBD,M
Boys,55.79,6,Buster Dodge,Refugio,53.07,106.59,61.23,113.4,281.23,Single-ply,SBD,M
Boys,55.79,7,Marco Zamora,Palacios,54.43,83.91,49.9,120.2,254.01,Single-ply,SBD,M
Boys,59.87,1,Donovan Wilson,Aransas Pass,57.15,165.56,83.91,147.42,396.89,Single-ply,SBD,M
Boys,67.13,2,Dean Boniface,Goliad,60.06,145.15,83.91,158.76,387.82,Single-ply,SBD,M
Boys,59.87,3,Lane Faust,Yoakum,59.19,140.61,79.38,149.69,369.68,Single-ply,SBD,M
Boys,59.87,4,Jordan Cole,Aransas Pass,59.65,129.27,83.91,136.08,349.27,Single-ply,SBD,M
Boys,67.13,5,Glenn Wineman,Refugio,60.1,145.15,65.77,136.08,347,Single-ply,SBD,M
Boys,59.87,6,Fabian Tijernia,Mathis,57.15,131.54,65.77,136.08,333.39,Single-ply,SBD,M
Boys,59.87,7,Cameron Schultz,Victoria East,57.61,104.33,77.11,124.74,306.17,Single-ply,SBD,M
Boys,59.87,8,Marcos Crespin,Victoria West,56.47,102.06,61.23,124.74,288.03,Single-ply,SBD,M
Boys,59.87,9,John Tran,Palacios,59.19,90.72,61.23,131.54,283.5,Single-ply,SBD,M
Boys,67.13,1,Gino Dodge,Refugio,66.22,206.38,115.67,192.78,514.83,Single-ply,SBD,M
Boys,67.13,2,Carbe Seaman,Victoria St. Joseph,67.13,190.51,117.93,188.24,496.68,Single-ply,SBD,M
Boys,67.13,3,Matthew Nguyen,Palacios,67.13,181.44,102.06,208.65,492.15,Single-ply,SBD,M
Boys,67.13,4,Aj Bustos,Cuero,67.13,185.97,120.2,167.83,474,Single-ply,SBD,M
Boys,67.13,5,Jacob Tumlinson,Victoria St. Joseph,66.9,183.7,90.72,181.44,455.86,Single-ply,SBD,M
Boys,67.13,6,Miguel Abrego,Floresville,66.22,161.03,106.59,172.37,439.98,Single-ply,SBD,M
Boys,67.13,7,Rico Florrs,Mathis,63.05,163.29,106.59,151.95,421.84,Single-ply,SBD,M
Boys,67.13,8,Brendan Lopez,Palacios,67.13,147.42,92.99,179.17,419.57,Single-ply,SBD,M
Boys,67.13,9,Dustin Boniface,Goliad,64.77,145.15,95.25,149.69,390.09,Single-ply,SBD,M
Boys,67.13,10,Noah Seaman,Palacios,66.9,136.08,77.11,163.29,376.48,Single-ply,SBD,M
Boys,67.13,11,Joe Boone,Goliad,63.14,138.35,74.84,158.76,371.95,Single-ply,SBD,M
Boys,67.13,12,Colton Cornish,Victoria St. Joseph,65.77,92.99,61.23,124.74,278.96,Single-ply,SBD,M
Boys,67.13,13,Karsen Klimithchek,Vanderbilt Industrial,60.78,90.72,61.23,117.93,269.89,Single-ply,SBD,M
Boys,67.13,DQ,Hogan Lauer,Yoakum,62.82,,,,,Single-ply,SBD,M
Boys,67.13,DQ,Moses Rios,Mathis,67.13,167.83,92.99,,,Single-ply,SBD,M
Boys,82.1,1,Stevie Jackson,Aransas Pass,75.07,192.78,117.93,192.78,503.49,Single-ply,SBD,M
Boys,74.84,2,Cody Perez,Yoakum,73.71,181.44,102.06,204.12,487.61,Single-ply,SBD,M
Boys,74.84,3,Mario Davila,Aransas Pass,74.39,192.78,115.67,179.17,487.61,Single-ply,SBD,M
Boys,82.1,4,Gilbert Perez,Floresville,75.07,195.04,99.79,188.24,483.08,Single-ply,SBD,M
Boys,74.84,5,JD White,Skidmore-Tynan,71.89,154.22,79.38,174.63,408.23,Single-ply,SBD,M
Boys,74.84,6,Aaron Bermudez,Luling,74.84,158.76,92.99,151.95,403.7,Single-ply,SBD,M
Boys,74.84,7,Justin Sanchez,Victoria West,70.76,136.08,102.06,149.69,387.82,Single-ply,SBD,M
Boys,74.84,8,Juan Ramirez,Mathis,74.84,156.49,81.65,120.2,358.34,Single-ply,SBD,M
Boys,82.1,9,Clayton Turner,Victoria West,75.07,136.08,77.11,142.88,356.07,Single-ply,SBD,M
Boys,74.84,DQ,Logan Moon,Victoria East,70.08,165.56,,,,Single-ply,SBD,M
Boys,74.84,DQ,Sean Ferrell,Victoria St. Joseph,73.03,,,,,Single-ply,SBD,M
Boys,74.84,DQ,Antonio Washington,Skidmore-Tynan,73.94,122.47,,,,Single-ply,SBD,M
Boys,74.84,DQ,Marco Chavarria,Vanderbilt Industrial,70.76,,,,,Single-ply,SBD,M
Boys,74.84,DQ,Pedro Amador,Mathis,68.95,,,,,Single-ply,SBD,M
Boys,74.84,DQ,Jorge Munoz,Luling,70.31,,,,,Single-ply,SBD,M
Boys,74.84,DQ,Jake McDavid,Aransas Pass,71.21,,,,,Single-ply,SBD,M
Boys,74.84,DQ,Jaime Garcia,Mathis,70.76,195.04,102.06,,,Single-ply,SBD,M
Boys,74.84,DQ,Leo Swischer,Aransas Pass,68.95,,,,,Single-ply,SBD,M
Boys,82.1,1,Greg Sexton,Palacios,80.29,215.46,115.67,217.72,548.85,Single-ply,SBD,M
Boys,82.1,2,Andrew Jemenez,Yoakum,77.11,204.12,106.59,204.12,514.83,Single-ply,SBD,M
Boys,82.1,3,Kelby Duque,Goliad,81.74,174.63,106.59,183.7,464.93,Single-ply,SBD,M
Boys,82.1,4,Billy Rodriguez,Cuero,78.02,172.37,86.18,172.37,430.91,Single-ply,SBD,M
Boys,82.1,5,Mark Martinez,Luling,77.11,136.08,102.06,158.76,396.89,Single-ply,SBD,M
Boys,82.1,6,Nick Quintanilla,Karnes City,76.2,142.88,83.91,154.22,381.02,Single-ply,SBD,M
Boys,82.1,7,Josh Guerra,Victoria St. Joseph,80.74,124.74,70.31,147.42,342.46,Single-ply,SBD,M
Boys,82.1,8,Jack Perry,Vanderbilt Industrial,79.83,113.4,68.04,127.01,308.44,Single-ply,SBD,M
Boys,82.1,DQ,Thomas McNeal,Luling,80.06,,,,,Single-ply,SBD,M
Boys,99.79,1,Matt Hartman #3,Victoria West,90.04,219.99,120.2,238.14,578.33,Single-ply,SBD,M
Boys,89.81,2,Maison Rickman,Cuero,86.64,210.92,138.35,226.8,576.06,Single-ply,SBD,M
Boys,89.81,3,Aaron Werlein,Luling,84.37,204.12,106.59,195.04,505.76,Single-ply,SBD,M
Boys,89.81,4,Levi Mair,Mathis,89.13,192.78,102.06,197.31,492.15,Single-ply,SBD,M
Boys,89.81,5,Alex Valdez,Refugio,88,190.51,127.01,172.37,489.88,Single-ply,SBD,M
Boys,89.81,6,Weston Block,Karnes City,86.18,181.44,102.06,181.44,464.93,Single-ply,SBD,M
Boys,89.81,7,Jordan Branum,Vanderbilt Industrial,84.37,167.83,115.67,163.29,446.79,Single-ply,SBD,M
Boys,89.81,8,Austin Block,Karnes City,89.36,181.44,90.72,172.37,444.52,Single-ply,SBD,M
Boys,89.81,9,Adolfo Cordero,Refugio,85.73,140.61,68.04,136.08,344.73,Single-ply,SBD,M
Boys,99.79,1,Austin Smalley,Vanderbilt Industrial,99.52,210.92,149.69,226.8,587.4,Single-ply,SBD,M
Boys,109.77,2,Gabe Guillen,Luling,99.97,226.8,145.15,215.46,587.4,Single-ply,SBD,M
Boys,99.79,3,Jarred Longerot,Mathis,99.79,231.33,122.47,231.33,585.13,Single-ply,SBD,M
Boys,99.79,4,Ricky Redus,Vanderbilt Industrial,98.43,192.78,151.95,197.31,542.04,Single-ply,SBD,M
Boys,99.79,5,Bryan Ruiz,Luling,99.79,213.19,124.74,201.85,539.77,Single-ply,SBD,M
Boys,99.79,6,Brice Lauer,Yoakum,92.08,188.24,115.67,183.7,487.61,Single-ply,SBD,M
Boys,99.79,7,Chris Diaz,Cuero,95.48,181.44,111.13,154.22,446.79,Single-ply,SBD,M
Boys,99.79,8,Cameron Berger,Goliad,94.26,165.56,102.06,174.63,442.25,Single-ply,SBD,M
Boys,99.79,9,Migael Jaso,Refugio,98.88,147.42,102.06,154.22,403.7,Single-ply,SBD,M
Boys,99.79,DQ,Ruben Ramirez,Aransas Pass,99.79,226.8,226.8,,,Single-ply,SBD,M
Boys,109.77,1,Adam Aucoin,Palacios,103.19,288.03,161.03,235.87,684.92,Single-ply,SBD,M
Boys,109.77,2,Scott Richter,Yoakum,109.77,260.82,172.37,204.12,637.3,Single-ply,SBD,M
Boys,109.77,3,Michael Garcia,Palacios,104.78,226.8,147.42,226.8,601.01,Single-ply,SBD,M
Boys,109.77,4,John Mendoza,Karnes City,108.86,208.65,131.54,238.14,578.33,Single-ply,SBD,M
Boys,109.77,5,Orlando Ordonez,Luling,105.69,226.8,136.08,192.78,555.65,Single-ply,SBD,M
Boys,109.77,6,Matt Guerrero,Luling,105.23,231.33,127.01,192.78,551.11,Single-ply,SBD,M
Boys,109.77,7,Omar Ordonez,Luling,101.15,226.8,124.74,167.83,519.36,Single-ply,SBD,M
Boys,109.77,8,Jake West,Yoakum,107.95,195.04,108.86,183.7,487.61,Single-ply,SBD,M
Boys,109.77,9,Kyle Loescher,Victoria West,103.42,192.78,111.13,165.56,469.47,Single-ply,SBD,M
Boys,109.77,10,Sal Sota,Skidmore-Tynan,105.69,174.63,102.06,185.97,462.66,Single-ply,SBD,M
Boys,109.77,11,Austin Speed,Goliad,109.77,183.7,92.99,181.44,458.13,Single-ply,SBD,M
Boys,109.77,12,Lucas Janysek,Karnes City,109.77,149.69,92.99,181.44,424.11,Single-ply,SBD,M
Boys,109.77,13,Wyatt Fraga,Victoria St. Joseph,103.19,172.37,83.91,149.69,405.97,Single-ply,SBD,M
Boys,109.77,14,Patrick Osborn,Victoria St. Joseph,104.1,158.76,83.91,158.76,401.43,Single-ply,SBD,M
Boys,109.77,15,Robbie Gonzales,Victoria St. Joseph,100.7,136.08,83.91,142.88,362.87,Single-ply,SBD,M
Boys,109.77,DQ,Charlie Holloway,Victoria St. Joseph,108.86,188.24,104.33,,,Single-ply,SBD,M
Boys,124.74,1,Kohlton Tegeler,Victoria East,110.9,299.37,183.7,249.48,732.55,Single-ply,SBD,M
Boys,124.74,2,Taylor Henning,Refugio,121.11,249.48,174.63,231.33,655.44,Single-ply,SBD,M
Boys,124.74,3,J'Von Thomas,Cuero,112.72,285.76,127.01,235.87,648.64,Single-ply,SBD,M
Boys,124.74,4,Chris Caskey,Cuero,124.28,263.08,151.95,231.33,646.37,Single-ply,SBD,M
Boys,124.74,5,Justin Rosas,Floresville,118.61,238.14,149.69,219.99,607.81,Single-ply,SBD,M
Boys,124.74,6,Benny Ximenez,Floresville,116.12,233.6,136.08,188.24,557.92,Single-ply,SBD,M
Boys,124.74,7,Luke Stevenson,Cuero,120.88,226.8,124.74,181.44,532.97,Single-ply,SBD,M
Boys,124.74,8,Zach Olguin,Luling,114.08,229.06,106.59,158.76,494.42,Single-ply,SBD,M
Boys,124.74+,1,Jonathon Saldana,Floresville,142.43,317.51,161.03,258.55,737.09,Single-ply,SBD,M
Boys,124.74+,2,Antonio Galvan,Aransas Pass,130.63,272.16,154.22,204.12,630.49,Single-ply,SBD,M
Boys,124.74+,3,Jerrod Grantz,Aransas Pass,127.46,206.38,147.42,229.06,582.87,Single-ply,SBD,M
Boys,124.74+,4,Randy Sierra,Cuero,128.59,238.14,113.4,208.65,560.19,Single-ply,SBD,M
Boys,124.74+,5,Reuben Ortiz,Refugio,146.96,254.01,117.93,183.7,555.65,Single-ply,SBD,M
Boys,124.74+,6,Kevin Camacho,Goliad,134.99,181.44,104.33,158.76,444.52,Single-ply,SBD,M
Boys,124.74+,7,Hudson Haas,Cuero,125.19,170.1,83.91,154.22,408.23,Single-ply,SBD,M
Boys,124.74+,DQ,Chance Schrimer,Skidmore-Tynan,153.31,,,,,Single-ply,SBD,M
