Place,Name,BirthYear,WeightClassKg,BodyweightKg,Country,Squat1Kg,Squat2Kg,Squat3Kg,Best3SquatKg,Bench1Kg,Bench2Kg,Bench3Kg,Best3BenchKg,Deadlift1Kg,Deadlift2Kg,Deadlift3Kg,Best3DeadliftKg,TotalKg,Sex,Division,Event,Equipment
1,Svetlana Tesleva,1975,44,43.6,Russia,130,140,147.5,147.5,70,80,-88,80,135,147.5,152.5,152.5,380,F,Juniors,SBD,Single-ply
2,Monika Pisarczyk,1979,44,43.9,Poland,95,105,-110,105,40,42.5,-47.5,42.5,100,110,115,115,262.5,F,Juniors,SBD,Single-ply
3,Ela Klesczynska,1981,44,42.9,Poland,80,92.5,95,95,60,-65,65,65,80,87.5,90,90,250,F,Juniors,SBD,Single-ply
4,Lina Koslovskaya,1979,44,43.7,Belarus,65,-72.5,72.5,72.5,35,-45,-45,35,80,90,-97.5,90,197.5,F,Juniors,SBD,Single-ply
1,Irina Krylova,1978,48,47.6,Russia,140,150.5,155.5,155.5,100.5,-110,112.5,112.5,135,-142.5,142.5,142.5,410,F,Juniors,SBD,Single-ply
2,Tatjana Eltsova,1978,48,47.4,Russia,-150,155,160,160,80,-85,85,85,140,150,-155,150,395,F,Juniors,SBD,Single-ply
3,Oksana Polovinka,1978,48,48,Belarus,90,-102.5,102.5,102.5,65,72.5,-77.5,72.5,-95,95,120,120,295,F,Juniors,SBD,Single-ply
DQ,Mart Kleszczynska,1979,48,47.9,Poland,-115,-115,-115,,,,,,,,,,,F,Juniors,SBD,Single-ply
1,Irina Tatarova,1975,52,51.4,Russia,-160,160,170,170,75,80,-82.5,80,150,160,-165,160,410,F,Juniors,SBD,Single-ply
2,Larysa Vitsyevska,1978,52,51.7,Ukraine,130,140,-145,140,80,-87.5,-87.5,80,-155,155,-160,155,375,F,Juniors,SBD,Single-ply
3,Ludmila Titova,1978,52,51.4,Ukraine,130,137.5,142.5,142.5,65,-70,70,70,135,145,-152.5,145,357.5,F,Juniors,SBD,Single-ply
4,Lidia Koziol,1980,52,51.4,Poland,120,130,135,135,62.5,67.5,-70,67.5,125,135,-140,135,337.5,F,Juniors,SBD,Single-ply
5,Sophie Guihomat,1975,52,51.2,France,120,-125,-125,120,55,60,-62.5,60,-135,135,142.5,142.5,322.5,F,Juniors,SBD,Single-ply
1,Elena Petrunina,1976,56,54.9,Russia,170,175,180,180,90,95,97.5,97.5,170,175,177.5,177.5,455,F,Juniors,SBD,Single-ply
2,Dana Matejova,1975,56,55.7,Germany,-157.5,157.5,162.5,162.5,92.5,97.5,100,100,145,152.5,-160,152.5,415,F,Juniors,SBD,Single-ply
3,Oxana Gordienko,1977,56,54.5,Ukraine,120,132.5,-137.5,132.5,62.5,70,75,75,130,145,152.5,152.5,360,F,Juniors,SBD,Single-ply
DQ,Agnieszka Ligeza,1977,56,53.7,Poland,-110,-115,-115,,,,,,,,,,,F,Juniors,SBD,Single-ply
DQ,Inna Maximova,1976,56,55.7,Russia,165,175,-185,175,-85,-85,-85,,,,,,,F,Juniors,SBD,Single-ply
1,Oksana Belova,1975,60,56.5,Russia,165,180,-190,180,100,105,-110,105,175,190,-200.5,190,475,F,Juniors,SBD,Single-ply
2,Oxana Sasko,1982,60,59.1,Ukraine,180,190,-197.5,190,80,-85,-85,80,170,-190,-190,170,440,F,Juniors,SBD,Single-ply
3,Yulia Zhilskaij,1978,60,58.5,Belarus,135,-147.5,155,155,100,-110,110,110,145,155,160,160,425,F,Juniors,SBD,Single-ply
4,Anne Heikkilä,1978,60,57.6,Finland,145,-152.5,155,155,90,95,97.5,97.5,145,150,-152.5,150,402.5,F,Juniors,SBD,Single-ply
5,Bente Arntsen,1976,60,59.4,Norway,145,-152.5,-152.5,145,-85,85,92.5,92.5,147.5,152.5,-155,152.5,390,F,Juniors,SBD,Single-ply
6,Daniela Falck,1975,60,59,Germany,130,-137.5,-137.5,130,60,62.5,65,65,150,162.5,167.5,167.5,362.5,F,Juniors,SBD,Single-ply
7,Anke Wendt,1978,60,58.9,Germany,125,130,135,135,60,-65,65,65,140,147.5,152.5,152.5,352.5,F,Juniors,SBD,Single-ply
1,Svetlana Miklashevich,1975,67.5,66.5,Russia,170,180,-190,180,130,140,-142.5,140,170,182.5,187.5,187.5,507.5,F,Juniors,SBD,Single-ply
2,Lesya Humynska,1980,67.5,62.7,Ukraine,185,192.5,-197.5,192.5,100,105,-110,105,185,192.5,-197.5,192.5,490,F,Juniors,SBD,Single-ply
3,Beate Grabosch,1975,67.5,65.1,Germany,135,145,152.5,152.5,80,87.5,-92.5,87.5,145,152.5,,152.5,392.5,F,Juniors,SBD,Single-ply
4,Maria Koskinen,1975,67.5,66.6,Finland,142.5,-150,-150,142.5,72.5,82.5,-87.5,82.5,130,137.5,142.5,142.5,367.5,F,Juniors,SBD,Single-ply
5,Elena Belova,1979,67.5,63.4,Belarus,137.5,-147.5,-147.5,137.5,80,87.5,-90,87.5,120,130,-145,130,355,F,Juniors,SBD,Single-ply
1,Anja Wiezkowiak,1975,75,71,Germany,197.5,207.5,212.5,212.5,102.5,107.5,110,110,205,220,232.5,232.5,555,F,Juniors,SBD,Single-ply
2,Ingunn Haakonsen,1976,75,69.5,Norway,175,185,-192.5,185,90,95,-100,95,175,185,190,190,470,F,Juniors,SBD,Single-ply
3,Svetlana Makarova,1975,75,68,Russia,150,162.5,170,170,95,102.5,107.5,107.5,145,-155,155,155,432.5,F,Juniors,SBD,Single-ply
4,Agnie Leszczynska,1980,75,68,Poland,160,-170,170,170,55,60,65,65,160,165,170,170,405,F,Juniors,SBD,Single-ply
5,Natascha Gulik,1979,75,71.5,Belarus,120,130,-145,130,-85,85,-95,85,120,130,-142.5,130,345,F,Juniors,SBD,Single-ply
6,Catja Smith,1976,75,71.5,UK,-135,135,-147.5,135,65,-70,-75,65,135,-142.5,-142.5,135,335,F,Juniors,SBD,Single-ply
1,Natalya Payusova,1975,82.5,78.9,Russia,200,210,220,220,140,150,152.5,152.5,200,-222.5,-222.5,200,572.5,F,Juniors,SBD,Single-ply
2,Samantha Burns-Salmond,1976,82.5,76.5,UK,-150,155,-165,155,80,-87.5,-90,80,150,162.5,-167.5,162.5,397.5,F,Juniors,SBD,Single-ply
3,Ewa Przytulska,1982,82.5,75.5,Poland,125,-135,135,135,77.5,-85,-85,77.5,142.5,150,155,155,367.5,F,Juniors,SBD,Single-ply
4,Evelyn Reichart,1978,82.5,75.5,Austria,127.5,135,-140,135,72.5,80,-85,80,112.5,120,-127.5,120,335,F,Juniors,SBD,Single-ply
1,Anna Ganenko,1975,90,89.5,Ukraine,170,200,210,210,110,125,-132.5,125,150,172.5,180,180,515,F,Juniors,SBD,Single-ply
2,Sanna Rajahalme,1978,90,83.5,Finland,155,165,-172.5,165,80,85,-87.5,85,120,130,-140,130,380,F,Juniors,SBD,Single-ply
1,Angela Torskaya,1977,90+,101.5,Ukraine,190,-200,200,200,-105,-105,105,105,170,195,200,200,505,F,Juniors,SBD,Single-ply
1,Vyacheslav Gorbunov,1975,52,51.4,Russia,,,,200,,,,135,,,,235,570,M,Juniors,SBD,Single-ply
2,Maik Tronke,1976,52,51.4,Germany,,,,205,,,,122.5,,,,150,477.5,M,Juniors,SBD,Single-ply
3,Dariusz Wsola,1978,52,50.8,Poland,,,,195,,,,105,,,,172.5,472.5,M,Juniors,SBD,Single-ply
1,Vladimir Maliagov,1977,56,55.8,Russia,,,,215,,,,122.5,,,,195,532.5,M,Juniors,SBD,Single-ply
2,Sławomir Śledź,1976,56,54.9,Poland,,,,195,,,,125,,,,180,500,M,Juniors,SBD,Single-ply
3,Marko Kytölä,1977,56,55.3,Finland,,,,187.5,,,,100,,,,205,492.5,M,Juniors,SBD,Single-ply
4,Zdenek Spisiak,1975,56,55.4,Germany,,,,190,,,,112.5,,,,187.5,490,M,Juniors,SBD,Single-ply
DQ,Viache Slisarenko,1981,56,55.6,Ukraine,,,,195,,,,105,,,,,,M,Juniors,SBD,Single-ply
1,Nikolai Sokolov,1979,60,59.4,Russia,,,,230,,,,147.5,,,,227.5,605,M,Juniors,SBD,Single-ply
2,Amit Selberg,1976,60,59.8,Sweden,,,,230,,,,165,,,,210,605,M,Juniors,SBD,Single-ply
3,Jani Silta-Aho,1976,60,59.6,Finland,,,,210,,,,117.5,,,,215,542.5,M,Juniors,SBD,Single-ply
4,Dariusz Drozdzik,1977,60,60,Poland,,,,165,,,,120,,,,170,455,M,Juniors,SBD,Single-ply
1,Evgeniy Dolgov,1976,67.5,66.9,Russia,,,,265,,,,155,,,,265,685,M,Juniors,SBD,Single-ply
2,Steve Loncke,1975,67.5,66.7,Belgium,,,,230,,,,145,,,,242.5,617.5,M,Juniors,SBD,Single-ply
3,Volodim Vysotzkiy,1979,67.5,66.4,Ukraine,,,,240,,,,132.5,,,,222.5,595,M,Juniors,SBD,Single-ply
4,Sergei Leonovitch,1979,67.5,66.7,Belarus,,,,220,,,,145,,,,210,575,M,Juniors,SBD,Single-ply
5,Carol Jarolim,1976,67.5,66.4,Germany,,,,220,,,,125,,,,210,555,M,Juniors,SBD,Single-ply
6,Marcel Mette,1976,67.5,66.9,Germany,,,,192.5,,,,135,,,,207.5,535,M,Juniors,SBD,Single-ply
7,Aleksan Poshelyuk,1979,67.5,63.8,Belarus,,,,170,,,,115,,,,210,495,M,Juniors,SBD,Single-ply
DQ,Hassan El-Belghetti,1975,67.5,66,France,,,,245,,,,125,,,,,,M,Juniors,SBD,Single-ply
1,Roman Shabanov,1976,75,73.6,Russia,,,,280,,,,190,,,,270,740,M,Juniors,SBD,Single-ply
2,Sergey Gordeev,1976,75,74,Russia,,,,285,,,,167.5,,,,270,722.5,M,Juniors,SBD,Single-ply
3,Wieslaw Grabski,1977,75,74.6,Poland,,,,270,,,,177.5,,,,235,682.5,M,Juniors,SBD,Single-ply
4,Vlastimil Peterka,1975,75,74.1,Czechia,,,,250,,,,162.5,,,,250,662.5,M,Juniors,SBD,Single-ply
5,Konstan Yarkevich,1980,75,74.3,Belarus,,,,250,,,,145,,,,250,645,M,Juniors,SBD,Single-ply
6,Christian Brauer,1978,75,74.5,Germany,,,,227.5,,,,130,,,,235,592.5,M,Juniors,SBD,Single-ply
DQ,Andriy Ivzhenko,1977,75,74.3,Ukraine,,,,255,,,,165,,,,,,M,Juniors,SBD,Single-ply
1,Andrey Tarasenko,1976,82.5,81.7,Russia,,,,302.5,,,,218,,,,300,820,M,Juniors,SBD,Single-ply
2,Marek Radola,1975,82.5,81.8,Poland,,,,305,,,,175,,,,275,755,M,Juniors,SBD,Single-ply
3,Oleksiy Rokochyy Jr,1981,82.5,82,Ukraine,,,,307.5,,,,160,,,,277.5,745,M,Juniors,SBD,Single-ply
4,Jacek Kopienka,1975,82.5,81.7,Poland,,,,270,,,,182.5,,,,270,722.5,M,Juniors,SBD,Single-ply
5,Andriy Zabozhny,1978,82.5,78.2,Ukraine,,,,290,,,,142.5,,,,270,702.5,M,Juniors,SBD,Single-ply
DQ,Alexey Nemtsev,1975,82.5,79.9,Russia,,,,300,,,,200,,,,,,M,Juniors,SBD,Single-ply
1,Dmitriy Fedenko,1975,90,85.4,Russia,,,,310,,,,207.5,,,,300,817.5,M,Juniors,SBD,Single-ply
2,Oleksi Natzarenko,1977,90,87.2,Ukraine,,,,312.5,,,,160,,,,282.5,755,M,Juniors,SBD,Single-ply
3,Rinalds Diminish,1975,90,89.2,Latvia,,,,280,,,,185,,,,290,755,M,Juniors,SBD,Single-ply
4,Ildar Zakirov,1976,90,89.2,Ukraine,,,,312.5,,,,162.5,,,,280,755,M,Juniors,SBD,Single-ply
5,Jarno Ruohonen,1975,90,89.5,Finland,,,,285,,,,190,,,,260,735,M,Juniors,SBD,Single-ply
6,Stefan Weiermann,1975,90,89.8,Austria,,,,277.5,,,,182.5,,,,267.5,727.5,M,Juniors,SBD,Single-ply
7,Christian Sämann,1977,90,88.9,Germany,,,,285,,,,180,,,,250,715,M,Juniors,SBD,Single-ply
1,Nikolay Suslov,1979,100,96.2,Russia,,,,340,,,,200,,,,315,855,M,Juniors,SBD,Single-ply
2,Niklas Gustafsson,1975,100,99.3,Sweden,,,,305,,,,202.5,,,,312.5,820,M,Juniors,SBD,Single-ply
3,Sergiy Makrushin,1975,100,98.9,Ukraine,,,,300,,,,210,,,,300,810,M,Juniors,SBD,Single-ply
4,Ignat Belousov,1976,100,96.6,Belarus,,,,260,,,,170,,,,280,710,M,Juniors,SBD,Single-ply
5,Herbert Stummer,1976,100,91.2,Austria,,,,225,,,,155,,,,230,610,M,Juniors,SBD,Single-ply
DQ,Arkadiusz Buda,1976,100,91.4,Poland,,,,,,,,,,,,,,M,Juniors,SBD,Single-ply
DQ,Dezidér Mihok,1975,100,94.5,Czechia,,,,280,,,,,,,,,,M,Juniors,SBD,Single-ply
1,Volodymyr Muravlyov,1975,110,109.1,Ukraine,,,,320,,,,225,,,,337.5,882.5,M,Juniors,SBD,Single-ply
2,Jari Martikainen,1975,110,109.4,Finland,,,,307.5,,,,177.5,,,,320,805,M,Juniors,SBD,Single-ply
3,Kristoffer Willebrand,1975,110,107.7,Sweden,,,,310,,,,190,,,,290,790,M,Juniors,SBD,Single-ply
4,Damir Krunic,1975,110,109.5,Yugoslavia,,,,275,,,,200,,,,297.5,772.5,M,Juniors,SBD,Single-ply
5,Vital Baranovskiy,1979,110,106.8,Belarus,,,,292.5,,,,180,,,,280,752.5,M,Juniors,SBD,Single-ply
6,Andy-Elvis Dörner,1976,110,110,Germany,,,,305,,,,170,,,,270,745,M,Juniors,SBD,Single-ply
7,Miloš Šnajdr,1975,110,109.4,Germany,,,,260,,,,170,,,,260,690,M,Juniors,SBD,Single-ply
1,Frederik Westmann,1975,125,123.4,Sweden,,,,320,,,,207.5,,,,297.5,825,M,Juniors,SBD,Single-ply
2,Mathias Bache-Gabrielsen,1976,125,120.4,Norway,,,,325,,,,212.5,,,,285,822.5,M,Juniors,SBD,Single-ply
3,Piotr Korzeb,1978,125,110.3,Poland,,,,282.5,,,,190,,,,255,727.5,M,Juniors,SBD,Single-ply
DQ,Johan Vikberg,1975,125,123.7,Sweden,,,,,,,,,,,,,,M,Juniors,SBD,Single-ply
1,Roman Ukraintsev,1977,125+,141.3,Russia,,,,350,,,,215,,,,330,895,M,Juniors,SBD,Single-ply
2,Žydrūnas Savickas,1975,125+,136,Lithuania,,,,342.5,,,,205,,,,320,867.5,M,Juniors,SBD,Single-ply
3,Anders Johansson,1975,125+,136.6,Sweden,,,,330,,,,195,,,,295,820,M,Juniors,SBD,Single-ply
4,Roman Novyk,1976,125+,130.2,Ukraine,,,,290,,,,180,,,,270,740,M,Juniors,SBD,Single-ply
