Division,WeightClassKg,Place,Name,Team,BodyweightKg,Best3SquatKg,Best3BenchKg,Best3DeadliftKg,TotalKg,Equipment,Event,Sex
Boys,51.71,1,David Carrasco,Big Lake Reagan County,50.98,147.42,90.72,158.76,396.89,Single-ply,SBD,M
Boys,51.71,2,Andrew DeLeon,Roscoe Collegiate,50.62,129.27,68.04,124.74,322.05,Single-ply,SBD,M
Boys,51.71,3,Zaniel Florez,Kermit,50.44,102.06,61.23,113.4,276.69,Single-ply,SBD,M
Boys,51.71,4,Ezekiel Murphy,Roscoe Collegiate,46.9,102.06,52.16,108.86,263.08,Single-ply,SBD,M
Boys,51.71,5,Jeremy Robles,San Angelo Lake View,51.71,95.25,56.7,102.06,254.01,Single-ply,SBD,M
Boys,51.71,6,Scott Sullivan #3,Midland Lee,48.9,70.31,52.16,68.04,190.51,Single-ply,SBD,M
Boys,51.71,DQ,Fransisco Ocampo,San Angelo Lake View,51.62,92.99,61.23,,,Single-ply,SBD,M
Boys,55.79,1,Raul Rey,Big Lake Reagan County,54.61,149.69,79.38,154.22,383.29,Single-ply,SBD,M
Boys,55.79,2,Elias Perez,Sonora,52.16,127.01,61.23,124.74,312.98,Single-ply,SBD,M
Boys,59.87,1,Cody Coombs,San Angelo Lake View,59.69,172.37,117.93,170.1,460.4,Single-ply,SBD,M
Boys,59.87,2,Miguel Arroyo,San Angelo Lake View,57.42,163.29,92.99,167.83,424.11,Single-ply,SBD,M
Boys,59.87,3,Oscar Gutierrez,Sonora,57.88,140.61,83.91,151.95,376.48,Single-ply,SBD,M
Boys,59.87,4,Adrian Whitby,Ozona,56.97,136.08,83.91,131.54,351.53,Single-ply,SBD,M
Boys,59.87,5,Adrian Martinez #12,Odessa,59.33,129.27,63.5,136.08,328.85,Single-ply,SBD,M
Boys,59.87,6,Jacob Childress,Ozona,56.7,127.01,68.04,127.01,322.05,Single-ply,SBD,M
Boys,67.13,1,Zavian Florez,Kermit,66.32,185.97,102.06,181.44,469.47,Single-ply,SBD,M
Boys,67.13,2,Jeremy Mireles,San Angelo Lake View,65.95,145.15,99.79,167.83,412.77,Single-ply,SBD,M
Boys,67.13,3,Javon Mathews,Midland,65.5,167.83,81.65,151.95,401.43,Single-ply,SBD,M
Boys,67.13,4,Ben Sánchez,San Angelo Central,62.14,140.61,83.91,161.03,385.55,Single-ply,SBD,M
Boys,67.13,5,Anthony Martinez,San Angelo Lake View,67.13,131.54,106.59,145.15,383.29,Single-ply,SBD,M
Boys,67.13,6,Marcus Perez,Ozona,64.86,142.88,83.91,154.22,381.02,Single-ply,SBD,M
Boys,67.13,7,Zavier Rodriguez,Sonora,65.23,147.42,68.04,151.95,367.41,Single-ply,SBD,M
Boys,67.13,8,Julian Vizcaino,Odessa,65.77,124.74,70.31,154.22,349.27,Single-ply,SBD,M
Boys,67.13,9,Travis Rowaldt,San Angelo Lake View,65.59,115.67,88.45,140.61,344.73,Single-ply,SBD,M
Boys,67.13,10,Adric Gonzalez,Odessa,64.05,138.35,88.45,102.06,328.85,Single-ply,SBD,M
Boys,67.13,DQ,Cade Cramer,Mertzon Irion County,63.32,165.56,99.79,,,Single-ply,SBD,M
Boys,67.13,DQ,Mack Plemins,Midland,66.68,120.2,79.38,,,Single-ply,SBD,M
Boys,67.13,DQ,Landry Burnes,San Angelo Central,61.69,149.69,,,,Single-ply,SBD,M
Boys,74.84,1,Nestor Jiminez,Midland Lee,73.12,197.31,122.47,247.21,566.99,Single-ply,SBD,M
Boys,74.84,2,Y'Mari Collins,Midland Lee,74.84,183.7,120.2,192.78,496.68,Single-ply,SBD,M
Boys,74.84,3,Jonathan Bostick,Midland Lee,74.48,170.1,122.47,181.44,474,Single-ply,SBD,M
Boys,74.84,4,Aiden Fuentes,San Angelo Central,72.03,181.44,88.45,185.97,455.86,Single-ply,SBD,M
Boys,74.84,5,Braden Jowers,San Angelo Lake View,70.4,156.49,106.59,181.44,444.52,Single-ply,SBD,M
Boys,74.84,6,Sylvester Galindo,Midland,71.58,154.22,83.91,156.49,394.63,Single-ply,SBD,M
Boys,74.84,7,David Guerrero,Big Lake Reagan County,69.4,183.7,81.65,124.74,390.09,Single-ply,SBD,M
Boys,74.84,8,Michael Salas,Odessa,73.75,147.42,74.84,151.95,374.21,Single-ply,SBD,M
Boys,74.84,9,Colton Watts,Roscoe Collegiate,73.12,124.74,79.38,147.42,351.53,Single-ply,SBD,M
Boys,74.84,10,Paulino Gabaldon,Odessa,70.67,124.74,72.57,138.35,335.66,Single-ply,SBD,M
Boys,74.84,11,Modesto Resendez,San Angelo Lake View,70.58,113.4,81.65,124.74,319.78,Single-ply,SBD,M
Boys,74.84,12,Elias Avila,Big Lake Reagan County,67.68,113.4,65.77,113.4,292.57,Single-ply,SBD,M
Boys,82.1,1,Steban Flores,Ozona,81.19,226.8,181.44,231.33,639.57,Single-ply,SBD,M
Boys,82.1,2,Owen Sullivan,Midland Lee,79.47,192.78,145.15,206.38,544.31,Single-ply,SBD,M
Boys,82.1,3,Bubba Christensen,San Angelo Lake View,77.47,208.65,120.2,208.65,537.51,Single-ply,SBD,M
Boys,82.1,4,John Paul Estrada,Midland,77.02,195.04,145.15,195.04,535.24,Single-ply,SBD,M
Boys,82.1,5,Timothy Gates,Midland,75.57,197.31,124.74,206.38,528.44,Single-ply,SBD,M
Boys,82.1,6,Isaiah Harvey,Midland Lee,80.56,183.7,136.08,206.38,526.17,Single-ply,SBD,M
Boys,82.1,7,Francisco Garcia,Roscoe Collegiate,76.29,206.38,124.74,192.78,523.9,Single-ply,SBD,M
Boys,82.1,8,Josh Fotis,Midland Lee,80.2,172.37,142.88,204.12,519.36,Single-ply,SBD,M
Boys,82.1,9,Josh Traylor,Midland Lee,79.47,213.19,97.52,195.04,505.76,Single-ply,SBD,M
Boys,82.1,10,Marshall Mayfield,Midland,80.1,188.24,99.79,190.51,478.54,Single-ply,SBD,M
Boys,82.1,11,Carter Christensen,San Angelo Lake View,80.83,163.29,120.2,174.63,458.13,Single-ply,SBD,M
Boys,82.1,12,Issahia Valenzuela,Big Lake Reagan County,82.1,190.51,99.79,165.56,455.86,Single-ply,SBD,M
Boys,82.1,13,Austin Damian,Ozona,81.19,172.37,102.06,174.63,449.06,Single-ply,SBD,M
Boys,82.1,14,Matthieu Robles,Odessa,81.28,142.88,97.52,165.56,405.97,Single-ply,SBD,M
Boys,82.1,15,Jessie Edgar,Mertzon Irion County,81.83,161.03,90.72,154.22,405.97,Single-ply,SBD,M
Boys,82.1,16,Gio Guevara,San Angelo Grape Creek,76.48,127.01,92.99,158.76,378.75,Single-ply,SBD,M
Boys,82.1,17,Teaggan DeLeon,San Angelo Grape Creek,76.93,127.01,92.99,149.69,369.68,Single-ply,SBD,M
Boys,82.1,DQ,Juan Baez,Sonora,81.19,254.01,,,,Single-ply,SBD,M
Boys,82.1,DQ,Aj Alonzo,Big Lake Reagan County,80.65,170.1,,,,Single-ply,SBD,M
Boys,82.1,DQ,Austin Aguirre,Odessa,80.83,161.03,,,,Single-ply,SBD,M
Boys,89.81,1,Oscar Lucio,Odessa,88.18,226.8,127.01,233.6,587.4,Single-ply,SBD,M
Boys,89.81,2,Nico Ortiz,Big Lake Reagan County,89.18,217.72,136.08,213.19,566.99,Single-ply,SBD,M
Boys,89.81,3,Hulen Hubbard,Midland Lee,89.81,197.31,129.27,208.65,535.24,Single-ply,SBD,M
Boys,89.81,4,Adrian Lomas,Roscoe Collegiate,89.54,204.12,122.47,188.24,514.83,Single-ply,SBD,M
Boys,89.81,5,Ty Perez,Sonora,87.82,210.92,117.93,174.63,503.49,Single-ply,SBD,M
Boys,89.81,6,Justin Ortiz,Big Lake Reagan County,86.27,181.44,115.67,201.85,498.95,Single-ply,SBD,M
Boys,89.81,7,Mykel Sevier,San Angelo Lake View,83.28,172.37,117.93,147.42,437.72,Single-ply,SBD,M
Boys,89.81,8,Vidal Saenz,Midland,86.45,151.95,86.18,192.78,430.91,Single-ply,SBD,M
Boys,89.81,9,Seth Edwards,Sonora,85.73,145.15,70.31,136.08,351.53,Single-ply,SBD,M
Boys,89.81,10,Noah Talamaniez,San Angelo Central,87.63,106.59,65.77,111.13,283.5,Single-ply,SBD,M
Boys,99.79,1,Christian Ramon,Sonora,99.45,254.01,163.29,199.58,616.89,Single-ply,SBD,M
Boys,99.79,2,Dylan Goode,Midland Lee,99.79,222.26,136.08,217.72,576.06,Single-ply,SBD,M
Boys,99.79,3,Austin Lara,Roscoe Collegiate,98.16,208.65,122.47,195.04,526.17,Single-ply,SBD,M
Boys,99.79,4,Blake Miller,Mertzon Irion County,94.17,170.1,158.76,195.04,523.9,Single-ply,SBD,M
Boys,99.79,5,Toby Lambert,San Angelo Lake View,92.08,181.44,140.61,174.63,496.68,Single-ply,SBD,M
Boys,99.79,6,Donatello Tovar,San Angelo Lake View,93.26,185.97,129.27,181.44,496.68,Single-ply,SBD,M
Boys,99.79,7,Josue Vasquez,Kermit,94.44,181.44,113.4,172.37,467.2,Single-ply,SBD,M
Boys,99.79,8,Angelo Lopez,Kermit,96.52,165.56,88.45,172.37,426.38,Single-ply,SBD,M
Boys,99.79,9,Nicholas Billington,Mertzon Irion County,90.45,151.95,108.86,163.29,424.11,Single-ply,SBD,M
Boys,99.79,DQ,Dustin Eilers,Odessa,99.7,185.97,102.06,,,Single-ply,SBD,M
Boys,109.77,1,Josh Ramos,Midland,103.15,231.33,147.42,231.33,610.08,Single-ply,SBD,M
Boys,109.77,2,Isaiah Vargas,Midland,100.88,229.06,151.95,217.72,598.74,Single-ply,SBD,M
Boys,109.77,3,Wesley Estridge,Big Lake Reagan County,109.5,206.38,115.67,197.31,519.36,Single-ply,SBD,M
Boys,109.77,4,Joshua Diaz,San Angelo Central,102.69,158.76,97.52,165.56,421.84,Single-ply,SBD,M
Boys,109.77,5,Javier Cabello,Odessa,106.14,147.42,72.57,181.44,401.43,Single-ply,SBD,M
Boys,109.77,6,Jonathan Jurado,Ozona,104.6,124.74,74.84,142.88,342.46,Single-ply,SBD,M
Boys,124.74,1,Tristan Ortiz,Big Lake Reagan County,119.93,340.19,167.83,249.48,757.5,Single-ply,SBD,M
Boys,124.74,2,Nacho Rubio,Midland Lee,114.76,235.87,122.47,215.46,573.79,Single-ply,SBD,M
Boys,124.74,3,Raziel Burrola,Kermit,114.76,192.78,136.08,208.65,537.51,Single-ply,SBD,M
Boys,124.74,4,Ben Brower,Midland,112.76,204.12,127.01,204.12,535.24,Single-ply,SBD,M
Boys,124.74,5,Spencer Blue,Midland,114.49,176.9,131.54,226.8,535.24,Single-ply,SBD,M
Boys,124.74,6,Darius Pando,Kermit,112.85,197.31,113.4,204.12,514.83,Single-ply,SBD,M
Boys,124.74+,1,Zathan McIntosh,Kermit,169.92,285.76,163.29,215.46,664.51,Single-ply,SBD,M
Boys,124.74+,2,Brandon Jones,Odessa,174,278.96,133.81,183.7,596.47,Single-ply,SBD,M
Boys,124.74+,3,Josh Wilson,Midland Lee,138.44,229.06,117.93,233.6,580.6,Single-ply,SBD,M
Boys,124.74+,4,Xosue Duran,San Angelo Lake View,158.58,199.58,115.67,226.8,542.04,Single-ply,SBD,M
Boys,124.74+,5,Dylan Rodriguez,Kermit,167.28,156.49,88.45,185.97,430.91,Single-ply,SBD,M
Boys,124.74+,DQ,Taylor Elkins,Mertzon Irion County,144.24,276.69,,,,Single-ply,SBD,M
Boys,,NS,Jose Chavaria,Roscoe Collegiate,,,,,,Single-ply,SBD,M
Boys,,NS,Abraham Rodriguez,Ozona,,,,,,Single-ply,SBD,M
Boys,,NS,Caleb Wilson,Mertzon Irion County,,,,,,Single-ply,SBD,M
Boys,,NS,Isalem Moreno,Kermit,,,,,,Single-ply,SBD,M
Boys,,NS,Tony Ortiz,Big Lake Reagan County,,,,,,Single-ply,SBD,M
Boys,,NS,Jansen Morris,Sonora,,,,,,Single-ply,SBD,M
Boys,,NS,Eddie Infante,Sonora,,,,,,Single-ply,SBD,M
Boys,,NS,Michael Morales,Sonora,,,,,,Single-ply,SBD,M
Boys,,NS,Gavin Fields,San Angelo Central,,,,,,Single-ply,SBD,M
Boys,,NS,John DeLuna,San Angelo Grape Creek,,,,,,Single-ply,SBD,M
Boys,,NS,Bobby Pena,San Angelo Central,,,,,,Single-ply,SBD,M
Boys,,NS,Justice Wilson,San Angelo Grape Creek,,,,,,Single-ply,SBD,M
