Division,WeightClassKg,Place,Name,Team,BodyweightKg,Best3SquatKg,Best3BenchKg,Best3DeadliftKg,TotalKg,Equipment,Event,Sex
Boys,51.71,DQ,Benny Lara,Victoria West,50.8,167.83,90.72,,,Single-ply,SBD,M
Boys,55.79,1,Jose Bautista #1,San Antonio East Central,54.43,170.1,108.86,188.24,467.2,Single-ply,SBD,M
Boys,55.79,2,Michael Casillas,Victoria West,54.88,172.37,95.25,185.97,453.59,Single-ply,SBD,M
Boys,55.79,3,Brytin Brown,Port Lavaca Calhoun,54.88,136.08,61.23,127.01,324.32,Single-ply,SBD,M
Boys,59.87,1,Moc Moo,Port Lavaca Calhoun,58.97,235.87,122.47,208.65,566.99,Single-ply,SBD,M
Boys,59.87,2,Ulysses Solis,San Antonio East Central,58.06,145.15,90.72,183.7,419.57,Single-ply,SBD,M
Boys,59.87,3,Derrick Rodriguez,San Antonio East Central,59.42,158.76,90.72,156.49,405.97,Single-ply,SBD,M
Boys,59.87,4,Colton Bean,Devine,58.06,140.61,79.38,154.22,374.21,Single-ply,SBD,M
Boys,67.13,1,Jose Cumpean,Port Lavaca Calhoun,66.22,215.46,131.54,199.58,546.58,Single-ply,SBD,M
Boys,67.13,2,Jeremiah Lewis,San Antonio East Central,66.22,183.7,108.86,208.65,501.22,Single-ply,SBD,M
Boys,67.13,3,Dustin Torres,Beeville Jones,67.13,197.31,111.13,179.17,487.61,Single-ply,SBD,M
Boys,67.13,4,Seth O'Canas,Victoria West,65.77,176.9,115.67,176.9,469.47,Single-ply,SBD,M
Boys,67.13,5,Kevin Valdez,Castroville Medina Valley,63.96,145.15,95.25,163.29,403.7,Single-ply,SBD,M
Boys,67.13,6,Marco Burkman-Flaig,San Antonio Cole,64.41,158.76,83.91,154.22,396.89,Single-ply,SBD,M
Boys,67.13,7,Demetrios Monreal,Devine,60.33,147.42,90.72,154.22,392.36,Single-ply,SBD,M
Boys,67.13,8,Zechariah Segovia,Beeville Jones,63.5,142.88,74.84,147.42,365.14,Single-ply,SBD,M
Boys,67.13,DQ,Luke Torres,Devine,67.13,,,,,Single-ply,SBD,M
Boys,74.84,1,Daniel Leita,Port Lavaca Calhoun,73.03,272.16,158.76,281.23,712.14,Single-ply,SBD,M
Boys,74.84,2,Steven Ramirez,Devine,73.03,219.99,131.54,219.99,571.53,Single-ply,SBD,M
Boys,74.84,3,Derrick Carroll,Beeville Jones,73.94,226.8,113.4,226.8,566.99,Single-ply,SBD,M
Boys,74.84,4,Richard Villarreal,San Antonio East Central,71.67,206.38,111.13,235.87,553.38,Single-ply,SBD,M
Boys,74.84,5,Luke Janosky,Castroville Medina Valley,72.12,219.99,117.93,204.12,542.04,Single-ply,SBD,M
Boys,74.84,6,Josh Villareal,Victoria West,72.57,183.7,113.4,206.38,503.49,Single-ply,SBD,M
Boys,74.84,7,Noah Rodriguez,Victoria West,73.48,174.63,99.79,183.7,458.13,Single-ply,SBD,M
Boys,74.84,8,Alejandro Flores,Del Rio,74.39,163.29,104.33,188.24,455.86,Single-ply,SBD,M
Boys,74.84,9,Tyrell Dunlap,San Antonio Cole,74.39,165.56,99.79,179.17,444.52,Single-ply,SBD,M
Boys,74.84,10,Ronnie Andrade,San Antonio East Central,71.21,154.22,99.79,185.97,439.98,Single-ply,SBD,M
Boys,74.84,11,Jace Hackebeil,Devine,74.39,154.22,81.65,163.29,399.16,Single-ply,SBD,M
Boys,74.84,12,Isaiah LaDuron,San Antonio Cole,71.21,127.01,63.5,136.08,326.59,Single-ply,SBD,M
Boys,74.84,DQ,Eric Lara,Beeville Jones,73.03,147.42,,,,Single-ply,SBD,M
Boys,82.1,1,Patrick Prieto,Beeville Jones,77.56,231.33,120.2,226.8,578.33,Single-ply,SBD,M
Boys,82.1,2,Ken'twaun Freeman,Victoria West,81.19,215.46,133.81,229.06,578.33,Single-ply,SBD,M
Boys,82.1,3,Samuel Castillo S,San Antonio East Central,81.65,213.19,140.61,195.04,548.85,Single-ply,SBD,M
Boys,82.1,4,Zach Whitley,Castroville Medina Valley,79.83,201.85,120.2,206.38,528.44,Single-ply,SBD,M
Boys,82.1,5,Xavier Rivera,Port Lavaca Calhoun,81.19,185.97,129.27,210.92,526.17,Single-ply,SBD,M
Boys,82.1,6,Juan Sanchez,San Antonio East Central,77.11,208.65,115.67,195.04,519.36,Single-ply,SBD,M
Boys,82.1,7,Demitrius Jeffries,Victoria West,76.66,190.51,117.93,176.9,485.34,Single-ply,SBD,M
Boys,82.1,8,Dakota Wofford,Devine,80.29,167.83,133.81,181.44,483.08,Single-ply,SBD,M
Boys,82.1,9,Isaac Santos,Castroville Medina Valley,76.2,154.22,102.06,163.29,419.57,Single-ply,SBD,M
Boys,82.1,10,Nick Padilla,Del Rio,79.83,131.54,97.52,151.95,381.02,Single-ply,SBD,M
Boys,82.1,DQ,Ricardo Gonzalez,Del Rio,82.1,,,,,Single-ply,SBD,M
Boys,82.1,DQ,Matt Moore,San Antonio Cole,81.65,,,,,Single-ply,SBD,M
Boys,82.1,DQ,Fabian Diego,Del Rio,78.93,,,,,Single-ply,SBD,M
Boys,82.1,DQ,Andrew Garza,Castroville Medina Valley,76.2,208.65,,,,Single-ply,SBD,M
Boys,89.81,1,Chris Madrigal,Beeville Jones,85.73,265.35,158.76,244.94,669.05,Single-ply,SBD,M
Boys,89.81,2,Sylias Mongomery,Port Lavaca Calhoun,89.36,242.67,113.4,256.28,612.35,Single-ply,SBD,M
Boys,89.81,3,Adrian Sustaita,Castroville Medina Valley,83.91,238.14,129.27,238.14,605.55,Single-ply,SBD,M
Boys,89.81,4,Raul Padilla,Victoria West,85.73,204.12,154.22,199.58,557.92,Single-ply,SBD,M
Boys,89.81,5,Manny Arguijo,Del Rio,83.91,210.92,124.74,219.99,555.65,Single-ply,SBD,M
Boys,89.81,6,Austin Felan,Devine,89.36,210.92,142.88,188.24,542.04,Single-ply,SBD,M
Boys,89.81,7,Patrick Rhodes,San Antonio Cole,89.81,192.78,129.27,183.7,505.76,Single-ply,SBD,M
Boys,89.81,8,Jacob Arredondo,Beeville Jones,87.54,188.24,113.4,192.78,494.42,Single-ply,SBD,M
Boys,89.81,9,Lino Tripp,San Antonio Cole,87.54,174.63,97.52,165.56,437.72,Single-ply,SBD,M
Boys,89.81,10,Daniel Gonzalez,Del Rio,85.28,136.08,104.33,156.49,396.89,Single-ply,SBD,M
Boys,89.81,11,Garret Carver,Devine,86.64,142.88,117.93,129.27,390.09,Single-ply,SBD,M
Boys,89.81,DQ,Nya Waye,San Antonio Cole,89.36,,,,,Single-ply,SBD,M
Boys,89.81,DQ,Merbin Carritini,San Antonio Cole,88.45,,,,,Single-ply,SBD,M
Boys,89.81,DQ,Luis Frausto,Del Rio,87.54,181.44,,,,Single-ply,SBD,M
Boys,99.79,1,Nick Galvan,Beeville Jones,97.07,276.69,170.1,247.21,694,Single-ply,SBD,M
Boys,99.79,2,Reagan Brown,Devine,91.17,190.51,120.2,145.15,455.86,Single-ply,SBD,M
Boys,99.79,3,Diego Hernandez,Devine,96.62,181.44,92.99,149.69,424.11,Single-ply,SBD,M
Boys,99.79,DQ,Azel Dimery,Del Rio,99.79,,,,,Single-ply,SBD,M
Boys,99.79,DQ,Jaden Bocanegra,Del Rio,90.72,163.29,,,,Single-ply,SBD,M
Boys,99.79,DQ,Eddie Garcia,Port Lavaca Calhoun,98.88,312.98,170.1,,,Single-ply,SBD,M
Boys,109.77,1,Leo Colom,Port Lavaca Calhoun,102.06,254.01,154.22,260.82,669.05,Single-ply,SBD,M
Boys,109.77,2,Anthony Cantu,San Antonio East Central,108.41,276.69,138.35,238.14,653.17,Single-ply,SBD,M
Boys,109.77,3,Bryce Long,San Antonio East Central,107.95,226.8,158.76,206.38,591.94,Single-ply,SBD,M
Boys,109.77,4,Thomas Chavez,Port Lavaca Calhoun,103.87,254.01,113.4,195.04,562.45,Single-ply,SBD,M
Boys,109.77,5,Joe Mendoza,Del Rio,106.14,210.92,145.15,204.12,560.19,Single-ply,SBD,M
Boys,109.77,6,Dizan Rodriguez,Del Rio,100.24,199.58,124.74,201.85,526.17,Single-ply,SBD,M
Boys,109.77,7,Miguel Costilla,Del Rio,109.32,181.44,106.59,215.46,503.49,Single-ply,SBD,M
Boys,109.77,8,Emilio Constancio,Del Rio,105.23,165.56,90.72,181.44,437.72,Single-ply,SBD,M
Boys,109.77,DQ,Mario Cano,Beeville Jones,107.5,,,,,Single-ply,SBD,M
Boys,124.74,1,Jason Suniga,Victoria West,120.66,319.78,179.17,213.19,712.14,Single-ply,SBD,M
Boys,124.74,2,Christian Arredondo,Devine,117.93,254.01,163.29,190.51,607.81,Single-ply,SBD,M
Boys,124.74,3,Ray Martinez,Port Lavaca Calhoun,117.93,249.48,149.69,195.04,594.21,Single-ply,SBD,M
Boys,124.74,4,Dylan Carroll,Castroville Medina Valley,116.57,222.26,145.15,204.12,571.53,Single-ply,SBD,M
Boys,124.74,5,Anthony Walters,San Antonio Cole,112.04,181.44,124.74,195.04,501.22,Single-ply,SBD,M
Boys,124.74,DQ,Abee Hinojosa,Del Rio,124.74,,,,,Single-ply,SBD,M
Boys,124.74+,1,Odie De La Rosa,Castroville Medina Valley,150.14,283.5,181.44,238.14,703.07,Single-ply,SBD,M
Boys,124.74+,2,Drew Hathaway,Victoria West,130.18,258.55,176.9,238.14,673.58,Single-ply,SBD,M
Boys,124.74+,3,Mike Kessler,Castroville Medina Valley,146.96,283.5,149.69,204.12,637.3,Single-ply,SBD,M
Boys,124.74+,4,Ruben Avila,Victoria West,145.15,256.28,156.49,215.46,628.23,Single-ply,SBD,M
Boys,124.74+,5,Leo Madera,Port Lavaca Calhoun,138.35,254.01,154.22,210.92,619.15,Single-ply,SBD,M
Boys,124.74+,6,Daniel Martinez,Beeville Jones,132.9,219.99,174.63,192.78,587.4,Single-ply,SBD,M
Boys,124.74+,7,Moses Flores,Castroville Medina Valley,133.36,204.12,129.27,174.63,508.02,Single-ply,SBD,M
Boys,124.74+,8,Ernesto Moreno,Castroville Medina Valley,145.6,190.51,127.01,167.83,485.34,Single-ply,SBD,M
Boys,124.74+,DQ,Joseph Rodriguez,Del Rio,151.95,,,,,Single-ply,SBD,M
