Division,WeightClassKg,Place,Name,Team,BodyweightKg,Best3SquatKg,Best3BenchKg,Best3DeadliftKg,TotalKg,Equipment,Event,Sex
Boys,51.71,1,Angel Flores,Weslaco East,51.62,131.54,81.65,154.22,367.41,Single-ply,SBD,M
Boys,55.79,1,Jesse Cortez,Pharr Valley View,52.25,156.49,81.65,183.7,421.84,Single-ply,SBD,M
Boys,55.79,2,Alejandro Flores,Weslaco East,53.98,156.49,81.65,163.29,401.43,Single-ply,SBD,M
Boys,55.79,DQ,Ben Guajardo,Mission Sharyland,55.79,111.13,,,,Single-ply,SBD,M
Boys,59.87,1,Joshua Garcia,Weslaco,59.42,170.1,97.52,188.24,455.86,Single-ply,SBD,M
Boys,59.87,2,Jesus Garcia,Mission,59.87,176.9,92.99,181.44,451.32,Single-ply,SBD,M
Boys,67.13,3,Marco Ruiz,Mission Veterans Memorial,60.06,127.01,81.65,149.69,358.34,Single-ply,SBD,M
Boys,59.87,4,Anthony Gracia,Weslaco,57.42,124.74,68.04,163.29,356.07,Single-ply,SBD,M
Boys,59.87,5,Chris Cantu,Mercedes,58.06,138.35,79.38,138.35,356.07,Single-ply,SBD,M
Boys,67.13,1,Saul Cuellar,Weslaco East,66.41,213.19,111.13,192.78,517.1,Single-ply,SBD,M
Boys,67.13,2,Christian Gonzalez,Weslaco,67.13,167.83,106.59,170.1,444.52,Single-ply,SBD,M
Boys,74.84,3,Emilio Tamez,Weslaco East,67.22,167.83,90.72,176.9,435.45,Single-ply,SBD,M
Boys,67.13,4,Victor Acosta,Pharr Valley View,63.23,151.95,90.72,154.22,396.89,Single-ply,SBD,M
Boys,67.13,5,Victor Rodriguez,La Joya,66.77,120.2,113.4,136.08,369.68,Single-ply,SBD,M
Boys,67.13,6,Ricardo Torres,Rio Grande City,66.95,124.74,72.57,172.37,369.68,Single-ply,SBD,M
Boys,67.13,7,Luis Marina,Mission Sharyland,63.59,120.2,92.99,154.22,367.41,Single-ply,SBD,M
Boys,67.13,8,Marcus Lopez,La Joya Palmview,60.6,104.33,88.45,149.69,342.46,Single-ply,SBD,M
Boys,67.13,9,Pedro Morin,Rio Grande City,61.69,113.4,70.31,122.47,306.17,Single-ply,SBD,M
Boys,67.13,10,James Lopez,Rio Grande City,66.95,106.59,72.57,127.01,306.17,Single-ply,SBD,M
Boys,67.13,DQ,Lenny Villanueva,Mercedes,67.04,,,,,Single-ply,SBD,M
Boys,67.13,DQ,Hector Avitua,Donna,61.69,,,,,Single-ply,SBD,M
Boys,67.13,DQ,Ruben De Leon,Mission,65.95,83.91,,,,Single-ply,SBD,M
Boys,74.84,1,Esteban Flores,Pharr Valley View,74.57,226.8,140.61,260.82,628.23,Single-ply,SBD,M
Boys,82.1,2,Bryan Sanchez,Weslaco East,75.02,219.99,138.35,219.99,578.33,Single-ply,SBD,M
Boys,74.84,3,Marcos Lopez,Donna,73.12,201.85,124.74,185.97,512.56,Single-ply,SBD,M
Boys,82.1,4,Austin Segura,Rio Grande City,74.93,192.78,90.72,181.44,464.93,Single-ply,SBD,M
Boys,74.84,5,Ivan Rodriguez,Pharr Valley View,73.84,172.37,104.33,174.63,451.32,Single-ply,SBD,M
Boys,74.84,6,Cipriano Montes,La Joya,69.04,142.88,111.13,142.88,396.89,Single-ply,SBD,M
Boys,74.84,7,Andrew Leija,PSJA North,74.39,104.33,83.91,136.08,324.32,Single-ply,SBD,M
Boys,74.84,DQ,Gilbert Guajardo,Pharr Valley View,74.07,151.95,,,,Single-ply,SBD,M
Boys,74.84,DQ,Omar Garza,La Joya Palmview,70.31,136.08,86.18,,,Single-ply,SBD,M
Boys,82.1,1,Marco Villarreal,Mission Sharyland,81.37,210.92,149.69,217.72,578.33,Single-ply,SBD,M
Boys,82.1,2,Rick Garza,Mercedes,80.92,215.46,140.61,204.12,560.19,Single-ply,SBD,M
Boys,82.1,3,Armin Solis,Rio Grande City,80.47,229.06,136.08,183.7,548.85,Single-ply,SBD,M
Boys,82.1,4,Ram Mendoza,Weslaco East,81.65,210.92,124.74,199.58,535.24,Single-ply,SBD,M
Boys,82.1,5,Mike Cadena,Donna,80.1,192.78,111.13,199.58,503.49,Single-ply,SBD,M
Boys,82.1,6,Gilbert Trevino,Weslaco,79.92,201.85,104.33,192.78,498.95,Single-ply,SBD,M
Boys,82.1,7,Victor Solis,Mission,76.57,158.76,88.45,147.42,394.63,Single-ply,SBD,M
Boys,82.1,8,Alfredo Villarreal,La Joya Palmview,80.74,145.15,74.84,165.56,385.55,Single-ply,SBD,M
Boys,82.1,9,Joel Leon,La Joya Palmview,82.1,142.88,83.91,147.42,374.21,Single-ply,SBD,M
Boys,82.1,10,Jose Bernal,La Joya Palmview,78.29,149.69,86.18,136.08,371.95,Single-ply,SBD,M
Boys,82.1,DQ,Javier Morales,La Joya,75.52,179.17,,,,Single-ply,SBD,M
Boys,82.1,DQ,Christian Segovia,Mission,80.92,163.29,,,,Single-ply,SBD,M
Boys,82.1,DQ,Andrew Benavidez,PSJA North,77.11,,,,,Single-ply,SBD,M
Boys,89.81,1,Victor Aguilar,Mercedes,88.9,231.33,145.15,240.4,616.89,Single-ply,SBD,M
Boys,89.81,2,Alex Melendez,Pharr Valley View,85.82,226.8,140.61,226.8,594.21,Single-ply,SBD,M
Boys,89.81,3,Lee Gamez,Mercedes,89.81,226.8,136.08,215.46,578.33,Single-ply,SBD,M
Boys,89.81,4,Ryan Navarro,Weslaco East,86.64,226.8,127.01,219.99,573.79,Single-ply,SBD,M
Boys,89.81,5,Luis Gamez,La Joya,89.81,226.8,149.69,183.7,560.19,Single-ply,SBD,M
Boys,89.81,6,Christian Brown,Pharr Valley View,86.77,222.26,115.67,213.19,551.11,Single-ply,SBD,M
Boys,89.81,7,Edgar Fernandez,Mission Sharyland,84.01,167.83,113.4,197.31,478.54,Single-ply,SBD,M
Boys,89.81,8,Brandon Lopez,Donna,85.55,174.63,117.93,181.44,474,Single-ply,SBD,M
Boys,89.81,9,Michael Torres,Weslaco,87.72,174.63,108.86,190.51,474,Single-ply,SBD,M
Boys,89.81,10,Eddie Garza,Rio Grande City,88.45,190.51,102.06,170.1,462.66,Single-ply,SBD,M
Boys,89.81,11,Mario Reyes,La Joya,84.01,185.97,108.86,154.22,449.06,Single-ply,SBD,M
Boys,89.81,12,Eleazar Garcia,La Joya Palmview,89.27,149.69,86.18,151.95,387.82,Single-ply,SBD,M
Boys,89.81,13,James Heath,Mission Sharyland,89.81,133.81,72.57,115.67,322.05,Single-ply,SBD,M
Boys,89.81,DQ,Jesus Reyna,Weslaco,84.46,190.51,,,,Single-ply,SBD,M
Boys,99.79,1,Ray Flores,Weslaco East,95.25,217.72,136.08,229.06,582.87,Single-ply,SBD,M
Boys,99.79,2,John Adame,Weslaco East,95.25,247.21,131.54,204.12,582.87,Single-ply,SBD,M
Boys,99.79,3,AJ Alvarez,Donna,94.62,231.33,136.08,213.19,580.6,Single-ply,SBD,M
Boys,99.79,4,Eli Escamame,Mission Sharyland,99.79,217.72,140.61,195.04,553.38,Single-ply,SBD,M
Boys,99.79,5,Jesús Torres,Weslaco,92.99,206.38,120.2,197.31,523.9,Single-ply,SBD,M
Boys,99.79,6,Eddie Favata,PSJA North,98.79,181.44,131.54,170.1,483.08,Single-ply,SBD,M
Boys,99.79,7,Adrian Flores,Mission Veterans Memorial,99.43,167.83,117.93,192.78,478.54,Single-ply,SBD,M
Boys,99.79,8,Matthew Cortez,Mission Veterans Memorial,95.98,192.78,97.52,185.97,476.27,Single-ply,SBD,M
Boys,99.79,9,Joseph Michki,Mission Sharyland,97.98,163.29,102.06,190.51,455.86,Single-ply,SBD,M
Boys,99.79,10,Fred Franco,Mission Veterans Memorial,96.07,163.29,102.06,181.44,446.79,Single-ply,SBD,M
Boys,99.79,11,Roger Benavidez,Rio Grande City,97.07,149.69,108.86,154.22,412.77,Single-ply,SBD,M
Boys,99.79,12,John V Alaniz,La Joya Palmview,97.98,142.88,117.93,140.61,401.43,Single-ply,SBD,M
Boys,99.79,13,Jose Castantino,Mercedes,91.35,129.27,102.06,142.88,374.21,Single-ply,SBD,M
Boys,99.79,14,Evan Pinon,La Joya Palmview,99.16,131.54,92.99,145.15,369.68,Single-ply,SBD,M
Boys,109.77,1,Jesus Morales #3,Weslaco East,102.24,290.3,170.1,235.87,696.26,Single-ply,SBD,M
Boys,109.77,2,Patrick Longoria,Weslaco,107.05,256.28,158.76,233.6,648.64,Single-ply,SBD,M
Boys,109.77,3,Kevin Trevino,PSJA North,107.68,249.48,158.76,231.33,639.57,Single-ply,SBD,M
Boys,109.77,4,Jose Juarez #5,Weslaco,106.59,226.8,138.35,219.99,585.13,Single-ply,SBD,M
Boys,109.77,5,Jonathan Banda,Weslaco East,109.77,199.58,97.52,204.12,501.22,Single-ply,SBD,M
Boys,109.77,6,Cesar Leal,Donna,100.79,188.24,124.74,183.7,496.68,Single-ply,SBD,M
Boys,109.77,7,Isaac Barrera,Mission,101.42,195.04,97.52,204.12,496.68,Single-ply,SBD,M
Boys,109.77,8,Miguel Guzmán,Mission,103.69,167.83,83.91,170.1,421.84,Single-ply,SBD,M
Boys,109.77,DQ,Robbie Garcia,Mercedes,108.05,219.99,,,,Single-ply,SBD,M
Boys,124.74,1,Jesus Esparza,Pharr Valley View,116.75,263.08,183.7,274.42,721.21,Single-ply,SBD,M
Boys,124.74,2,Keith Mora,Mission Sharyland,124.19,294.84,122.47,210.92,628.23,Single-ply,SBD,M
Boys,124.74,3,Rick Jinojosa,Mercedes,122.65,233.6,163.29,199.58,596.47,Single-ply,SBD,M
Boys,124.74,4,Raul de la Cruz,Mission,118.21,247.21,115.67,192.78,555.65,Single-ply,SBD,M
Boys,124.74,5,Robert Medina,Rio Grande City,116.62,192.78,106.59,183.7,483.08,Single-ply,SBD,M
Boys,124.74,6,Ruben Cisneros,Donna,117.75,199.58,102.06,181.44,483.08,Single-ply,SBD,M
Boys,124.74,7,Jaime Moreno,Donna,110.59,199.58,115.67,165.56,480.81,Single-ply,SBD,M
Boys,124.74,8,Julian Rosales,Rio Grande City,122.52,188.24,97.52,190.51,476.27,Single-ply,SBD,M
Boys,124.74,9,Jose Gomez,Mercedes,110.95,201.85,102.06,167.83,471.74,Single-ply,SBD,M
Boys,124.74,10,Javi Lara,PSJA North,115.39,181.44,124.74,161.03,467.2,Single-ply,SBD,M
Boys,124.74,11,Gabrian Vela,PSJA North,110.68,167.83,115.67,170.1,453.59,Single-ply,SBD,M
Boys,124.74,12,Ricardo Ramirez,Mission,111.58,172.37,102.06,172.37,446.79,Single-ply,SBD,M
Boys,124.74,DQ,Cesar Ramirez,Mercedes,116.85,183.7,,,,Single-ply,SBD,M
Boys,124.74,DQ,Ivan Villarreal,La Joya,117.75,102.06,,,,Single-ply,SBD,M
Boys,124.74+,1,George Garcia,Pharr Valley View,126.96,272.16,183.7,222.26,678.12,Single-ply,SBD,M
Boys,124.74+,2,Rene Tamez,Donna,134.26,240.4,147.42,231.33,619.15,Single-ply,SBD,M
Boys,124.74+,3,Homero Tuscano,Rio Grande City,145.42,260.82,136.08,215.46,612.35,Single-ply,SBD,M
Boys,124.74+,4,Randy Fernandez,PSJA North,133.17,240.4,140.61,210.92,591.94,Single-ply,SBD,M
Boys,124.74+,5,Roy Rendon,Mercedes,128.09,183.7,124.74,181.44,489.88,Single-ply,SBD,M
Boys,124.74+,6,Zeke Garza,La Joya,126.37,185.97,113.4,170.1,469.47,Single-ply,SBD,M
Boys,124.74+,7,Daniel Solis,La Joya,126.73,165.56,97.52,149.69,412.77,Single-ply,SBD,M
Boys,124.74+,8,Anselmo Rodriguez,Mission,149.05,165.56,86.18,136.08,387.82,Single-ply,SBD,M
