Place,Sex,Name,CyrillicName,BodyweightKg,Squat1Kg,Squat2Kg,Squat3Kg,Best3SquatKg,Squat4Kg,TotalKg,WeightClassKg,Event,Equipment,Tested,Deadlift1Kg,Deadlift2Kg,Deadlift3Kg,Best3DeadliftKg,Deadlift4Kg,Bench1Kg,Bench2Kg,Bench3Kg,Best3BenchKg,Bench4Kg,Division,Age,BirthDate
1,F,Alina Simendeeva,Алина Симендеева,50.3,70,-75,75,75,,75,52,S,Wraps,Yes,,,,,,,,,,,Amateur Open,24,1994-11-27
1,M,Aleksey Dubov,Алексей Дубов,89.6,-142.5,155,162.5,162.5,,162.5,90,S,Wraps,No,,,,,,,,,,,Pro Masters 55-59,56,1963-04-18
1,M,Yuriy Demyanchuk,Юрий Демьянчук,138.4,,,,,,280,140,D,Raw,No,250,280,-300,280,,,,,,,Pro Masters 40-44,41,1978-10-03
1,F,Alina Simendeeva,Алина Симендеева,50.3,,,,,,107.5,52,D,Raw,Yes,95,102.5,107.5,107.5,,,,,,,Amateur Open,24,1994-11-27
1,F,Olga Egorova,Ольга Егорова,58.5,,,,,,125,60,D,Raw,Yes,105,115,125,125,,,,,,,Amateur Masters 40-44,44,1975-03-14
1,F,Mariya Bateyshchikova,Мария Батейщикова,64.6,,,,,,110,67.5,D,Raw,Yes,90,100,110,110,,,,,,,Amateur Open,32,1987-03-04
1,M,Aleksandr Elistratov,Александр Елистратов,47.2,,,,,,70,52,D,Raw,Yes,60,65,70,70,,,,,,,Amateur Teen 14-15,15,2003-12-03
1,M,Sergey Chichkin,Сергей Чичкин,70.9,,,,,,205,75,D,Raw,Yes,180,205,-210,205,,,,,,,Amateur Open,27,1992-07-15
2,M,Sergey Khalilov,Сергей Халилов,74.8,,,,,,170,75,D,Raw,Yes,157.5,-170,170,170,,,,,,,Amateur Open,30,1989-01-25
1,M,Aleksandr Gubanov,Александр Губанов,80.2,,,,,,117.5,82.5,D,Raw,Yes,-110,110,117.5,117.5,,,,,,,Amateur Masters 65-69,68,1951-02-06
1,M,Andrey Gusev,Андрей Гусев,122.2,,,,,,255,125,D,Raw,Yes,225,250,255,255,,,,,,,Amateur Masters 45-49,46,1973-03-25
1,M,Dmitriy Nosanov,Дмитрий Носанов,131.6,,,,,,225,140,D,Raw,Yes,200,225,,225,,,,,,,Amateur Teen 18-19,18,2000-11-19
1,M,Aleksey Dubov,Алексей Дубов,89.6,,,,,,180,90,D,Raw,No,165,180,-187.5,180,,,,,,,Pro Masters 55-59,56,1963-04-18
1,M,Evgeniy Karyakin,Евгений Карякин,119.2,,,,,,315,125,B,Multi-ply,No,,,,,,275,300,315,315,,Pro Masters 40-44,40,1979-01-17
1,M,Yuriy Demyanchuk,Юрий Демьянчук,138.4,,,,,,270,140,B,Multi-ply,No,,,,,,270,-310,,270,,Pro Masters 40-44,41,1978-10-03
1,M,Sergey Chichkin,Сергей Чичкин,70.9,,,,,,190,75,B,Multi-ply,Yes,,,,,,170,190,-200,190,,Amateur Open,27,1992-07-15
DQ,M,Aleksandr Chadaev,Александр Чадаев,93,,,,,,,100,B,Multi-ply,Yes,,,,,,-230,-230,-230,,,Amateur Open,29,1989-11-18
1,F,Marina Cherneva,Марина Чернева,74.4,,,,,,102.5,75,B,Multi-ply,No,,,,,,100,102.5,,102.5,,Pro Masters 45-49,49,1970-09-27
1,M,Mikhail Smorodin,Михаил Смородин,94.5,,,,,,270,100,B,Multi-ply,No,,,,,,260,270,,270,,Pro Open,39,1980-07-13
1,F,Marina Cherneva,Марина Чернева,74.4,,,,,,82.5,75,B,Raw,No,,,,,,72.5,77.5,82.5,82.5,,Pro Masters 45-49,49,1970-09-27
1,M,Ilya Efanov,Илья Ефанов,65.3,,,,,,105,67.5,B,Raw,No,,,,,,-95,105,-110,105,,Pro Open,34,1985-01-12
1,M,Denis Ostrovskiy,Денис Островский,70.5,,,,,,97.5,75,B,Raw,No,,,,,,90,97.5,-107.5,97.5,,Pro Open,26,1993-07-03
1,M,Aleksey Goryachiy,Алексей Горячий,82.4,,,,,,140,82.5,B,Raw,No,,,,,,-140,140,-150,140,,Pro Open,25,1994-10-14
1,M,Anatoliy Kovalev,Анатолий Ковалев,80.8,,,,,,92.5,82.5,B,Raw,No,,,,,,87.5,-92.5,92.5,92.5,,Pro Masters 80+,83,1936-08-11
1,M,Maksim Shmyrov,Максим Шмыров,86.3,,,,,,140,90,B,Raw,No,,,,,,140,-145,-145,140,,Pro Open,30,1988-11-07
1,M,Mikhail Smorodin,Михаил Смородин,94.5,,,,,,205,100,B,Raw,No,,,,,,195,205,-210,205,,Pro Open,39,1980-07-13
1,M,Dmitriy Bazhutov,Дмитрий Бажутов,104.4,,,,,,195,110,B,Raw,No,,,,,,195,-205,-205,195,,Pro Open,25,1994-04-25
2,M,Denis Zheleznikov,Денис Железников,108.1,,,,,,185,110,B,Raw,No,,,,,,175,185,-195,185,,Pro Open,36,1983-08-30
1,M,Nikolay Buryashkin,Николай Буряшкин,98.5,,,,,,140,100,B,Raw,No,,,,,,140,-145,-145,140,,Pro Open,37,1982-03-14
1,F,Irina Kozhukhovskaya,Ирина Кожуховская,50.5,,,,,,55,52,B,Raw,Yes,,,,,,50,55,-57.5,55,,Amateur Open,33,1986-07-05
2,F,Lyudmila Panina,Людмила Панина,50.8,,,,,,50,52,B,Raw,Yes,,,,,,50,-52.5,-52.5,50,,Amateur Open,32,1987-06-24
1,F,Elena Efremova,Елена Ефремова,53.5,,,,,,47.5,56,B,Raw,Yes,,,,,,45,-47.5,47.5,47.5,,Amateur Open,32,1987-04-01
1,F,Olga Egorova,Ольга Егорова,58.5,,,,,,62.5,60,B,Raw,Yes,,,,,,60,62.5,-67.5,62.5,,Amateur Masters 40-44,44,1975-03-14
1,M,Ilya Sachkov,Илья Сачков,55.6,,,,,,87.5,56,B,Raw,Yes,,,,,,82.5,87.5,,87.5,,Amateur Teen 16-17,16,2002-11-04
1,M,Sergey Zubchenko,Сергей Зубченко,59.1,,,,,,57.5,60,B,Raw,Yes,,,,,,55,57.5,-60,57.5,,Amateur Teen 16-17,17,2002-09-22
1,M,Kirill Musifullin,Кирилл Мусифуллин,60.6,,,,,,90,67.5,B,Raw,Yes,,,,,,-90,-90,90,90,,Amateur Teen 18-19,18,2001-08-02
1,M,Vladimir Skripachev,Владимир Скрипачев,67,,,,,,127.5,67.5,B,Raw,Yes,,,,,,120,127.5,-132.5,127.5,,Amateur Open,25,1994-02-03
1,M,Aleksandr Gugnyakov,Александр Гугняков,71.3,,,,,,150,75,B,Raw,Yes,,,,,,140,147.5,150,150,,Amateur Open,45,1974-05-17
1,M,Ivan Esin,Иван Есин,70.8,,,,,,60,75,B,Raw,Yes,,,,,,55,60,,60,,Amateur Masters 80+,80,1938-12-25
1,M,Dmitriy Kurmanaev,Дмитрий Курманаев,79.8,,,,,,130,82.5,B,Raw,Yes,,,,,,-130,130,,130,,Amateur Open,34,1985-07-05
2,M,Andrey Knyazev,Андрей Князев,79.9,,,,,,130,82.5,B,Raw,Yes,,,,,,130,-137.5,-137.5,130,,Amateur Open,37,1982-03-10
1,M,Aleksandr Gubanov,Александр Губанов,80.2,,,,,,90,82.5,B,Raw,Yes,,,,,,85,87.5,90,90,,Amateur Masters 65-69,68,1951-02-06
1,M,Daniil Sundukov,Даниил Сундуков,87.3,,,,,,92.5,90,B,Raw,Yes,,,,,,85,90,92.5,92.5,,Amateur Teen 14-15,15,2004-01-23
2,M,Sergey Nenashev,Сергей Ненашев,89.7,,,,,,65,90,B,Raw,Yes,,,,,,60,65,-72.5,65,,Amateur Teen 14-15,15,2004-03-04
1,M,Evgeniy Vashurin,Евгений Вашурин,88.8,,,,,,145,90,B,Raw,Yes,,,,,,145,-155,-155,145,,Amateur Open,39,1980-03-03
2,M,Andrey Presnyakov,Андрей Пресняков,83.4,,,,,,135,90,B,Raw,Yes,,,,,,130,-135,135,135,,Amateur Open,32,1987-01-19
1,M,Ivan Zaykov,Иван Зайков,91.5,,,,,,45,100,B,Raw,Yes,,,,,,40,45,-50,45,,Amateur Teen 13,13,2006-10-19
1,M,Ivan Bobkin,Иван Бобкин,98.5,,,,,,165,100,B,Raw,Yes,,,,,,160,165,-170,165,,Amateur Juniors 20-23,23,1996-02-27
1,M,Ivan Bobkin,Иван Бобкин,98.5,,,,,,165,100,B,Raw,Yes,,,,,,160,165,-170,165,,Amateur Open,23,1996-02-27
DQ,M,Vladislav Efimenko,Владислав Ефименко,97,,,,,,,100,B,Raw,Yes,,,,,,-125,-130,-130,,,Amateur Masters 40-44,43,1976-01-19
1,M,Mikhail Mikhin,Михаил Михин,96,,,,,,145,100,B,Raw,Yes,,,,,,127.5,137.5,145,145,,Amateur Masters 50-54,50,1969-07-21
1,M,Igor Raysh,Игорь Райш,109.2,,,,,,140,110,B,Raw,Yes,,,,,,130,140,-147.5,140,,Amateur Open,36,1983-08-21
1,M,Vladimir Adamov,Владимир Адамов,114.9,,,,,,195,125,B,Raw,Yes,,,,,,190,195,-200,195,,Amateur Open,33,1986-04-25
2,M,Aleksey Bogdanov,Алексей Богданов,116.8,,,,,,155,125,B,Raw,Yes,,,,,,145,150,155,155,,Amateur Open,38,1981-07-25
1,M,Andrey Gusev,Андрей Гусев,122.2,,,,,,175,125,B,Raw,Yes,,,,,,162.5,175,-180,175,,Amateur Masters 45-49,46,1973-03-25
1,M,Dmitriy Nosanov,Дмитрий Носанов,131.6,,,,,,165,140,B,Raw,Yes,,,,,,157.5,165,-170,165,,Amateur Teen 18-19,18,2000-11-19
1,F,Tatyana Devyatkina,Татьяна Девяткина,55,70,72.5,75,75,,217.5,56,SBD,Wraps,Yes,92.5,95,97.5,97.5,,42.5,45,-47.5,45,,Amateur Open,37,1982-07-25
1,F,Valentina Yakimova,Валентина Якимова,65.3,75,80,85,85,,222.5,67.5,SBD,Wraps,Yes,85,90,95,95,,40,42.5,-45,42.5,,Amateur Masters 40-44,40,1979-05-08
1,M,Semen Nuykin,Семен Нуйкин,51.3,70,80,85,85,,230,52,SBD,Wraps,Yes,80,90,-100,90,,55,-62.5,-62.5,55,,Amateur Teen 14-15,15,2004-04-20
1,M,Maksim Alekseev,Максим Алексеев,71.5,100,105,115,115,,315,75,SBD,Wraps,Yes,110,120,130,130,,65,70,-75,70,,Amateur Teen 16-17,16,2003-01-18
2,M,Ilya Kasimov,Илья Касимов,71.6,80,85,95,95,,295,75,SBD,Wraps,Yes,110,120,125,125,,70,75,-80,75,,Amateur Teen 16-17,17,2002-07-30
1,M,Aleksey Sinelnikov,Алексей Синельников,79.1,110,120,125,125,,370,82.5,SBD,Wraps,Yes,130,140,150,150,,80,90,95,95,,Amateur Teen 18-19,18,2001-06-22
1,M,Daniil Sundukov,Даниил Сундуков,87.3,110,120,-122.5,120,,330,90,SBD,Wraps,Yes,110,120,122.5,122.5,,85,87.5,,87.5,,Amateur Teen 14-15,15,2004-01-23
1,M,Rafail Zaripov,Рафаиль Зарипов,89.3,115,125,132.5,132.5,,430,90,SBD,Wraps,Yes,135,150,157.5,157.5,,127.5,135,140,140,,Amateur Teen 18-19,18,2001-04-16
DQ,M,Mikhail Shcherbinin,Михаил Щербинин,89,-190,-190,-190,,,,90,SBD,Wraps,Yes,-210,,,,,-130,,,,,Amateur Open,24,1995-08-21
1,M,Vladimir Zaytsev,Владимир Зайцев,106.2,115,125,130,130,,427.5,110,SBD,Wraps,Yes,155,-165,170,170,,115,125,127.5,127.5,,Amateur Masters 65-69,69,1949-11-02
1,M,Aleksandr Shiryaev,Александр Ширяев,93.2,135,145,-150,145,,400,100,SBD,Multi-ply,Yes,145,160,170,170,,75,85,-92.5,85,,Amateur Teen 16-17,16,2003-01-02
DQ,M,Vladislav Averyanov,Владислав Аверьянов,96.8,200,215,225,225,,,100,SBD,Multi-ply,No,-215,-230,-240,,,172.5,182.5,187.5,187.5,,Pro Juniors 20-23,23,1996-01-25
1,M,Denis Teplov,Денис Теплов,108.6,220,240,260,260,,685,110,SBD,Multi-ply,No,240,260,-270,260,,-150,160,165,165,,Pro Open,25,1993-12-21
1,M,Aleksey Dubov,Алексей Дубов,89.6,-142.5,155,162.5,162.5,,432.5,90,SBD,Wraps,No,165,180,-187.5,180,,82.5,90,-92.5,90,,Pro Masters 55-59,56,1963-04-18
