Name,Age,Sex,Division,Event,Equipment,BodyweightKg,WeightClassKg,Squat1Kg,Squat2Kg,Squat3Kg,Best3SquatKg,Bench1Kg,Bench2Kg,Bench3Kg,Best3BenchKg,Deadlift1Kg,Deadlift2Kg,Deadlift3Kg,Best3DeadliftKg,TotalKg,Team,Place
Rachel Nutter,40,F,FM1,B,Multi-ply,131.59,90+,,,,,185,192.5,197.5,197.5,,,,,197.5,Elite Barbell,1
Jay Ragalie,34,M,MS,B,Multi-ply,139.48,140,,,,,-220,-230,,,,,,,,Elite Barbell,DQ
Blake Talip,19,M,MT3R,B,Raw,71.71,75,,,,,80,92.5,-100,92.5,,,,,92.5,Powercorps,1
Ryan Reichardt,19,M,MT3R,B,Raw,81.42,82.5,,,,,90,107.5,125,125,,,,,125,Powercorps,1
Corey Cavitt,18,M,MT3,B,Multi-ply,88.5,90,,,,,165,-172.5,-175,165,,,,,165,Powercorps,1
Austin Breunig,15,M,MT1R,B,Raw,61.92,67.5,,,,,72.5,80,-87.5,80,,,,,80,Powercorps,1
Jay Baltierra,15,M,MT1R,B,Raw,74.12,75,,,,,105,112.5,-117.5,112.5,,,,,112.5,NIP,1
Michael Rumple,71,M,MM7R,B,Raw,95.62,100,,,,,75,-80,-85,75,,,,,75,USA Achletic,1
Jim Rumple,65,M,MM6,B,Multi-ply,98.29,100,,,,,112.5,125,-140,125,,,,,125,USA Achletic,1
Anthony Demski,53,M,MM3,B,Multi-ply,80.92,82.5,,,,,100,110,-115,110,,,,,110,Powercorps,1
Shaheed Sshabazz,40,M,MM1,B,Multi-ply,101.51,110,,,,,-265,-265,,,,,,,,,DQ
David Harrison,43,M,MM1,B,Multi-ply,124.42,125,,,,,252.5,262.5,-272.5,262.5,,,,,262.5,P-Town Barbell,1
Scott Nutter,43,M,MM1,B,Multi-ply,178.58,140+,,,,,-252.5,-252.5,,,,,,,,Elite Barbell,DQ
Jaime Hernandez,35,M,MSR,B,Raw,66.9,67.5,,,,,117.5,127.5,-137.5,127.5,,,,,127.5,Powercorps,1
W.T. Franklin,33,M,MSR,B,Raw,135.4,140,,,,,212.5,-227.5,-227.5,212.5,,,,,212.5,Zenzen Barbell,1
Jake Prazak,34,M,MO,B,Multi-ply,107.09,110,,,,,377.5,-392.5,-392.5,377.5,,,,,377.5,NIP,1
Dwayne Warren,21,M,MO,B,Multi-ply,107.18,110,,,,,245,262.5,-272.5,262.5,,,,,262.5,P-Town Barbell,2
David Lewis,39,M,MO,B,Multi-ply,124.6,125,,,,,297.5,-320,-327.5,297.5,,,,,297.5,,1
Mike Kalsto,31,M,MO,B,Multi-ply,128.32,140,,,,,-150,-150,-150,,,,,,,P-Town Barbell,DQ
Robert Vick,37,M,MO,B,Multi-ply,175.59,140+,,,,,-392.5,-392.5,-392.5,,,,,,,,DQ
Uni Muniz,40,F,FM1R,SBD,Wraps,66.68,67.5,67.5,87.5,-110,87.5,42.5,47.5,50,50,82.5,90,102.5,102.5,240,Powercorps,1
Therese Janc,37,F,FOR,SBD,Wraps,72.3,75,-85,85,100,100,57.5,65,-77.5,65,127.5,137.5,142.5,142.5,307.5,Powercorps,1
Monica Augustine,33,F,FOR,SBD,Wraps,121.02,90+,-167.5,167.5,190,190,92.5,100,-102.5,100,170,190,-200,190,480,,1
Josh Lopez,15,M,MT1R,SBD,Wraps,73.21,75,145,155,-165,155,92.5,-97.5,97.5,97.5,152.5,170,-182.5,170,422.5,Powercorps,1
Quentin Septer,15,M,MT1R,SBD,Wraps,87.09,90,137.5,147.5,165,165,105,-115,-115,105,195,205,227.5,227.5,497.5,NIP,1
Les Bencze,54,M,MM3,SBD,Multi-ply,74.8,75,162.5,172.5,182.5,182.5,75,82.5,-87.5,82.5,130,145,157.5,157.5,422.5,Powercorps,1
Kelly Cavitt,47,M,MM2-AD,SBD,Multi-ply,109.68,110,280,295,-307.5,295,100,122.5,-135,122.5,242.5,257.5,-265,257.5,675,Powercorps,1
Tyson Kratz,22,M,MO,SBD,Multi-ply,89.22,90,265,-282.5,-282.5,265,-182.5,182.5,197.5,197.5,225,-250,-250,225,687.5,Twin City Barbell,1
Tony Chirico,40,M,MO,SBD,Multi-ply,109.32,110,345,-365,-367.5,345,200,212.5,227.5,227.5,257.5,272.5,290,290,862.5,Powercorps,1
Christian Mello,28,M,MO,SBD,Multi-ply,123.38,125,420,435,-455,435,275,-287.5,-287.5,275,320,340,-360,340,1050,Ludus Magnus,1
Adam Holmes,26,M,MO,SBD,Multi-ply,124.1,125,-295,295,330,330,210,-225,-227.5,210,257.5,275,285,285,825,Ludus Magnus,2
Josh Edwards #3,30,M,MO,SBD,Multi-ply,121.7,125,340,367.5,-380,367.5,-290,-290,-290,,-280,,,,,Carpenter,DQ
Matt Wenning,31,M,MO,SBD,Multi-ply,138.71,140,472.5,510,542.5,542.5,137.5,290,-350,290,227.5,327.5,-365,327.5,1160,Ludus Magnus *Best Lifter,1
Gregg Damminga,49,M,MO,SBD,Multi-ply,135.71,140,390,-410,-420,390,-242.5,-260,,,-300,,,,,Twin City Barbell,DQ
Kyle Nadrchal,28,M,MO-AD,SBD,Multi-ply,100,100,272.5,297.5,320,320,-207.5,207.5,-227.5,207.5,215,-232.5,-232.5,215,742.5,Big Iron,1
Nick Detman,30,M,MO-AD,SBD,Multi-ply,153,140+,-317.5,-317.5,,,-227.5,,,,-232.5,,,,,Powercorps,DQ
Phil Knepper,19,M,MT3R,SBD,Wraps,66.6,67.5,162.5,177.5,-182.5,177.5,95,105,110,110,167.5,182.5,190,190,477.5,Carpenter,1
Jordan Lentz,19,M,MT3R,SBD,Wraps,73.4,75,187.5,202.5,210,210,125,137.5,-140,137.5,195,215,227.5,227.5,575,NIP,1
Tom Kallas,18,M,MT3R,SBD,Wraps,72,75,217.5,-232.5,-237.5,217.5,102.5,115,-125,115,212.5,-227.5,227.5,227.5,560,Zenzen Barbell,2
Spencer Behne,19,M,MT3R,SBD,Wraps,79.8,82.5,190,205,217.5,217.5,112.5,120,-130,120,217.5,237.5,-250,237.5,575,,1
Tyler Scott,18,M,MT3R,SBD,Wraps,96.1,100,170,187.5,-202.5,187.5,122.5,140,147.5,147.5,205,230,242.5,242.5,577.5,Powercorps,1
Chris Hickson,19,M,MT3R,SBD,Wraps,108.8,110,265,-287.5,287.5,287.5,132.5,-145,,132.5,320,-365,-365,320,740,Frantz,1
Daniel Rega,17,M,MT2R-AD,SBD,Wraps,66.8,67.5,90,120,-155,120,85,95,100,100,142.5,170,182.5,182.5,402.5,Powercorps,1
DJ Nelson,17,M,MT2R,SBD,Wraps,94,100,170,177.5,-187.5,177.5,110,120,125,125,192.5,202.5,210,210,512.5,Powercorps,1
John Walker #3,15,M,MT1R,SBD,Wraps,59.4,60,97.5,102.5,105,105,-97.5,100,105,105,110,125,137.5,137.5,347.5,,1
Austin Breunig,15,M,MT1R,SBD,Wraps,61.9,67.5,130,142.5,147.5,147.5,72.5,77.5,82.5,82.5,122.5,135,140,140,370,Powercorps,1
Sam Wilson,15,M,MT1R,SBD,Wraps,61.4,67.5,95,100,102.5,102.5,67.5,70,-77.5,70,102.5,107.5,112.5,112.5,285,Powercorps,2
Sam Fuentes,14,M,MT1R,SBD,Wraps,86.8,90,120,130,-142.5,130,85,92.5,97.5,97.5,125,137.5,-147.5,137.5,365,Powercorps,1
Devin Keenan,13,M,MT1R,SBD,Wraps,86.5,90,90,97.5,105,105,70,-75,-77.5,70,125,-137.5,137.5,137.5,312.5,Powercorps,2
Anthony Hernandez,20,M,MJR-AD,SBD,Wraps,97.5,100,237.5,247.5,260,260,130,140,145,145,237.5,257.5,272.5,272.5,677.5,Rockford Powerlifting,1
Josh Nilsen,20,M,MJR,SBD,Wraps,74.7,75,177.5,-197.5,-197.5,177.5,120,137.5,-145,137.5,182.5,207.5,-227.5,207.5,522.5,Frantz,1
Bobby Hickson,21,M,MJR,SBD,Wraps,81.8,82.5,132.5,155,-165,155,65,70,,70,157.5,177.5,-192.5,177.5,402.5,Frantz,1
Dave Nelson,22,M,MJR,SBD,Wraps,89.8,90,255,-262.5,262.5,262.5,160,170,-177.5,170,257.5,272.5,-285,272.5,705,NIP,1
Josh Lentz,23,M,MJR,SBD,Wraps,88.1,90,232.5,252.5,-262.5,252.5,175,185,-192.5,185,227.5,-245,-245,227.5,665,NIP,2
Kyle Thompson #3,23,M,MJR,SBD,Wraps,99.4,100,210,232.5,237.5,237.5,165,182.5,187.5,187.5,235,250,260,260,685,NIP,1
Anthony Hernandez,20,M,MJR,SBD,Wraps,97.5,100,237.5,247.5,260,260,130,140,145,145,237.5,257.5,272.5,272.5,677.5,Rockford Powerlifting,2
Jake Monroe,23,M,MJR,SBD,Wraps,90.6,100,217.5,230,-235,230,120,130,-137.5,130,247.5,-272.5,272.5,272.5,632.5,,3
Michael Mago,23,M,MJR,SBD,Wraps,91.3,100,215,232.5,-235,232.5,160,167.5,182.5,182.5,190,207.5,-220,207.5,622.5,,4
Dom LaFace,21,M,MJR,SBD,Wraps,97.7,100,195,210,-215,210,115,130,135,135,190,205,227.5,227.5,572.5,Carpenter,5
Eric Lilliebridge,21,M,MJR,SBD,Wraps,118.1,125,330,347.5,-370,347.5,200,215,-232.5,215,310,330,352.5,352.5,915,Frantz,1
Matthew Chamberlin,23,M,MJR,SBD,Wraps,123.7,125,227.5,242.5,247.5,247.5,142.5,155,160,160,230,247.5,257.5,257.5,665,,2
Thomas Drake,54,M,MM3R-AD,SBD,Wraps,135.1,140,220,235,242.5,242.5,170,-180,-180,170,240,260,-267.5,260,672.5,Strength Beyond,1
Mike Wagner,45,M,MM2R-AD,SBD,Wraps,108.4,110,230,242.5,257.5,257.5,137.5,152.5,165,165,230,247.5,257.5,257.5,680,Powercorps,1
Michael Supilowski,49,M,MM2R,SBD,Wraps,99.5,100,232.5,240,247.5,247.5,152.5,160,165,165,282.5,297.5,-302.5,297.5,710,,1
Roger Hennigar,47,M,MM2R,SBD,Wraps,97,100,-220,220,227.5,227.5,142.5,155,-160,155,215,230,240,240,622.5,NIP,2
Martin Day,40,M,MM1R-AD,SBD,Wraps,123.9,125,180,187.5,197.5,197.5,115,122.5,127.5,127.5,215,-240,-240,215,540,,1
Mark Willing,43,M,MM1R,SBD,Wraps,104.7,110,195,225,240,240,155,170,-180,170,235,-260,260,260,670,,1
Francisco Lagunas,36,M,MSR-AD,SBD,Wraps,82.2,82.5,215,-232.5,245,245,165,177.5,-182.5,177.5,210,230,245,245,667.5,Rockford Powerlifting,1
Jason Schmid,33,M,MSR-AD,SBD,Wraps,98.4,100,220,227.5,-230,227.5,125,130,-135,130,245,255,-260,255,612.5,,1
Ernie Lilliebridge,39,M,MSR,SBD,Wraps,133.4,140,310,325,-335,325,210,227.5,,227.5,,,227.5,227.5,780,Frantz,1
Joshua Anderson,33,M,MSR,SBD,Wraps,133.7,140,-267.5,267.5,-290,267.5,160,,,160,250,272.5,,272.5,700,Rockford Powerlifting,2
Theo Plothe,36,M,MSR,SBD,Wraps,128.9,140,112.5,-120,-142.5,112.5,67.5,75,-82.5,75,-157.5,170,182.5,182.5,370,Zenzen Barbell,3
AJ Knepper,27,M,MOR-AD,SBD,Wraps,74.2,75,170,182.5,192.5,192.5,97.5,102.5,107.5,107.5,200,215,227.5,227.5,527.5,Carpenter,1
Adam Shalley,26,M,MOR-AD,SBD,Wraps,99.8,100,190,-215,215,215,130,145,160,160,210,227.5,-245,227.5,602.5,,1
Dominic Morais,25,M,MOR-AD,SBD,Wraps,98.8,100,165,180,-182.5,180,130,142.5,-150,142.5,175,190,202.5,202.5,525,,2
Matt Vinopal,35,M,MOR-AD,SBD,Wraps,103.5,110,237.5,255,272.5,272.5,177.5,187.5,192.5,192.5,275,287.5,-297.5,287.5,752.5,Wisconsin Barbell,1
Matthew Swanson,32,M,MOR-AD,SBD,Wraps,105.8,110,232.5,250,260,260,135,,,135,235,252.5,262.5,262.5,657.5,Zenzen Barbell,2
Matthew Lynch #4,29,M,MOR-AD,SBD,Wraps,107.9,110,180,-192.5,-192.5,180,150,-167.5,-167.5,150,185,,,185,515,Rockford Powerlifting,3
William Barnes,33,M,MOR-AD,SBD,Wraps,182.4,140+,217.5,237.5,-255,237.5,160,170,-182.5,170,-250,257.5,-275,257.5,665,Hoffman Barbell,1
Tom Kallas,18,M,MOR,SBD,Wraps,72,75,217.5,-232.5,-237.5,217.5,102.5,115,-125,115,212.5,-227.5,227.5,227.5,560,Zenzen Barbell,1
Josh Nilsen,20,M,MOR,SBD,Wraps,74.7,75,177.5,-197.5,-197.5,177.5,120,137.5,-145,137.5,182.5,207.5,-227.5,207.5,522.5,Frantz,2
Nick Skridla,32,M,MOR,SBD,Wraps,73.7,75,107.5,147.5,,147.5,102.5,,,102.5,205,-230,-230,205,455,Rockford Powerlifting,3
Luke Kutsch,23,M,MOR,SBD,Wraps,81.3,82.5,170,187.5,200,200,92.5,97.5,102.5,102.5,195,212.5,227.5,227.5,530,,1
Kyle Messerly,25,M,MOR,SBD,Wraps,89.1,90,287.5,-320,320,320,150,157.5,-162.5,157.5,-265,265,277.5,277.5,755,,1
Michael Supilowski,49,M,MOR,SBD,Wraps,99.5,100,232.5,240,247.5,247.5,152.5,160,165,165,282.5,297.5,-302.5,297.5,710,,1
Chris Hickson,19,M,MOR,SBD,Wraps,108.8,110,265,-287.5,287.5,287.5,132.5,-145,,132.5,320,-365,-365,320,740,Frantz,1
Alex Camacho,24,M,MOR,SBD,Wraps,107.8,110,235,255,275,275,157.5,170,-177.5,170,240,262.5,272.5,272.5,717.5,Powercorps,2
Tim Filus,29,M,MOR,SBD,Wraps,107.2,110,227.5,250,-267.5,250,160,170,-182.5,170,227.5,255,265,265,685,Powercorps,3
Cory Newland,27,M,MOR,SBD,Wraps,105.2,110,212.5,222.5,227.5,227.5,125,137.5,142.5,142.5,227.5,240,250,250,620,,4
Eric Lilliebridge,21,M,MOR,SBD,Wraps,118.1,125,330,347.5,-370,347.5,200,215,-232.5,215,310,330,352.5,352.5,915,Frantz,1
Jon Jursich,24,M,MOR,SBD,Wraps,123.9,125,230,245,-255,245,137.5,160,-170,160,230,245,-255,245,650,Zenzen Barbell,2
Jesse Brill,30,M,MOR,SBD,Wraps,113.5,125,215,225,-237.5,225,167.5,175,-187.5,175,205,227.5,240,240,640,Hoffman Barbell,3
Robert Holliday,24,M,MOR,SBD,Wraps,113.4,125,215,232.5,,232.5,112.5,125,135,135,210,227.5,235,235,602.5,,4
Ernie Lilliebridge,39,M,MOR,SBD,Wraps,133.4,140,310,325,-335,325,210,227.5,,227.5,,,227.5,227.5,780,Frantz,1
Joshua Anderson,33,M,MOR,SBD,Wraps,133.7,140,-267.5,267.5,-290,267.5,160,,,160,250,272.5,,272.5,700,Rockford Powerlifting,2
Wiley Rung,29,M,MOR,SBD,Wraps,132.5,140,220,-227.5,227.5,227.5,-167.5,175,182.5,182.5,220,230,245,245,655,Powercorps,3
