Division,WeightClassKg,Place,Name,Team,BodyweightKg,Best3SquatKg,Best3BenchKg,Best3DeadliftKg,TotalKg,Equipment,Event,Sex,BirthDate
Boys,51.71,1,Treyvon Barrett,Cedar Hill,51.62,142.88,83.91,145.15,371.95,Single-ply,SBD,M,
Boys,51.71,2,George Isanda,Keller Fossil Ridge,51.35,129.27,83.91,136.08,349.27,Single-ply,SBD,M,
Boys,51.71,3,Elijah Simential,Hurst Bell,51.71,122.47,47.63,147.42,317.51,Single-ply,SBD,M,
Boys,51.71,4,Nicolas Castro,Royse City,50.8,90.72,74.84,133.81,299.37,Single-ply,SBD,M,
Boys,51.71,5,Gage Woodring,Millsap,46.18,97.52,52.16,102.06,251.74,Single-ply,SBD,M,
Boys,55.79,1,Kj Mitchell,Keller Fossil Ridge,53.43,149.69,83.91,145.15,378.75,Single-ply,SBD,M,
Boys,55.79,2,DaeeQuan Johnson,Keller Fossil Ridge,52.34,151.95,70.31,154.22,376.48,Single-ply,SBD,M,
Boys,55.79,3,Reece Gooding,Abilene Wylie,55.52,142.88,90.72,142.88,376.48,Single-ply,SBD,M,
Boys,55.79,4,Destin Warr,Callisburg,53.43,140.61,79.38,154.22,374.21,Single-ply,SBD,M,
Boys,55.79,5,Jackson Gowins,Keller Timber Creek,52.62,145.15,72.57,136.08,353.8,Single-ply,SBD,M,
Boys,55.79,6,Braiden Buckley,Hurst Bell,55.34,133.81,68.04,124.74,326.59,Single-ply,SBD,M,
Boys,55.79,7,Byron Kimani,Keller Fossil Ridge,55.79,120.2,54.43,140.61,315.25,Single-ply,SBD,M,
Boys,55.79,DQ,Ricky Perez,Fort Worth Diamond Hill-Jarvis,55.79,,,,,Single-ply,SBD,M,
Boys,55.79,DQ,Chris Riggio,Keller Central,54.98,,,,,Single-ply,SBD,M,
Boys,59.87,1,Hunter Burton,Millsap,58.6,192.78,108.86,156.49,458.13,Single-ply,SBD,M,
Boys,59.87,2,Braylon Riggs,Cedar Hill,59.33,161.03,92.99,181.44,435.45,Single-ply,SBD,M,
Boys,59.87,3,Antwan Reeves,Cedar Hill,59.87,174.63,68.04,154.22,396.89,Single-ply,SBD,M,
Boys,59.87,4,Andrew Trinh,Keller Fossil Ridge,58.79,151.95,68.04,156.49,376.48,Single-ply,SBD,M,
Boys,59.87,5,Michael Ramirez,Lake Worth,59.15,136.08,72.57,158.76,367.41,Single-ply,SBD,M,
Boys,59.87,6,Suede Wanamaker,Callisburg,57.79,102.06,58.97,115.67,276.69,Single-ply,SBD,M,
Boys,59.87,DQ,Dj Fogleman,Whitewright,59.87,,,,,Single-ply,SBD,M,
Boys,67.13,1,Seth Mabry,Keller Central,66.41,172.37,127.01,204.12,503.49,Single-ply,SBD,M,
Boys,67.13,2,Kasey Nguyen,Carrollton Creekview,67.04,190.51,104.33,190.51,485.34,Single-ply,SBD,M,
Boys,67.13,3,Arius Burton,Royse City,67.04,183.7,97.52,204.12,485.34,Single-ply,SBD,M,
Boys,67.13,4,Romy Galdamez,Hurst Bell,66.5,165.56,86.18,163.29,415.04,Single-ply,SBD,M,
Boys,67.13,5,Andrew Mast,Carrollton Creekview,61.87,145.15,95.25,156.49,396.89,Single-ply,SBD,M,
Boys,67.13,6,Grantham Jones,Keller Central,65.86,149.69,90.72,142.88,383.29,Single-ply,SBD,M,
Boys,67.13,7,Clayton Moore,Callisburg,65.05,142.88,74.84,154.22,371.95,Single-ply,SBD,M,
Boys,67.13,8,Jaden O'Connor,Keller Central,66.5,113.4,72.57,161.03,347,Single-ply,SBD,M,
Boys,67.13,DQ,Ramon Irving,Everman,67.13,,,,,Single-ply,SBD,M,
Boys,67.13,DQ,Carter Woodward,Keller,67.13,,,,,Single-ply,SBD,M,
Boys,67.13,DQ,Braydon Manners,Keller Central,67.13,,,,,Single-ply,SBD,M,
Boys,67.13,DQ,Brice Dennis,Royse City,65.32,181.44,104.33,,,Single-ply,SBD,M,
Boys,74.84,1,Cameron Robbins,Keller Central,74.66,226.8,117.93,224.53,569.26,Single-ply,SBD,M,
Boys,74.84,2,Sean Parnell,Fort Worth Paschal,73.12,206.38,117.93,204.12,528.44,Single-ply,SBD,M,
Boys,74.84,3,Tyler Smith,Lucas Lovejoy,74.3,208.65,115.67,199.58,523.9,Single-ply,SBD,M,
Boys,74.84,4,Davonte Biscoe,Everman,72.57,204.12,113.4,204.12,521.63,Single-ply,SBD,M,
Boys,74.84,5,Jesus Garcia,Lake Worth,74.75,188.24,124.74,204.12,517.1,Single-ply,SBD,M,
Boys,74.84,6,Caulan Jackson,Crowley,74.66,172.37,131.54,195.04,498.95,Single-ply,SBD,M,
Boys,74.84,7,Brett Long,Van Alstyne,73.03,199.58,102.06,190.51,492.15,Single-ply,SBD,M,
Boys,74.84,8,Benecio Swann,Keller Central,74.66,190.51,104.33,192.78,487.61,Single-ply,SBD,M,
Boys,74.84,9,Jack Estill,Keller Central,74.84,181.44,117.93,183.7,483.08,Single-ply,SBD,M,
Boys,74.84,10,Basey Mitchell,Millsap,68.4,195.04,95.25,183.7,474,Single-ply,SBD,M,
Boys,74.84,11,Marvin Reinoshek,Keller Fossil Ridge,69.49,176.9,102.06,188.24,467.2,Single-ply,SBD,M,
Boys,74.84,12,Kyser Cannon,Cedar Hill,73.21,195.04,102.06,165.56,462.66,Single-ply,SBD,M,
Boys,74.84,13,Noah Beach,Abilene Wylie,67.95,172.37,115.67,165.56,453.59,Single-ply,SBD,M,
Boys,74.84,14,Henry Robinson,Argyle,72.3,174.63,86.18,190.51,451.32,Single-ply,SBD,M,
Boys,74.84,15,Dylan Copeland,Keller Central,74.84,165.56,117.93,145.15,428.64,Single-ply,SBD,M,
Boys,74.84,16,Daniel Scherer,Keller Central,74.75,172.37,65.77,172.37,410.5,Single-ply,SBD,M,
Boys,74.84,17,Shelby Price,Callisburg,71.94,136.08,95.25,163.29,394.63,Single-ply,SBD,M,
Boys,74.84,18,Justin Huynh,Keller Central,70.49,133.81,81.65,163.29,378.75,Single-ply,SBD,M,
Boys,74.84,DQ,Kaden Bess,Keller Timber Creek,74.84,,,,,Single-ply,SBD,M,
Boys,74.84,DQ,Jackson Taylor,Keller,74.84,,,,,Single-ply,SBD,M,
Boys,74.84,DQ,Ethan Starr,Keller,73.39,136.08,,,,Single-ply,SBD,M,
Boys,82.1,1,Colton David,Keller Central,81.74,272.16,136.08,249.48,657.71,Single-ply,SBD,M,
Boys,82.1,2,Ryan Robinson,Cedar Hill,79.02,240.4,113.4,224.53,578.33,Single-ply,SBD,M,
Boys,82.1,3,Seth Baucum,Callisburg,81.74,217.72,122.47,238.14,578.33,Single-ply,SBD,M,
Boys,82.1,4,Blake Slaughter,Lucas Lovejoy,80.83,222.26,140.61,192.78,555.65,Single-ply,SBD,M,
Boys,82.1,5,Jake Taylor,Van Alstyne,82.01,210.92,117.93,206.38,535.24,Single-ply,SBD,M,
Boys,82.1,6,Carter Shell,Keller Timber Creek,79.83,226.8,131.54,174.63,532.97,Single-ply,SBD,M,
Boys,82.1,7,Josh Compton,Keller Timber Creek,78.11,208.65,136.08,185.97,530.7,Single-ply,SBD,M,
Boys,82.1,8,Caleb Robb,Royse City,80.74,204.12,124.74,192.78,521.63,Single-ply,SBD,M,
Boys,82.1,9,Jacob Miller,Krum,79.38,183.7,122.47,201.85,508.02,Single-ply,SBD,M,
Boys,82.1,10,Mark Castle,Argyle,78.38,204.12,90.72,210.92,505.76,Single-ply,SBD,M,
Boys,82.1,11,Skinner Miles,Keller Central,81.28,213.19,104.33,181.44,498.95,Single-ply,SBD,M,
Boys,82.1,12,Auston McBroom,Millsap,78.38,190.51,104.33,179.17,474,Single-ply,SBD,M,
Boys,82.1,13,Daniel Voyles,Keller,78.29,174.63,106.59,188.24,469.47,Single-ply,SBD,M,
Boys,82.1,14,Rowdy Jeffreys,Callisburg,76.66,106.59,65.77,127.01,299.37,Single-ply,SBD,M,
Boys,82.1,DQ,Kamaje Nelson,Cedar Hill,82.01,222.26,104.33,,,Single-ply,SBD,M,
Boys,82.1,DQ,Demari Ward,Cedar Hill,80.1,208.65,108.86,,,Single-ply,SBD,M,
Boys,89.81,1,Shane Davis,Whitewright,89.81,226.8,158.76,192.78,578.33,Single-ply,SBD,M,
Boys,89.81,2,Kobe Floyd,Cedar Hill,85,235.87,117.93,213.19,566.99,Single-ply,SBD,M,
Boys,89.81,3,Jonathan Synoground,Lake Dallas,89.45,219.99,142.88,204.12,566.99,Single-ply,SBD,M,
Boys,89.81,4,Alex Kateba,Keller Fossil Ridge,89.81,195.04,104.33,226.8,526.17,Single-ply,SBD,M,
Boys,89.81,5,John Vawar,Keller Fossil Ridge,83.46,204.12,113.4,192.78,510.29,Single-ply,SBD,M,
Boys,89.81,6,Aldo Calvillo,Millsap,89.18,226.8,97.52,181.44,505.76,Single-ply,SBD,M,
Boys,89.81,7,Jordan Ederson,Keller Fossil Ridge,89.09,181.44,102.06,215.46,498.95,Single-ply,SBD,M,
Boys,89.81,8,Dillon Oliver,Keller,89.45,158.76,74.84,147.42,381.02,Single-ply,SBD,M,
Boys,89.81,9,Luke Short,Petrolia,89.45,156.49,95.25,124.74,376.48,Single-ply,SBD,M,
Boys,89.81,DQ,Aaron Dam,Hurst Bell,89.81,,,,,Single-ply,SBD,M,
Boys,89.81,DQ,Sam Maddux,Keller Fossil Ridge,89.81,185.97,136.08,,,Single-ply,SBD,M,
Boys,89.81,DQ,Cj Garnett,Keller Central,89.81,,,,,Single-ply,SBD,M,
Boys,89.81,DQ,Dewayne Bradley,Crowley,89.18,,,,,Single-ply,SBD,M,
Boys,99.79,1,Austin Korbe,Keller Central,99.79,235.87,142.88,222.26,601.01,Single-ply,SBD,M,
Boys,99.79,2,Sean Smith,Keller Fossil Ridge,97.89,229.06,138.35,215.46,582.87,Single-ply,SBD,M,
Boys,99.79,3,Tyler Balsarik,Keller Central,99.34,226.8,140.61,206.38,573.79,Single-ply,SBD,M,
Boys,99.79,4,Dailyn Fuller,Cedar Hill,90.99,219.99,142.88,204.12,566.99,Single-ply,SBD,M,
Boys,99.79,5,Seth Burnette,Keller Timber Creek,90.17,206.38,154.22,204.12,564.72,Single-ply,SBD,M,
Boys,99.79,6,Tristan Stokes,Crowley,94.62,226.8,127.01,204.12,557.92,Single-ply,SBD,M,
Boys,99.79,7,Jeremiah Armstrong,Northwest Nelson,96.16,213.19,127.01,213.19,553.38,Single-ply,SBD,M,
Boys,99.79,8,Austin Sotelo,Tioga,98.16,233.6,113.4,183.7,530.7,Single-ply,SBD,M,
Boys,99.79,9,Nick Loya,Van Alstyne,93.8,165.56,102.06,158.76,426.38,Single-ply,SBD,M,
Boys,99.79,10,Zane Sun,Van Alstyne,95.07,158.76,108.86,145.15,412.77,Single-ply,SBD,M,
Boys,99.79,DQ,Darius Graham,Keller Central,99.79,,,,,Single-ply,SBD,M,
Boys,99.79,DQ,Jacob Weir,Callisburg,94.71,167.83,104.33,,,Single-ply,SBD,M,
Boys,99.79,DQ,Ian Bradley,Cedar Hill,94.17,254.01,127.01,,,Single-ply,SBD,M,
Boys,109.77,1,JT Sleeper,Keller Central,108.5,263.08,161.03,215.46,639.57,Single-ply,SBD,M,
Boys,109.77,2,Matthew Aribasala,Cedar Hill,107.32,247.21,147.42,238.14,632.76,Single-ply,SBD,M,
Boys,109.77,3,Braden Tittle,Royse City,108.5,226.8,124.74,226.8,578.33,Single-ply,SBD,M,
Boys,109.77,4,Muhammed Al-Sayeed,Hurst Bell,107.05,229.06,117.93,215.46,562.45,Single-ply,SBD,M,
Boys,109.77,5,Connor Murdock,Krum,103.33,208.65,131.54,208.65,548.85,Single-ply,SBD,M,
Boys,109.77,6,Austin Criswell,Argyle,107.59,226.8,102.06,210.92,539.77,Single-ply,SBD,M,
Boys,109.77,7,Blake Boren,Callisburg,101.79,192.78,124.74,204.12,521.63,Single-ply,SBD,M,
Boys,109.77,8,Grayson Parson,Keller Central,108.77,158.76,120.2,158.76,437.72,Single-ply,SBD,M,
Boys,109.77,DQ,Camden Boyd,Keller,109.77,,,,,Single-ply,SBD,M,
Boys,124.74,1,Brandon Tran,Hurst Bell,122.29,306.17,147.42,258.55,712.14,Single-ply,SBD,M,
Boys,124.74,2,John Hester,Keller Timber Creek,119.84,294.84,181.44,208.65,684.92,Single-ply,SBD,M,
Boys,124.74,3,Biola Oyelade,Mansfield Summit,123.01,265.35,142.88,226.8,635.03,Single-ply,SBD,M,
Boys,124.74,4,Caden Bogan,Northwest Nelson,112.85,204.12,120.2,208.65,532.97,Single-ply,SBD,M,
Boys,124.74,5,Brady Smith,Keller Central,121.65,183.7,102.06,174.63,460.4,Single-ply,SBD,M,
Boys,124.74,DQ,Mustafa Abdelhadi,Keller Central,124.74,,,,,Single-ply,SBD,M,
Boys,124.74,DQ,Parker McElwee,Keller,124.74,,,,,Single-ply,SBD,M,
Boys,124.74,DQ,Austin Rusk,Argyle,119.2,213.19,122.47,,,Single-ply,SBD,M,
Boys,124.74+,1,Brian Jobes,Lucas Lovejoy,143.06,274.42,176.9,215.46,666.78,Single-ply,SBD,M,
Boys,124.74+,2,Tadd McGaughy,Northwest Nelson,134.26,222.26,129.27,263.08,614.62,Single-ply,SBD,M,
Boys,124.74+,3,Ronnie Sears,Lake Worth,130.63,251.74,140.61,215.46,607.81,Single-ply,SBD,M,
Boys,124.74+,4,Femi Sakiri,Northwest Nelson,127.82,235.87,133.81,213.19,582.87,Single-ply,SBD,M,
Boys,124.74+,5,Josh Hicks,Argyle,143.52,238.14,136.08,199.58,573.79,Single-ply,SBD,M,
Boys,124.74+,6,Sam Tomoloju,Hurst Bell,132,240.4,111.13,201.85,553.38,Single-ply,SBD,M,
Boys,124.74+,7,Marc Anthony Gonzales,Whitewright,127.82,206.38,104.33,188.24,498.95,Single-ply,SBD,M,
Boys,124.74+,8,Evan Mashrouteh,Argyle,128.09,127.01,83.91,136.08,347,Single-ply,SBD,M,
Boys,124.74+,DQ,David Johnson,Princeton,136.08,,,,,Single-ply,SBD,M,
Boys,124.74+,DQ,Gabe Jameson,Krum,131.27,188.24,129.27,,,Single-ply,SBD,M,
Boys,124.74+,DQ,Wes Sanders,Lake Worth,150.23,251.74,142.88,,,Single-ply,SBD,M,
Boys,124.74+,DQ,Brett Briscoe,Petrolia,149.23,249.48,,,,Single-ply,SBD,M,
Boys,124.74+,DQ,Vontrez Jackson,Crowley,151.68,226.8,113.4,,,Single-ply,SBD,M,
