Division,WeightClassKg,Place,Name,Team,BodyweightKg,Best3SquatKg,Best3BenchKg,Best3DeadliftKg,TotalKg,Equipment,Event,Sex,BirthDate
Boys,55.79,1,Brian Muniz,Georgetown East View,52.25,63.5,31.75,79.38,174.63,Single-ply,SBD,M,
Boys,55.79,DQ,Pedro Climaco,Georgetown East View,53.89,124.74,81.65,,,Single-ply,SBD,M,
Boys,55.79,DQ,Axel Alnajdawi,Pflugerville Weiss,55.07,,,,,Single-ply,SBD,M,
Boys,59.87,1,Calel Henry,Pflugerville Weiss,57.7,124.74,68.04,167.83,360.61,Single-ply,SBD,M,
Boys,67.13,1,Tyler Laswon,Georgetown,60.6,131.54,81.65,165.56,378.75,Single-ply,SBD,M,
Boys,67.13,2,Breckin Earley,Pflugerville Hendrickson,66.95,124.74,79.38,133.81,337.93,Single-ply,SBD,M,
Boys,67.13,3,Jackson Coe,Georgetown East View,62.51,122.47,88.45,120.2,331.12,Single-ply,SBD,M,
Boys,67.13,4,Cursten Kennedy,Pflugerville Weiss,66.13,124.74,61.23,145.15,331.12,Single-ply,SBD,M,
Boys,67.13,5,Tyler Deanda,Georgetown,65.05,106.59,58.97,111.13,276.69,Single-ply,SBD,M,
Boys,74.84,1,Devin Owens,Killeen Shoemaker,74.84,213.19,120.2,244.94,578.33,Single-ply,SBD,M,
Boys,74.84,2,Aiden Aldaco,Georgetown,73.12,179.17,99.79,181.44,460.4,Single-ply,SBD,M,
Boys,74.84,3,Jerry Barron,Georgetown East View,70.03,163.29,120.2,167.83,451.32,Single-ply,SBD,M,
Boys,74.84,4,Seth Maughs,Georgetown,72.85,149.69,79.38,158.76,387.82,Single-ply,SBD,M,
Boys,74.84,5,Michael Akalusi,Pflugerville Weiss,74.3,124.74,72.57,170.1,367.41,Single-ply,SBD,M,
Boys,74.84,6,Josh Tisdel,Hutto,71.85,102.06,90.72,147.42,340.19,Single-ply,SBD,M,
Boys,74.84,7,Tyler Fithian,Georgetown,70.58,120.2,70.31,136.08,326.59,Single-ply,SBD,M,
Boys,74.84,8,Saul De Larosa,Georgetown,69.13,102.06,79.38,140.61,322.05,Single-ply,SBD,M,
Boys,74.84,9,Michael Stepp,Pflugerville Weiss,73.21,108.86,68.04,142.88,319.78,Single-ply,SBD,M,
Boys,74.84,10,Tyson Gray,Pflugerville Weiss,71.49,104.33,72.57,122.47,299.37,Single-ply,SBD,M,
Boys,74.84,11,Joseph Dovey,Georgetown,68.86,95.25,54.43,111.13,260.82,Single-ply,SBD,M,
Boys,82.1,1,Roman Anderson,Pflugerville Hendrickson,81.56,233.6,161.03,215.46,610.08,Single-ply,SBD,M,
Boys,82.1,2,Isaiah Quentin Jackson,Georgetown East View,80.01,219.99,145.15,233.6,598.74,Single-ply,SBD,M,
Boys,82.1,3,Rafael Villareal,Pflugerville Hendrickson,81.47,151.95,102.06,165.56,419.57,Single-ply,SBD,M,
Boys,82.1,4,David Ohko,Hutto,80.1,151.95,88.45,138.35,378.75,Single-ply,SBD,M,
Boys,82.1,5,Quade Mokry,Georgetown,76.29,102.06,74.84,181.44,358.34,Single-ply,SBD,M,
Boys,82.1,6,Sam Miller,Pflugerville Weiss,75.84,111.13,56.7,185.97,353.8,Single-ply,SBD,M,
Boys,82.1,7,Tyler Springer,Georgetown,80.56,133.81,79.38,124.74,337.93,Single-ply,SBD,M,
Boys,89.81,1,Alan Hernandez #7,Georgetown,88.36,208.65,149.69,213.19,571.53,Single-ply,SBD,M,
Boys,89.81,2,Thomas Thornburg,Georgetown East View,84.37,222.26,120.2,226.8,569.26,Single-ply,SBD,M,
Boys,89.81,3,Aron Olague,Georgetown East View,83.73,167.83,111.13,204.12,483.08,Single-ply,SBD,M,
Boys,89.81,4,Isaih Justice,Killeen Shoemaker,89.54,174.63,92.99,185.97,453.59,Single-ply,SBD,M,
Boys,89.81,5,Josh Palmer,Georgetown,88.99,156.49,102.06,183.7,442.25,Single-ply,SBD,M,
Boys,89.81,6,Cam'ron Cavalier,Pflugerville Weiss,87.91,142.88,95.25,188.24,426.38,Single-ply,SBD,M,
Boys,89.81,7,Chris Parker #4,Killeen Shoemaker,89.45,136.08,83.91,158.76,378.75,Single-ply,SBD,M,
Boys,89.81,8,Deigo Moreno,Hutto,83.19,142.88,88.45,136.08,367.41,Single-ply,SBD,M,
Boys,89.81,9,Jake McCown,Georgetown,89.81,117.93,70.31,156.49,344.73,Single-ply,SBD,M,
Boys,89.81,10,Matthew Mccraken,Georgetown,82.74,92.99,56.7,142.88,292.57,Single-ply,SBD,M,
Boys,99.79,1,Adam Vineyard,Georgetown East View,99.06,260.82,142.88,233.6,637.3,Single-ply,SBD,M,
Boys,99.79,2,Aidan Keith,Pflugerville Hendrickson,99.43,206.38,161.03,210.92,578.33,Single-ply,SBD,M,
Boys,99.79,3,Parker Smith,Hutto,92.62,163.29,86.18,170.1,419.57,Single-ply,SBD,M,
Boys,99.79,4,Teshawn Byers,Killeen Shoemaker,94.44,124.74,83.91,161.03,369.68,Single-ply,SBD,M,
Boys,99.79,5,Brodan Elliot,Georgetown,92.08,136.08,77.11,142.88,356.07,Single-ply,SBD,M,
Boys,109.77,1,Seth Kirklin,Georgetown East View,107.05,226.8,140.61,219.99,587.4,Single-ply,SBD,M,
Boys,109.77,2,Leuntae Glee,Killeen Shoemaker,102.33,208.65,104.33,183.7,496.68,Single-ply,SBD,M,
Boys,109.77,3,Ricky Segura,Pflugerville Weiss,100.7,151.95,106.59,163.29,421.84,Single-ply,SBD,M,
Boys,109.77,4,Jeremiah Phillips,Georgetown,103.06,102.06,70.31,129.27,301.64,Single-ply,SBD,M,
Boys,109.77,DQ,Nick Hanks,Hutto,101.15,,,,,Single-ply,SBD,M,
Boys,124.74,1,Cole Smith #3,Georgetown East View,124.28,244.94,140.61,231.33,616.89,Single-ply,SBD,M,
Boys,124.74,2,Brian McClarron,Pflugerville Weiss,110.86,165.56,86.18,192.78,444.52,Single-ply,SBD,M,
Boys,124.74,3,Braeland Davis,Hutto,114.58,147.42,90.72,163.29,401.43,Single-ply,SBD,M,
Boys,124.74+,1,Noe Ibarra,Georgetown,160.12,301.64,179.17,244.94,725.75,Single-ply,SBD,M,
Boys,124.74+,2,Eron Ortiz,Georgetown,164.02,281.23,158.76,233.6,673.58,Single-ply,SBD,M,
Boys,124.74+,3,Detrick Wiliams,Hutto,138.62,190.51,131.54,181.44,503.49,Single-ply,SBD,M,
Boys,124.74+,4,Niky Morua,Georgetown East View,126.64,188.24,120.2,176.9,485.34,Single-ply,SBD,M,
