Division,WeightClassKg,Place,Name,Team,BodyweightKg,Best3SquatKg,Best3BenchKg,Best3DeadliftKg,TotalKg,Equipment,Event,Sex
Boys,51.71,1,Daniel Salinas,Chico,51.71,111.13,68.04,136.08,315.25,Single-ply,SBD,M
Boys,51.71,2,Exxon Pantaleon,Krum,51.26,113.4,54.43,138.35,306.17,Single-ply,SBD,M
Boys,51.71,3,Danny Rivera,Ponder,50.53,115.67,61.23,117.93,294.84,Single-ply,SBD,M
Boys,51.71,4,Armando Salinas,Chico,51.57,92.99,52.16,120.2,265.35,Single-ply,SBD,M
Boys,51.71,5,Derek Thacker,Valley View,49.35,102.06,47.63,102.06,251.74,Single-ply,SBD,M
Boys,51.71,6,Grant Kersey,Valley View,49.62,92.99,40.82,95.25,229.06,Single-ply,SBD,M
Boys,51.71,7,Armando Alvarado,Castleberry,51.17,72.57,47.63,102.06,222.26,Single-ply,SBD,M
Boys,51.71,8,Will Shaw,Wichita Falls Rider,49.44,81.65,47.63,86.18,215.46,Single-ply,SBD,M
Boys,51.71,9,Cj Pinedo,Lake Worth,49.62,68.04,40.82,90.72,199.58,Single-ply,SBD,M
Boys,55.79,1,Trevor Richard,Chico,54.88,129.27,83.91,156.49,369.68,Single-ply,SBD,M
Boys,55.79,2,Roger Garcia,Mineral Wells,54.43,124.74,83.91,140.61,349.27,Single-ply,SBD,M
Boys,59.87,3,Tinnin Smith,Jacksboro,55.97,113.4,72.57,122.47,308.44,Single-ply,SBD,M
Boys,59.87,4,Jose Oliveira,Paradise,55.88,99.79,70.31,136.08,306.17,Single-ply,SBD,M
Boys,55.79,5,Adrian Lopez,Wichita Falls,53.34,108.86,61.23,129.27,299.37,Single-ply,SBD,M
Boys,55.79,6,Jacob Ochoa,Decatur,53.52,92.99,58.97,108.86,260.82,Single-ply,SBD,M
Boys,55.79,7,Lance Winebrinner,Millsap,53.89,81.65,63.5,108.86,254.01,Single-ply,SBD,M
Boys,55.79,8,Tyler Roane,Valley View,55.34,92.99,40.82,92.99,226.8,Single-ply,SBD,M
Boys,55.79,DQ,Chris Meredith,Mineral Wells,52.98,95.25,,117.93,,Single-ply,SBD,M
Boys,67.13,1,Roque Rivas,Bowie,59.96,172.37,102.06,172.37,446.79,Single-ply,SBD,M
Boys,59.87,2,Armani Donaldson,Wichita Falls,57.7,167.83,104.33,154.22,426.38,Single-ply,SBD,M
Boys,59.87,3,Ivan Karabanoff,Peaster,57.79,158.76,86.18,161.03,405.97,Single-ply,SBD,M
Boys,59.87,4,Tristan Zamarripa,Lake Worth,59.78,156.49,83.91,165.56,405.97,Single-ply,SBD,M
Boys,59.87,5,Kamery Wiley,Wichita Falls,56.34,142.88,61.23,172.37,376.48,Single-ply,SBD,M
Boys,59.87,6,Homer Ortiz,Santo,56.52,124.74,72.57,133.81,331.12,Single-ply,SBD,M
Boys,59.87,7,Brett Brownfield,Peaster,59.78,120.2,61.23,129.27,310.71,Single-ply,SBD,M
Boys,59.87,8,Chris Kirkam,Burleson,59.06,104.33,65.77,136.08,306.17,Single-ply,SBD,M
Boys,59.87,9,Lane Serna,Krum,57.15,92.99,54.43,108.86,256.28,Single-ply,SBD,M
Boys,67.13,1,Juan Martinez,Graham,66.32,190.51,129.27,208.65,528.44,Single-ply,SBD,M
Boys,67.13,2,Kelton Dethloff,Paradise,65.5,215.46,88.45,199.58,503.49,Single-ply,SBD,M
Boys,67.13,3,Dylan Serna,Krum,66.22,190.51,113.4,195.04,498.95,Single-ply,SBD,M
Boys,67.13,4,Ian Concepcion,Krum,66.86,195.04,90.72,199.58,485.34,Single-ply,SBD,M
Boys,74.84,5,Ty Slaughter,Whitesboro,67.22,179.17,106.59,190.51,476.27,Single-ply,SBD,M
Boys,67.13,6,Sean McNeil,Graham,65.95,179.17,97.52,197.31,474,Single-ply,SBD,M
Boys,67.13,7,Tanner Tomlin,Bowie,63.87,174.63,104.33,179.17,458.13,Single-ply,SBD,M
Boys,67.13,8,Oscar Orozco,Castleberry,67.13,156.49,97.52,190.51,444.52,Single-ply,SBD,M
Boys,67.13,9,Kristof Pewitt,Paradise,64.05,170.1,99.79,165.56,435.45,Single-ply,SBD,M
Boys,67.13,10,Marcus Garza,Graham,63.87,154.22,99.79,174.63,428.64,Single-ply,SBD,M
Boys,67.13,11,Tony Carrillo,Graham,60.33,145.15,86.18,183.7,415.04,Single-ply,SBD,M
Boys,67.13,12,Abraham Landeverde,Bowie,66.32,163.29,88.45,151.95,403.7,Single-ply,SBD,M
Boys,67.13,13,Zach Montgomery,Jacksboro,60.6,147.42,72.57,165.56,385.55,Single-ply,SBD,M
Boys,67.13,14,Stefan Rodriquez,Burleson,63.87,136.08,72.57,172.37,381.02,Single-ply,SBD,M
Boys,67.13,15,Ethan Balthrop,Castleberry,65.5,147.42,79.38,154.22,381.02,Single-ply,SBD,M
Boys,67.13,16,Bryan Ortiz,Castleberry,66.95,147.42,79.38,149.69,376.48,Single-ply,SBD,M
Boys,67.13,17,Michael Henderson,Santo,62.05,136.08,70.31,149.69,356.07,Single-ply,SBD,M
Boys,67.13,18,Joesph Franco,Burleson,63.87,124.74,81.65,142.88,349.27,Single-ply,SBD,M
Boys,67.13,19,Jarrod Wooten,Peaster,65.23,122.47,90.72,136.08,349.27,Single-ply,SBD,M
Boys,67.13,20,Cris Pringle,Lake Worth,65.59,127.01,86.18,127.01,340.19,Single-ply,SBD,M
Boys,67.13,21,Bryce Merriman,Lake Worth,63.96,131.54,74.84,127.01,333.39,Single-ply,SBD,M
Boys,67.13,22,Grayson Cobb,Paradise,63.41,131.54,68.04,127.01,326.59,Single-ply,SBD,M
Boys,67.13,23,Coty Allen,Burleson,65.14,102.06,65.77,133.81,301.64,Single-ply,SBD,M
Boys,67.13,24,Romario Hernandez,Krum,65.59,149.69,,151.95,301.64,Single-ply,SD,M
Boys,67.13,25,Brody Powell,Millsap,66.04,113.4,70.31,113.4,297.1,Single-ply,SBD,M
Boys,67.13,26,Abraham Cervantes,Castleberry,61.78,86.18,74.84,115.67,276.69,Single-ply,SBD,M
Boys,67.13,27,Brice Richardson,Paradise,63.78,52.16,45.36,61.23,158.76,Single-ply,SBD,M
Boys,67.13,DQ,Kaleb Willis,Lindsay,66.77,,,142.88,,Single-ply,SBD,M
Boys,74.84,DQ,Josiah Beshear,Wichita Falls Rider,67.31,108.86,,95.25,,Single-ply,SBD,M
Boys,74.84,1,Seth Rogers,Jacksboro,74.66,199.58,124.74,210.92,535.24,Single-ply,SBD,M
Boys,74.84,2,Jesse Herd,Jacksboro,74.57,197.31,131.54,192.78,521.63,Single-ply,SBD,M
Boys,74.84,3,Tanner Johnson,Whitesboro,71.49,190.51,102.06,195.04,487.61,Single-ply,SBD,M
Boys,74.84,4,Clayton Stringer,Whitesboro,72.03,176.9,90.72,185.97,453.59,Single-ply,SBD,M
Boys,74.84,5,Ryan Davila,Mineral Wells,72.76,179.17,124.74,149.69,453.59,Single-ply,SBD,M
Boys,74.84,6,Essie Woodard,Wichita Falls,68.95,174.63,90.72,185.97,451.32,Single-ply,SBD,M
Boys,74.84,7,Darrion Riggs,Chico,69.44,158.76,102.06,181.44,442.25,Single-ply,SBD,M
Boys,82.1,8,Matthew Jelen,Krum,75.02,163.29,111.13,165.56,439.98,Single-ply,SBD,M
Boys,82.1,9,Quentin Sims,Wichita Falls,75.02,165.56,102.06,167.83,435.45,Single-ply,SBD,M
Boys,74.84,10,Matt Carter,Chico,70.76,151.95,104.33,170.1,426.38,Single-ply,SBD,M
Boys,74.84,11,Dylan Horton,Graham,73.66,167.83,90.72,165.56,424.11,Single-ply,SBD,M
Boys,74.84,12,Chase Thompson,Jacksboro,73.26,154.22,90.72,165.56,410.5,Single-ply,SBD,M
Boys,74.84,13,Dennis Ralon,Lake Worth,68.49,145.15,92.99,154.22,392.36,Single-ply,SBD,M
Boys,74.84,14,York Doby,Peaster,68.86,127.01,86.18,163.29,376.48,Single-ply,SBD,M
Boys,74.84,15,Ivan Segura,Chico,72.21,129.27,86.18,149.69,365.14,Single-ply,SBD,M
Boys,74.84,16,John Losoya,Wichita Falls,67.86,131.54,72.57,151.95,356.07,Single-ply,SBD,M
Boys,74.84,17,Griffin Balthrop,Castleberry,69.4,131.54,77.11,140.61,349.27,Single-ply,SBD,M
Boys,74.84,18,Dakota Jimenez,Paradise,70.67,122.47,83.91,136.08,342.46,Single-ply,SBD,M
Boys,74.84,19,Amory Washington,Burleson,74.3,127.01,79.38,127.01,333.39,Single-ply,SBD,M
Boys,74.84,20,Victor Contreras,Mineral Wells,68.22,113.4,72.57,138.35,324.32,Single-ply,SBD,M
Boys,74.84,21,Colton Allison,Burleson,67.68,127.01,63.5,106.59,297.1,Single-ply,SBD,M
Boys,74.84,22,Jared Stone,Mineral Wells,72.94,83.91,61.23,122.47,267.62,Single-ply,SBD,M
Boys,74.84,23,Caleb Sims,Paradise,67.59,106.59,58.97,90.72,256.28,Single-ply,SBD,M
Boys,74.84,24,Tim Landers,Castleberry,72.94,83.91,56.7,115.67,256.28,Single-ply,SBD,M
Boys,74.84,DQ,Tristan Willard,Nocona,72.03,133.81,,,,Single-ply,SBD,M
Boys,74.84,DQ,Christian McCormick,Paradise,72.39,170.1,,,,Single-ply,SBD,M
Boys,74.84,DQ,Dylan Burton,Millsap,72.21,149.69,,158.76,,Single-ply,SBD,M
Boys,74.84,DQ,Chance Hall,Peaster,67.77,,65.77,120.2,,Single-ply,SBD,M
Boys,74.84,DQ,Samuel Giordano,Wichita Falls Rider,72.03,,102.06,138.35,,Single-ply,SBD,M
Boys,82.1,1,Brennan Sooter,Ponder,78.56,256.28,133.81,208.65,598.74,Single-ply,SBD,M
Boys,82.1,2,Steven Blankenship,Graham,79.2,190.51,136.08,208.65,535.24,Single-ply,SBD,M
Boys,82.1,3,Travis Mallory,Mineral Wells,80.47,192.78,120.2,215.46,528.44,Single-ply,SBD,M
Boys,82.1,4,Hunter Wolfe,Wichita Falls Notre Dame,80.65,217.72,124.74,183.7,526.17,Single-ply,SBD,M
Boys,89.81,5,Michael Elmore,Graham,82.19,192.78,138.35,183.7,514.83,Single-ply,SBD,M
Boys,89.81,6,Eric Maldonado,Castleberry,82.28,167.83,115.67,188.24,471.74,Single-ply,SBD,M
Boys,82.1,7,Jared Lott,Wichita Falls Rider,75.48,181.44,117.93,170.1,469.47,Single-ply,SBD,M
Boys,82.1,8,Greg Roberts,Lake Worth,75.48,181.44,92.99,185.97,460.4,Single-ply,SBD,M
Boys,82.1,9,Ayinde Alijiiy,Burleson,80.29,142.88,120.2,192.78,455.86,Single-ply,SBD,M
Boys,82.1,10,Cody Cornett,Burleson,80.01,154.22,111.13,181.44,446.79,Single-ply,SBD,M
Boys,82.1,11,Elijah Walker,Lindsay,75.48,170.1,113.4,156.49,439.98,Single-ply,SBD,M
Boys,82.1,12,Brandon Dodson,Ponder,77.66,181.44,90.72,167.83,439.98,Single-ply,SBD,M
Boys,82.1,13,Tanner Teske,Burleson,77.29,151.95,104.33,181.44,437.72,Single-ply,SBD,M
Boys,89.81,14,Cameron Shulte,Boyd,82.19,172.37,83.91,170.1,426.38,Single-ply,SBD,M
Boys,82.1,15,Ty Stewart,Lake Worth,75.93,170.1,90.72,156.49,417.3,Single-ply,SBD,M
Boys,82.1,16,Brendan Beach,Ponder,75.75,163.29,92.99,156.49,412.77,Single-ply,SBD,M
Boys,82.1,17,Colton Bigham,Millsap,81.37,136.08,106.59,170.1,412.77,Single-ply,SBD,M
Boys,82.1,18,Hayden Kyle,Wichita Falls Rider,80.29,151.95,97.52,147.42,396.89,Single-ply,SBD,M
Boys,82.1,19,Magnum Sampson,Ponder,76.48,154.22,81.65,154.22,390.09,Single-ply,SBD,M
Boys,82.1,20,Andrew Holguin,Lake Worth,75.66,142.88,92.99,138.35,374.21,Single-ply,SBD,M
Boys,82.1,21,Jimmie Jones,Valley View,77.93,136.08,88.45,142.88,367.41,Single-ply,SBD,M
Boys,82.1,22,Brad Hull,Krum,80.47,120.2,72.57,161.03,353.8,Single-ply,SBD,M
Boys,89.81,23,Seth Wallace,Boyd,82.28,136.08,77.11,138.35,351.53,Single-ply,SBD,M
Boys,82.1,24,Noah Hayes,Nocona,75.66,90.72,74.84,70.31,235.87,Single-ply,SBD,M
Boys,82.1,25,Michael Robinson,Millsap,80.92,70.31,45.36,70.31,185.97,Single-ply,SBD,M
Boys,82.1,DQ,Jack Collins,Burleson,76.93,158.76,,190.51,,Single-ply,SBD,M
Boys,82.1,DQ,Joshua Bejarano,Valley View,77.56,131.54,,127.01,,Single-ply,SBD,M
Boys,89.81,1,True Miller,Bowie,88,256.28,124.74,238.14,619.15,Single-ply,SBD,M
Boys,89.81,2,Luke Bowling,Santo,83.55,215.46,120.2,226.8,562.45,Single-ply,SBD,M
Boys,89.81,3,Matt Sinclair,Boyd,84.46,183.7,111.13,172.37,467.2,Single-ply,SBD,M
Boys,89.81,4,Tristan Sosa,Wichita Falls,84.1,165.56,115.67,172.37,453.59,Single-ply,SBD,M
Boys,99.79,5,Carlon Christian,Wichita Falls Rider,89.99,158.76,88.45,204.12,451.32,Single-ply,SBD,M
Boys,89.81,6,Nic Delgado,Burleson,83.73,156.49,111.13,181.44,449.06,Single-ply,SBD,M
Boys,89.81,7,Collin Kilcrease,Whitesboro,88.45,154.22,104.33,185.97,444.52,Single-ply,SBD,M
Boys,89.81,8,Shamon McKenzie,Wichita Falls,88.99,181.44,99.79,154.22,435.45,Single-ply,SBD,M
Boys,89.81,9,Garrett Ragsdale,Boyd,88.72,170.1,106.59,156.49,433.18,Single-ply,SBD,M
Boys,89.81,10,Christian Holt,Burleson,89.45,145.15,102.06,167.83,415.04,Single-ply,SBD,M
Boys,89.81,11,Hunter Woodruff,Boyd,84.91,151.95,77.11,136.08,365.14,Single-ply,SBD,M
Boys,89.81,12,Gage Snider,Burleson,83.37,124.74,74.84,124.74,324.32,Single-ply,SBD,M
Boys,89.81,13,Javier Venegas,Valley View,88.72,120.2,68.04,115.67,303.91,Single-ply,SBD,M
Boys,89.81,DQ,Dillon Roberts,Burleson,89.54,181.44,95.25,,,Single-ply,SBD,M
Boys,89.81,DQ,Bonher Cottongame,Graham,89.81,170.1,106.59,,,Single-ply,SBD,M
Boys,99.79,1,Ej Lozada,Jacksboro,96.07,222.26,127.01,229.06,578.33,Single-ply,SBD,M
Boys,99.79,2,Taylor Edwards,Paradise,92.99,208.65,149.69,197.31,555.65,Single-ply,SBD,M
Boys,99.79,3,Thomas Morales,Whitesboro,98.16,204.12,136.08,188.24,528.44,Single-ply,SBD,M
Boys,99.79,4,Ruan Lopez,Wichita Falls Rider,94.08,190.51,131.54,199.58,521.63,Single-ply,SBD,M
Boys,99.79,5,Sam Scribner,Wichita Falls Rider,96.98,190.51,127.01,201.85,519.36,Single-ply,SBD,M
Boys,99.79,6,Víctor Reyes,Castleberry,93.35,151.95,113.4,156.49,421.84,Single-ply,SBD,M
Boys,99.79,7,Allen Mullis,Ponder,90.99,142.88,99.79,158.76,401.43,Single-ply,SBD,M
Boys,99.79,8,Brandon Gonzales,Krum,99.34,149.69,92.99,145.15,387.82,Single-ply,SBD,M
Boys,99.79,9,Daniel McCarley,Burleson,97.89,127.01,86.18,165.56,378.75,Single-ply,SBD,M
Boys,99.79,10,Brock McDaniel,Millsap,98.11,136.08,90.72,136.08,362.87,Single-ply,SBD,M
Boys,99.79,11,James Herd,Valley View,97.61,129.27,81.65,142.88,353.8,Single-ply,SBD,M
Boys,99.79,12,Chris Reyes,Castleberry,92.35,145.15,83.91,122.47,351.53,Single-ply,SBD,M
Boys,99.79,13,Russell Carey,Whitesboro,94.98,113.4,70.31,149.69,333.39,Single-ply,SBD,M
Boys,99.79,DQ,Channing Hamilton,Paradise,92.9,68.04,,102.06,,Single-ply,SBD,M
Boys,99.79,DQ,Aaron Ewing,Lake Worth,91.17,,,,,Single-ply,SBD,M
Boys,99.79,DQ,Chris Gallagher,Wichita Falls,99.7,206.38,104.33,,,Single-ply,SBD,M
Boys,109.77,1,Chris Aivaliotis,Ponder,109.23,249.48,147.42,226.8,623.69,Single-ply,SBD,M
Boys,109.77,2,Pj Caparelli,Bowie,106.41,249.48,129.27,226.8,605.55,Single-ply,SBD,M
Boys,109.77,3,Derek Baynes,Graham,108.32,235.87,145.15,213.19,594.21,Single-ply,SBD,M
Boys,109.77,4,Tj May,Bowie,108.23,215.46,142.88,188.24,546.58,Single-ply,SBD,M
Boys,109.77,5,Juan Arrendondo,Graham,108.86,206.38,102.06,213.19,521.63,Single-ply,SBD,M
Boys,109.77,6,Mitchell Coker,Millsap,105.23,197.31,122.47,197.31,517.1,Single-ply,SBD,M
Boys,124.74,7,Esteban Martinez,Krum,109.86,204.12,113.4,190.51,508.02,Single-ply,SBD,M
Boys,109.77,8,Herb Hoover,Burleson,103.33,183.7,113.4,206.38,503.49,Single-ply,SBD,M
Boys,109.77,9,Jackson Towery,Nocona,104.6,192.78,104.33,204.12,501.22,Single-ply,SBD,M
Boys,124.74,10,Mitchell Holmes,Wichita Falls Rider,109.91,183.7,111.13,183.7,478.54,Single-ply,SBD,M
Boys,109.77,11,Nick Thompson,Ponder,100.24,156.49,86.18,154.22,396.89,Single-ply,SBD,M
Boys,109.77,12,Drew Filkens,Nocona,108.59,147.42,81.65,151.95,381.02,Single-ply,SBD,M
Boys,109.77,13,Erby Higgins,Paradise,100.97,124.74,102.06,149.69,376.48,Single-ply,SBD,M
Boys,109.77,14,Michael Galindo,Chico,103.33,127.01,90.72,156.49,374.21,Single-ply,SBD,M
Boys,109.77,15,Justin Wagner,Ponder,101.06,147.42,86.18,136.08,369.68,Single-ply,SBD,M
Boys,109.77,16,Ricardo Martinez #6,Mineral Wells,108.5,140.61,86.18,120.2,347,Single-ply,SBD,M
Boys,109.77,17,Aaron Bribiesca,Burleson,106.87,111.13,63.5,124.74,299.37,Single-ply,SBD,M
Boys,109.77,18,Jake Cox,Whitesboro,100.33,97.52,72.57,99.79,269.89,Single-ply,SBD,M
Boys,109.77,DQ,Ty White,Valley View,105.96,102.06,74.84,,,Single-ply,SBD,M
Boys,124.74,1,Sammy Serrano,Graham,123.74,238.14,115.67,190.51,544.31,Single-ply,SBD,M
Boys,124.74,2,Dakota Williams,Decatur,114.94,217.72,120.2,199.58,537.51,Single-ply,SBD,M
Boys,124.74,3,Kasey Misenheimer,Whitesboro,117.12,210.92,115.67,201.85,528.44,Single-ply,SBD,M
Boys,124.74,4,Hunter Rhine,Burleson,119.84,199.58,120.2,208.65,528.44,Single-ply,SBD,M
Boys,124.74,5,Tyler Melton,Chico,116.57,181.44,117.93,190.51,489.88,Single-ply,SBD,M
Boys,124.74,6,Lucas Sims,Boyd,114.85,176.9,92.99,145.15,415.04,Single-ply,SBD,M
Boys,124.74,7,Tanner Edwards,Paradise,112.67,170.1,97.52,138.35,405.97,Single-ply,SBD,M
Boys,124.74,8,Elias Williams,Burleson,119.07,129.27,70.31,151.95,351.53,Single-ply,SBD,M
Boys,124.74,9,Jacob Poole,Ponder,121.65,117.93,61.23,117.93,297.1,Single-ply,SBD,M
Boys,124.74+,1,Bryan Townsend,Whitesboro,126.55,229.06,151.95,226.8,607.81,Single-ply,SBD,M
Boys,124.74+,2,Jimmy Schuetz,Chico,132.81,249.48,131.54,210.92,591.94,Single-ply,SBD,M
Boys,124.74+,3,Caleb Mitcheson,Whitesboro,128.09,226.8,142.88,217.72,587.4,Single-ply,SBD,M
Boys,124.74+,4,Josh Collins,Burleson,127.64,215.46,124.74,226.8,566.99,Single-ply,SBD,M
Boys,124.74+,5,Julio Martinez,Castleberry,136.08,251.74,120.2,192.78,564.72,Single-ply,SBD,M
Boys,124.74+,6,Steffen Thomas,Wichita Falls,130.63,208.65,97.52,192.78,498.95,Single-ply,SBD,M
Boys,124.74+,7,Luke Miller,Paradise,153.31,192.78,124.74,147.42,464.93,Single-ply,SBD,M
Boys,124.74+,8,Jordan Mitchell,Krum,128.37,172.37,111.13,170.1,453.59,Single-ply,SBD,M
Boys,124.74+,9,Rae Winters,Burleson,131.72,136.08,86.18,136.08,358.34,Single-ply,SBD,M
Boys,124.74+,DQ,Shawn Lopez,Chico,137.44,145.15,,145.15,,Single-ply,SBD,M
Boys,,NS,Allen Martinez,Jacksboro,,,,,,Single-ply,SBD,M
Boys,,NS,Austin Hansen,Jacksboro,,,,,,Single-ply,SBD,M
Boys,,NS,Brandon Pettigrew,Decatur,,,,,,Single-ply,SBD,M
Boys,,NS,Josh Reeves,Krum,,,,,,Single-ply,SBD,M
Boys,,NS,McNallen Wyatt,Jacksboro,,,,,,Single-ply,SBD,M
Boys,,NS,Antonio Murrillo,Jacksboro,,,,,,Single-ply,SBD,M
Boys,,NS,Jeremy Pippen,Lake Worth,,,,,,Single-ply,SBD,M
Boys,,NS,Carlos Carrillo,Paradise,,,,,,Single-ply,SBD,M
Boys,,NS,Dylan Noble,Paradise,,,,,,Single-ply,SBD,M
Boys,,NS,Brandon Gober,Paradise,,,,,,Single-ply,SBD,M
Boys,,NS,Blake Brown,Paradise,,,,,,Single-ply,SBD,M
Boys,,NS,Derik Conner,Paradise,,,,,,Single-ply,SBD,M
Boys,,NS,Drew Carter,Paradise,,,,,,Single-ply,SBD,M
Boys,,NS,Brian San Miguel,Mineral Wells,,,,,,Single-ply,SBD,M
Boys,,NS,Ethan San Miguel,Mineral Wells,,,,,,Single-ply,SBD,M
Boys,,NS,Aaron Hite,Mineral Wells,,,,,,Single-ply,SBD,M
Boys,,NS,Mike Smith,Wichita Falls,,,,,,Single-ply,SBD,M
Boys,,NS,Wes Brinkman,Wichita Falls Notre Dame,,,,,,Single-ply,SBD,M
Boys,,NS,Casey Garza,Wichita Falls Rider,,,,,,Single-ply,SBD,M
Boys,,NS,Keagan Munholland,Wichita Falls Rider,,,,,,Single-ply,SBD,M
Boys,,NS,Dane McDonald,Wichita Falls,,,,,,Single-ply,SBD,M
Boys,,NS,Aaron Fraga,Wichita Falls,,,,,,Single-ply,SBD,M
Boys,,NS,Adam Stapleton,Whitesboro,,,,,,Single-ply,SBD,M
Boys,,NS,Taylor Littleton,Ponder,,,,,,Single-ply,SBD,M
Boys,,NS,Christian DuBoise,Peaster,,,,,,Single-ply,SBD,M
Boys,,NS,Tyler Dobbs,Peaster,,,,,,Single-ply,SBD,M
Boys,,NS,Jordan Whiteside,Peaster,,,,,,Single-ply,SBD,M
Boys,,NS,Andrew Brownfield,Peaster,,,,,,Single-ply,SBD,M
Boys,,NS,No Lift,Lake Worth,,,,,,Single-ply,SBD,M
