Division,WeightClassKg,Place,Name,Team,BodyweightKg,Best3SquatKg,Best3BenchKg,Best3DeadliftKg,TotalKg,Equipment,Event,Sex,BirthDate
Boys,51.71,1,Francisco Villarreal,Laredo Nixon,49.76,138.35,86.18,147.42,371.95,Single-ply,SBD,M,
Boys,51.71,2,Ricky Martinez,Pearsall,50.76,131.54,77.11,122.47,331.12,Single-ply,SBD,M,
Boys,51.71,3,Robert Longoria,Pearsall,51.17,79.38,54.43,127.01,260.82,Single-ply,SBD,M,
Boys,51.71,DQ,Tony Garza,Carrizo Springs,44.32,,,,,Single-ply,SBD,M,
Boys,55.79,1,Ryan Jimenez,Crystal City,55.34,142.88,88.45,145.15,376.48,Single-ply,SBD,M,
Boys,55.79,2,Damien Guerra,Dilley,55.38,136.08,70.31,133.81,340.19,Single-ply,SBD,M,
Boys,55.79,3,Kyle Briseno,Carrizo Springs,53.3,136.08,63.5,122.47,322.05,Single-ply,SBD,M,
Boys,55.79,4,Elias Garcia,Somerset,51.98,108.86,65.77,113.4,288.03,Single-ply,SBD,M,
Boys,59.87,1,Tommy Huerta,Crystal City,58.97,174.63,104.33,174.63,453.59,Single-ply,SBD,M,
Boys,59.87,2,Cristian Martinez,Hondo,59.87,149.69,92.99,172.37,415.04,Single-ply,SBD,M,
Boys,59.87,3,Damian Rodriguez,Dilley,59.78,158.76,70.31,154.22,383.29,Single-ply,SBD,M,
Boys,59.87,4,Alex Comparan,Laredo Nixon,57.06,138.35,70.31,129.27,337.93,Single-ply,SBD,M,
Boys,59.87,5,Mark Lopez,Crystal City,58.83,117.93,83.91,133.81,335.66,Single-ply,SBD,M,
Boys,59.87,DQ,Frank Rivera,Pearsall,58.51,131.54,56.7,,,Single-ply,SBD,M,
Boys,67.13,1,Julian Rico,Somerset,65.32,265.35,176.9,210.92,653.17,Single-ply,SBD,M,
Boys,67.13,2,Angel Rodríguez,Crystal City,66.18,201.85,120.2,190.51,512.56,Single-ply,SBD,M,
Boys,67.13,3,Shane Medrano,Uvalde,67.04,183.7,102.06,199.58,485.34,Single-ply,SBD,M,
Boys,67.13,4,Virgil Luna,Crystal City,64.59,181.44,99.79,183.7,464.93,Single-ply,SBD,M,
Boys,67.13,5,Eric Hernandez,Pearsall,65.23,167.83,102.06,179.17,449.06,Single-ply,SBD,M,
Boys,67.13,6,Fabien Uballe,La Pryor,63.64,142.88,113.4,165.56,421.84,Single-ply,SBD,M,
Boys,67.13,7,Alex De La Rosa,Dilley,65.77,142.88,104.33,154.22,401.43,Single-ply,SBD,M,
Boys,67.13,8,Miguel Terrazas,Laredo Nixon,64.36,145.15,88.45,147.42,381.02,Single-ply,SBD,M,
Boys,67.13,9,Deuce Cano,Dilley,65.77,138.35,97.52,142.88,378.75,Single-ply,SBD,M,
Boys,67.13,10,Jerry Martinez,Uvalde,64.23,142.88,83.91,149.69,376.48,Single-ply,SBD,M,
Boys,67.13,11,EJ Chavez,Uvalde,63.59,133.81,77.11,142.88,353.8,Single-ply,SBD,M,
Boys,67.13,12,Luis Sambrano,Dilley,63.96,142.88,68.04,138.35,349.27,Single-ply,SBD,M,
Boys,67.13,DQ,Alexis Hernandez,Laredo Nixon,65.09,104.33,,,,Single-ply,SBD,M,
Boys,74.84,1,Mario Caberera,Somerset,73.94,281.23,142.88,233.6,657.71,Single-ply,SBD,M,
Boys,74.84,2,Daniel Almedia,Uvalde,74.39,208.65,117.93,251.74,578.33,Single-ply,SBD,M,
Boys,74.84,3,Abraham Davila,Uvalde,73.21,217.72,124.74,213.19,555.65,Single-ply,SBD,M,
Boys,74.84,4,Zach Lambert,Uvalde,74.07,213.19,111.13,222.26,546.58,Single-ply,SBD,M,
Boys,74.84,5,Steven Perales,Carrizo Springs,74.3,176.9,122.47,185.97,485.34,Single-ply,SBD,M,
Boys,74.84,6,Sergio Sonora,Carrizo Springs,67.81,181.44,99.79,174.63,455.86,Single-ply,SBD,M,
Boys,74.84,7,Jesus Tellez,Crystal City,74.84,174.63,104.33,176.9,455.86,Single-ply,SBD,M,
Boys,74.84,8,Diego Torres,Dilley,67.27,161.03,92.99,158.76,412.77,Single-ply,SBD,M,
Boys,74.84,DQ,Christian De La Cruz,Carrizo Springs,70.26,,,,,Single-ply,SBD,M,
Boys,74.84,DQ,Elijah Solis,Uvalde,74.03,183.7,,,,Single-ply,SBD,M,
Boys,74.84,DQ,Gabriel Martinez,Pearsall,73.26,201.85,120.2,,,Single-ply,SBD,M,
Boys,82.1,1,Ray Leal,Pearsall,81.74,224.53,115.67,226.8,566.99,Single-ply,SBD,M,
Boys,82.1,2,Nathan Delgado,Crystal City,81.74,226.8,127.01,204.12,557.92,Single-ply,SBD,M,
Boys,82.1,3,Fabio Strozzie,Somerset,80.74,215.46,124.74,183.7,523.9,Single-ply,SBD,M,
Boys,82.1,4,Raul Maldonado,Crystal City,80.83,190.51,108.86,181.44,480.81,Single-ply,SBD,M,
Boys,82.1,5,Jarret Gest,Carrizo Springs,77.29,183.7,111.13,167.83,462.66,Single-ply,SBD,M,
Boys,82.1,6,Joey Garza,Laredo Nixon,78.88,167.83,79.38,183.7,430.91,Single-ply,SBD,M,
Boys,82.1,7,Gilbert Martinez,Crystal City,81.74,142.88,68.04,154.22,365.14,Single-ply,SBD,M,
Boys,82.1,8,Ulrich Kalthoft,Pearsall,81.74,224.53,,,224.53,Single-ply,S,M,
Boys,82.1,DQ,Eden Fuentes,Pearsall,79.06,226.8,122.47,,,Single-ply,SBD,M,
Boys,89.81,1,Martin Rios,Crystal City,88,258.55,147.42,229.06,635.03,Single-ply,SBD,M,
Boys,89.81,2,Isaac Garcia,Crystal City,88.72,249.48,131.54,242.67,623.69,Single-ply,SBD,M,
Boys,89.81,3,David Castro,Carrizo Springs,83.91,219.99,113.4,201.85,535.24,Single-ply,SBD,M,
Boys,89.81,4,Alomar Ybarra,Somerset,88,215.46,120.2,183.7,519.36,Single-ply,SBD,M,
Boys,89.81,5,Domingo Mendiola,Laredo Nixon,86.68,170.1,127.01,215.46,512.56,Single-ply,SBD,M,
Boys,89.81,6,Robert Olivarez,Uvalde,84.28,172.37,124.74,183.7,480.81,Single-ply,SBD,M,
Boys,89.81,7,Aaron Roldman,Hondo,89.18,183.7,115.67,172.37,471.74,Single-ply,SBD,M,
Boys,89.81,8,Abel Sanchez,Laredo Nixon,85.23,183.7,97.52,190.51,471.74,Single-ply,SBD,M,
Boys,89.81,9,Gabriel Guajardo,Hondo,86.23,163.29,97.52,190.51,451.32,Single-ply,SBD,M,
Boys,89.81,10,Andres Rodriguez,Laredo Nixon,89.58,147.42,88.45,170.1,405.97,Single-ply,SBD,M,
Boys,89.81,11,Leo Strozzie,Somerset,86.64,158.76,74.84,165.56,399.16,Single-ply,SBD,M,
Boys,89.81,12,Ace Mata,Crystal City,83.55,131.54,72.57,149.69,353.8,Single-ply,SBD,M,
Boys,99.79,1,Michael Gonzalez,Somerset,90.26,317.51,190.51,235.87,743.89,Single-ply,SBD,M,
Boys,99.79,2,Isaiah Valdez,Somerset,94.8,306.17,197.31,226.8,730.28,Single-ply,SBD,M,
Boys,99.79,3,Armando Rodriguez,Carrizo Springs,95.93,260.82,115.67,238.14,614.62,Single-ply,SBD,M,
Boys,99.79,4,Dakota Castillo,Somerset,94.8,235.87,142.88,190.51,569.26,Single-ply,SBD,M,
Boys,99.79,5,Oscar Briseno,Carrizo Springs,93.26,242.67,117.93,172.37,532.97,Single-ply,SBD,M,
Boys,99.79,6,David Garcia,Somerset,90.72,201.85,115.67,195.04,512.56,Single-ply,SBD,M,
Boys,99.79,7,Oscar Ramirez,Carrizo Springs,93.76,190.51,111.13,183.7,485.34,Single-ply,SBD,M,
Boys,99.79,8,Luke Morales,Crystal City,99.61,136.08,90.72,151.95,378.75,Single-ply,SBD,M,
Boys,99.79,DQ,Jose Gauna,La Pryor,91.94,190.51,,,,Single-ply,SBD,M,
Boys,109.77,1,Alfonso Mata,Crystal City,107.95,281.23,161.03,244.94,687.19,Single-ply,SBD,M,
Boys,109.77,2,Joe Vega #5,Crystal City,109.32,265.35,176.9,197.31,639.57,Single-ply,SBD,M,
Boys,109.77,3,Gabriel Gutierrez,Pearsall,106.78,267.62,131.54,233.6,632.76,Single-ply,SBD,M,
Boys,109.77,4,Abraham Vasquez,Somerset,106.59,226.8,108.86,208.65,544.31,Single-ply,SBD,M,
Boys,109.77,5,Francisco Castillo,Somerset,109.32,226.8,124.74,192.78,544.31,Single-ply,SBD,M,
Boys,109.77,6,Phillip Valles,Carrizo Springs,104.51,217.72,120.2,204.12,542.04,Single-ply,SBD,M,
Boys,109.77,7,Rodolfo Reyes,Uvalde,109.72,231.33,106.59,195.04,532.97,Single-ply,SBD,M,
Boys,109.77,8,James Vasquez,La Pryor,102.24,190.51,124.74,172.37,487.61,Single-ply,SBD,M,
Boys,109.77,9,Julio Obregon,Hondo,109.09,185.97,111.13,183.7,480.81,Single-ply,SBD,M,
Boys,109.77,DQ,Alfredo Segura,Carrizo Springs,104.73,272.16,,,,Single-ply,SBD,M,
Boys,124.74,1,Kollin Meeks,Pearsall,113.08,263.08,140.61,201.85,605.55,Single-ply,SBD,M,
Boys,124.74,2,Juan Flores,Somerset,116.57,260.82,102.06,206.38,569.26,Single-ply,SBD,M,
Boys,124.74,3,Jesus Pena,Laredo Nixon,122.24,142.88,79.38,185.97,408.23,Single-ply,SBD,M,
Boys,124.74,4,Joe Mann,Somerset,111.58,161.03,79.38,108.86,349.27,Single-ply,SBD,M,
Boys,124.74,5,Andrew Lazono,La Pryor,112.94,133.81,77.11,104.33,315.25,Single-ply,SBD,M,
Boys,124.74+,1,Daniel Garza,Carrizo Springs,131.27,306.17,167.83,224.53,698.53,Single-ply,SBD,M,
Boys,124.74+,2,Mark Flores,Somerset,128.37,272.16,176.9,192.78,641.83,Single-ply,SBD,M,
Boys,124.74+,3,Roberto Castro,Crystal City,169.28,204.12,95.25,158.76,458.13,Single-ply,SBD,M,
Boys,124.74+,4,Carazzco Adrian,Somerset,128.37,272.16,,,272.16,Single-ply,S,M,
Boys,124.74+,5,Alex Alvarez,Dilley,135.03,61.23,54.43,61.23,176.9,Single-ply,SBD,M,
