[
    {
        "name":"Monday",
        "value":100
    },
    {
        "name":"Tuesday",
        "value":100
    },
    {
        "name":"Wednesday",
        "value":100
    },
    {
        "name":"Thursday",
        "value":100
    },
    {
        "name":"Friday",
        "value":100
    },
    {
        "name":"Saturday",
        "value":100
    },
    {
        "name":"Sunday",
        "value":100
    }
]