[
  { "role": "web_client", "resource": "*", "action": "authorize", "attributes": ["*"] },
  { "role": "web_client", "resource": "*", "action": "token", "attributes": ["*"] },
  { "role": "web_client", "resource": "*", "action": "registerUser", "attributes": ["*"] },

  { "role": "vk_bot", "resource": "*", "action": "authorize", "attributes": ["*"] },
  { "role": "vk_bot", "resource": "*", "action": "token", "attributes": ["*"] },
  { "role": "vk_bot", "resource": "*", "action": "registerUser", "attributes": ["*"] }
]
