C:/TouchGFXProjects/Temperature_system/Drivers/STM32F4xx_HAL_Driver/Src/stm32f4xx_hal_gpio.c:164:6:HAL_GPIO_Init	48	static
C:/TouchGFXProjects/Temperature_system/Drivers/STM32F4xx_HAL_Driver/Src/stm32f4xx_hal_gpio.c:294:6:HAL_GPIO_DeInit	36	static
C:/TouchGFXProjects/Temperature_system/Drivers/STM32F4xx_HAL_Driver/Src/stm32f4xx_hal_gpio.c:375:15:HAL_GPIO_ReadPin	0	static
C:/TouchGFXProjects/Temperature_system/Drivers/STM32F4xx_HAL_Driver/Src/stm32f4xx_hal_gpio.c:410:6:HAL_GPIO_WritePin	0	static
C:/TouchGFXProjects/Temperature_system/Drivers/STM32F4xx_HAL_Driver/Src/stm32f4xx_hal_gpio.c:433:6:HAL_GPIO_TogglePin	0	static
C:/TouchGFXProjects/Temperature_system/Drivers/STM32F4xx_HAL_Driver/Src/stm32f4xx_hal_gpio.c:458:19:HAL_GPIO_LockPin	8	static
C:/TouchGFXProjects/Temperature_system/Drivers/STM32F4xx_HAL_Driver/Src/stm32f4xx_hal_gpio.c:507:13:HAL_GPIO_EXTI_Callback	0	static
C:/TouchGFXProjects/Temperature_system/Drivers/STM32F4xx_HAL_Driver/Src/stm32f4xx_hal_gpio.c:492:6:HAL_GPIO_EXTI_IRQHandler	8	static
