C:/TouchGFXProjects/Temperature_system/Core/Src/main.c:958:13:SPI5_Write	16	static
C:/TouchGFXProjects/Temperature_system/Core/Src/main.c:260:6:SystemClock_Config	96	static
C:/TouchGFXProjects/Temperature_system/Core/Src/main.c:169:5:main	120	static
C:/TouchGFXProjects/Temperature_system/Core/Src/main.c:802:6:IOE_Init	0	static
C:/TouchGFXProjects/Temperature_system/Core/Src/main.c:811:6:IOE_ITConfig	0	static
C:/TouchGFXProjects/Temperature_system/Core/Src/main.c:823:6:IOE_Write	32	static
C:/TouchGFXProjects/Temperature_system/Core/Src/main.c:834:9:IOE_Read	32	static
C:/TouchGFXProjects/Temperature_system/Core/Src/main.c:847:10:IOE_ReadMultiple	24	static
C:/TouchGFXProjects/Temperature_system/Core/Src/main.c:856:6:IOE_Delay	0	static
C:/TouchGFXProjects/Temperature_system/Core/Src/main.c:984:6:LCD_IO_Init	8	static
C:/TouchGFXProjects/Temperature_system/Core/Src/main.c:994:6:LCD_IO_WriteData	16	static
C:/TouchGFXProjects/Temperature_system/Core/Src/main.c:1010:6:LCD_IO_WriteReg	16	static
C:/TouchGFXProjects/Temperature_system/Core/Src/main.c:1029:10:LCD_IO_ReadData	32	static
C:/TouchGFXProjects/Temperature_system/Core/Src/main.c:1056:6:LCD_Delay	0	static
C:/TouchGFXProjects/Temperature_system/Core/Src/main.c:1065:6:time_actions	16	static
C:/TouchGFXProjects/Temperature_system/Core/Src/main.c:1084:6:read_queues	8	static
C:/TouchGFXProjects/Temperature_system/Core/Src/main.c:1100:6:StartDefaultTask	88	static
C:/TouchGFXProjects/Temperature_system/Core/Src/main.c:1125:6:HAL_TIM_PeriodElapsedCallback	0	static
C:/TouchGFXProjects/Temperature_system/Core/Src/main.c:1146:6:Error_Handler	0	static
