../Drivers/CMSIS/Include/core_cm4.h:2064:26:ITM_SendChar	16	static,ignoring_inline_asm
../Core/Src/main.c:48:5:_write	32	static
../Core/Src/main.c:73:5:main	8	static
../Core/Src/main.c:119:6:SystemClock_Config	88	static
../Core/Src/main.c:165:13:MX_GPIO_Init	16	static
../Core/Src/main.c:186:6:Error_Handler	4	static,ignoring_inline_asm
