{
    "schemes": [
        "http"
    ],
    "swagger": "2.0",
    "info": {
        "description": "API Documentation",
        "title": "Authentication API",
        "termsOfService": "https://lab.tog.co.id",
        "contact": {
            "name": "Developer",
            "email": "dikhi@tog.co.id"
        },
        "version": "1.0.0"
    },
    "host": "localhost:9096",
    "basePath": "/api/v1/oauth",
    "paths": {
        "/": {
            "get": {
                "description": "show basic response",
                "consumes": [
                    "application/json"
                ],
                "produces": [
                    "application/json"
                ],
                "tags": [
                    "Index"
                ],
                "summary": "show basic response",
                "responses": {
                    "200": {
                        "description": "OK",
                        "schema": {
                            "$ref": "#/definitions/lib.Response"
                        }
                    },
                    "204": {
                        "description": "No Content",
                        "schema": {
                            "$ref": "#/definitions/lib.Response"
                        }
                    },
                    "400": {
                        "description": "Bad Request",
                        "schema": {
                            "$ref": "#/definitions/lib.Response"
                        }
                    },
                    "401": {
                        "description": "Unauthorized",
                        "schema": {
                            "$ref": "#/definitions/lib.Response"
                        }
                    },
                    "404": {
                        "description": "Not Found",
                        "schema": {
                            "$ref": "#/definitions/lib.Response"
                        }
                    },
                    "409": {
                        "description": "Conflict",
                        "schema": {
                            "$ref": "#/definitions/lib.Response"
                        }
                    },
                    "500": {
                        "description": "Internal Server Error",
                        "schema": {
                            "$ref": "#/definitions/lib.Response"
                        }
                    }
                }
            }
        },
        "/refresh_token": {
            "post": {
                "description": "Request Refresh Token",
                "consumes": [
                    "multipart/form-data"
                ],
                "tags": [
                    "Oauth2"
                ],
                "summary": "Request Refresh Token",
                "parameters": [
                    {
                        "enum": [
                            "refresh_token"
                        ],
                        "type": "string",
                        "description": "Grant Type",
                        "name": "grant_type",
                        "in": "query",
                        "required": true
                    },
                    {
                        "type": "string",
                        "description": "Client ID",
                        "name": "client_id",
                        "in": "formData",
                        "required": true
                    },
                    {
                        "type": "string",
                        "description": "Client Secret",
                        "name": "client_secret",
                        "in": "formData",
                        "required": true
                    },
                    {
                        "type": "string",
                        "description": "Refresh token",
                        "name": "refresh_token",
                        "in": "formData",
                        "required": true
                    }
                ],
                "responses": {
                    "200": {
                        "description": "OK",
                        "schema": {
                            "$ref": "#/definitions/model.ResponseToken"
                        }
                    },
                    "204": {
                        "description": "No Content",
                        "schema": {
                            "$ref": "#/definitions/lib.Response"
                        }
                    },
                    "400": {
                        "description": "Bad Request",
                        "schema": {
                            "$ref": "#/definitions/lib.Response"
                        }
                    },
                    "401": {
                        "description": "Unauthorized",
                        "schema": {
                            "$ref": "#/definitions/lib.Response"
                        }
                    },
                    "404": {
                        "description": "Not Found",
                        "schema": {
                            "$ref": "#/definitions/lib.Response"
                        }
                    },
                    "409": {
                        "description": "Conflict",
                        "schema": {
                            "$ref": "#/definitions/lib.Response"
                        }
                    },
                    "500": {
                        "description": "Internal Server Error",
                        "schema": {
                            "$ref": "#/definitions/lib.Response"
                        }
                    }
                }
            }
        },
        "/token": {
            "post": {
                "description": "Request Access Token",
                "consumes": [
                    "multipart/form-data"
                ],
                "tags": [
                    "Oauth2"
                ],
                "summary": "Request Access Token",
                "parameters": [
                    {
                        "enum": [
                            "password"
                        ],
                        "type": "string",
                        "description": "Grant Type",
                        "name": "grant_type",
                        "in": "query",
                        "required": true
                    },
                    {
                        "type": "string",
                        "description": "Client ID",
                        "name": "client_id",
                        "in": "formData",
                        "required": true
                    },
                    {
                        "type": "string",
                        "description": "Client Secret",
                        "name": "client_secret",
                        "in": "formData",
                        "required": true
                    },
                    {
                        "type": "string",
                        "description": "Username",
                        "name": "username",
                        "in": "formData",
                        "required": true
                    },
                    {
                        "type": "string",
                        "description": "Password",
                        "name": "password",
                        "in": "formData",
                        "required": true
                    }
                ],
                "responses": {
                    "200": {
                        "description": "OK",
                        "schema": {
                            "$ref": "#/definitions/model.ResponseToken"
                        }
                    },
                    "204": {
                        "description": "No Content",
                        "schema": {
                            "$ref": "#/definitions/lib.Response"
                        }
                    },
                    "400": {
                        "description": "Bad Request",
                        "schema": {
                            "$ref": "#/definitions/lib.Response"
                        }
                    },
                    "401": {
                        "description": "Unauthorized",
                        "schema": {
                            "$ref": "#/definitions/lib.Response"
                        }
                    },
                    "404": {
                        "description": "Not Found",
                        "schema": {
                            "$ref": "#/definitions/lib.Response"
                        }
                    },
                    "409": {
                        "description": "Conflict",
                        "schema": {
                            "$ref": "#/definitions/lib.Response"
                        }
                    },
                    "500": {
                        "description": "Internal Server Error",
                        "schema": {
                            "$ref": "#/definitions/lib.Response"
                        }
                    }
                }
            }
        }
    },
    "definitions": {
        "lib.Response": {
            "type": "object",
            "properties": {
                "message": {
                    "description": "response message",
                    "type": "string"
                },
                "status": {
                    "description": "http status",
                    "type": "integer"
                }
            }
        },
        "model.ResponseToken": {
            "type": "object",
            "properties": {
                "access_token": {
                    "type": "string"
                },
                "expires_in": {
                    "type": "integer"
                },
                "refresh_token": {
                    "type": "string"
                },
                "scope": {
                    "type": "string"
                },
                "token_type": {
                    "type": "string"
                }
            }
        }
    },
    "securityDefinitions": {
        "OAuth2Password": {
            "type": "oauth2",
            "flow": "password",
            "tokenUrl": "http://localhost:9096/api/v1/oauth/token",
            "scopes": {
                "admin": " Grants read and write access to administrative information",
                "read": " Grants read access",
                "write": " Grants write access"
            }
        }
    }
}