{
"type": "FeatureCollection",
"name": "Terminals",
"crs": { "type": "name", "properties": { "name": "urn:ogc:def:crs:OGC:1.3:CRS84" } },
"features": [
{ "type": "Feature", "properties": { "gid": 2, "name": "Linda" }, "geometry": { "type": "MultiPolygon", "coordinates": [ [ [ [ 28.23596, -15.52856 ], [ 28.235674, -15.52902 ], [ 28.236341, -15.529066 ], [ 28.23677, -15.528468 ], [ 28.23596, -15.52856 ] ] ] ] } },
{ "type": "Feature", "properties": { "gid": 3, "name": "Bauleni" }, "geometry": { "type": "MultiPolygon", "coordinates": [ [ [ [ 28.379352051462494, -15.447352103815842 ], [ 28.379155723143128, -15.447371938757891 ], [ 28.37915016143436, -15.447306000970228 ], [ 28.379187981053956, -15.447245423959822 ], [ 28.379240261116333, -15.447239527081749 ], [ 28.379286423299082, -15.447278660905777 ], [ 28.379340928044961, -15.447273836188142 ], [ 28.379352051462494, -15.447352103815842 ] ] ] ] } },
{ "type": "Feature", "properties": { "gid": 4, "name": "Kulima Tower" }, "geometry": { "type": "MultiPolygon", "coordinates": [ [ [ [ 28.280018227858307, -15.425367164182063 ], [ 28.279643864489071, -15.422908506302916 ], [ 28.279913190654014, -15.422866965898619 ], [ 28.279945509793805, -15.423111015654859 ], [ 28.280597279112971, -15.423001972182192 ], [ 28.28065114434596, -15.423292754648733 ], [ 28.281157477536055, -15.423170729913249 ], [ 28.281477975672335, -15.425151675795773 ], [ 28.280018227858307, -15.425367164182063 ] ] ] ] } },
{ "type": "Feature", "properties": { "gid": 5, "name": "City Market" }, "geometry": { "type": "MultiPolygon", "coordinates": [ [ [ [ 28.27728591391498, -15.421027496541425 ], [ 28.278077732839911, -15.420866525970713 ], [ 28.277821872983218, -15.419532023209699 ], [ 28.277067759721366, -15.419646261135671 ], [ 28.27728591391498, -15.421027496541425 ] ] ] ] } },
{ "type": "Feature", "properties": { "gid": 6, "name": "Town (Millenium)" }, "geometry": { "type": "MultiPolygon", "coordinates": [ [ [ [ 28.279752604928142, -15.414231249457693 ], [ 28.279051010268461, -15.414333806578767 ], [ 28.279010611343725, -15.414032626028652 ], [ 28.279705472849276, -15.413952138049099 ], [ 28.279752604928142, -15.414231249457693 ] ] ] ] } },
{ "type": "Feature", "properties": { "gid": 7, "name": "Town (Lumumba)" }, "geometry": { "type": "MultiPolygon", "coordinates": [ [ [ [ 28.276862870953032, -15.41341015844025 ], [ 28.276935589017562, -15.413843755737666 ], [ 28.275551252529752, -15.414080026938105 ], [ 28.275796339339848, -15.415588521346548 ], [ 28.275634743640879, -15.415604099544925 ], [ 28.275351951167675, -15.413672394039621 ], [ 28.276862870953032, -15.41341015844025 ] ] ] ] } },
{ "type": "Feature", "properties": { "gid": 9, "name": "Makeni Konga" }, "geometry": { "type": "MultiPolygon", "coordinates": [ [ [ [ 28.164547056708631, -15.492435593741609 ], [ 28.16452499586152, -15.492249493171586 ], [ 28.164756125659704, -15.492223327875896 ], [ 28.164787350243312, -15.492329624369026 ], [ 28.164547056708631, -15.492435593741609 ] ] ] ] } },
{ "type": "Feature", "properties": { "gid": 12, "name": "Mbasela" }, "geometry": { "type": "MultiPolygon", "coordinates": [ [ [ [ 28.240364115196247, -15.426865884772003 ], [ 28.240267341463753, -15.426791898477513 ], [ 28.240222847793635, -15.42694308783379 ], [ 28.240297374691078, -15.426976864164299 ], [ 28.240364115196247, -15.426865884772003 ] ] ] ] } },
{ "type": "Feature", "properties": { "gid": 14, "name": "Arcades Mall" }, "geometry": { "type": "MultiPolygon", "coordinates": [ [ [ [ 28.319926861832801, -15.391543011518811 ], [ 28.319857340473252, -15.391481345797954 ], [ 28.319946327813465, -15.391386434174523 ], [ 28.320025304077916, -15.391434694327438 ], [ 28.319926861832801, -15.391543011518811 ] ] ] ] } },
{ "type": "Feature", "properties": { "gid": 17, "name": "Kabanana" }, "geometry": { "type": "MultiPolygon", "coordinates": [ [ [ [ 28.321008, -15.331183 ], [ 28.321323, -15.330976 ], [ 28.321383, -15.331063 ], [ 28.321019, -15.331275 ], [ 28.321008, -15.331183 ] ] ] ] } },
{ "type": "Feature", "properties": { "gid": 18, "name": "Ngombe Mine-stone " }, "geometry": { "type": "MultiPolygon", "coordinates": [ [ [ [ 28.328464, -15.363648 ], [ 28.328405, -15.363734 ], [ 28.328482, -15.363797 ], [ 28.328554, -15.363688 ], [ 28.328464, -15.363648 ] ] ] ] } },
{ "type": "Feature", "properties": { "gid": 19, "name": "Lilanda" }, "geometry": { "type": "MultiPolygon", "coordinates": [ [ [ [ 28.242824, -15.378455 ], [ 28.243208, -15.378526 ], [ 28.243299, -15.378316 ], [ 28.242911, -15.378211 ], [ 28.242824, -15.378455 ] ] ], [ [ [ 28.245148, -15.361574 ], [ 28.245065, -15.361747 ], [ 28.245243, -15.361827 ], [ 28.245374, -15.361643 ], [ 28.245148, -15.361574 ] ] ] ] } },
{ "type": "Feature", "properties": { "gid": 20, "name": "Maplot (Chipata)" }, "geometry": { "type": "MultiPolygon", "coordinates": [ [ [ [ 28.309437, -15.355814 ], [ 28.309312, -15.355694 ], [ 28.309389, -15.355625 ], [ 28.309532, -15.355763 ], [ 28.309437, -15.355814 ] ] ] ] } },
{ "type": "Feature", "properties": { "gid": 21, "name": "Chilanga" }, "geometry": { "type": "MultiPolygon", "coordinates": [ [ [ [ 28.271755, -15.569838 ], [ 28.271856, -15.569821 ], [ 28.271892, -15.569924 ], [ 28.271779, -15.569947 ], [ 28.271755, -15.569838 ] ] ] ] } },
{ "type": "Feature", "properties": { "gid": 22, "name": "Kamwala" }, "geometry": { "type": "MultiPolygon", "coordinates": [ [ [ [ 28.287105401821279, -15.424666117926011 ], [ 28.287082883448967, -15.424492459590454 ], [ 28.287949840782829, -15.424385065547115 ], [ 28.287990633338044, -15.424711049757869 ], [ 28.287934469675083, -15.424711049757869 ], [ 28.287893677119868, -15.424533240251797 ], [ 28.287105401821279, -15.424666117926011 ] ] ] ] } },
{ "type": "Feature", "properties": { "gid": 23, "name": "Mutendere" }, "geometry": { "type": "MultiPolygon", "coordinates": [ [ [ [ 28.355881, -15.402387 ], [ 28.355888, -15.402114 ], [ 28.355902, -15.401744 ], [ 28.356043, -15.401761 ], [ 28.356057, -15.402023 ], [ 28.356066, -15.402358 ], [ 28.355881, -15.402387 ] ] ] ] } },
{ "type": "Feature", "properties": { "gid": 24, "name": "City Shine" }, "geometry": { "type": "MultiPolygon", "coordinates": [ [ [ [ 28.204006, -15.39934 ], [ 28.203796, -15.39934 ], [ 28.20371, -15.39905 ], [ 28.203753, -15.398719 ], [ 28.203985, -15.398674 ], [ 28.204101, -15.398731 ], [ 28.204178, -15.398905 ], [ 28.204152, -15.399112 ], [ 28.204139, -15.399141 ], [ 28.204006, -15.39934 ] ] ] ] } },
{ "type": "Feature", "properties": { "gid": 25, "name": "Middle West" }, "geometry": { "type": "MultiPolygon", "coordinates": [ [ [ [ 28.198268, -15.391806 ], [ 28.198197, -15.391995 ], [ 28.198441, -15.392013 ], [ 28.198465, -15.391932 ], [ 28.198268, -15.391806 ] ] ] ] } },
{ "type": "Feature", "properties": { "gid": 26, "name": "Chainda" }, "geometry": { "type": "MultiPolygon", "coordinates": [ [ [ [ 28.4091, -15.38945 ], [ 28.408981, -15.389622 ], [ 28.409357, -15.389726 ], [ 28.409434, -15.389559 ], [ 28.4091, -15.38945 ] ] ] ] } },
{ "type": "Feature", "properties": { "gid": 28, "name": "Twin Park" }, "geometry": { "type": "MultiPolygon", "coordinates": [ [ [ [ 28.234669, -15.399413 ], [ 28.234657, -15.399563 ], [ 28.234764, -15.399649 ], [ 28.234836, -15.399482 ], [ 28.234669, -15.399413 ] ] ] ] } },
{ "type": "Feature", "properties": { "gid": 29, "name": "Chunga" }, "geometry": { "type": "MultiPolygon", "coordinates": [ [ [ [ 28.251694, -15.354548 ], [ 28.251706, -15.354767 ], [ 28.25192, -15.354721 ], [ 28.25192, -15.354514 ], [ 28.251694, -15.354548 ] ] ] ] } },
{ "type": "Feature", "properties": { "gid": 30, "name": "Eden (Zingalume)" }, "geometry": { "type": "MultiPolygon", "coordinates": [ [ [ [ 28.232914776169519, -15.362962378797196 ], [ 28.23263448483759, -15.362882471200134 ], [ 28.232647890075206, -15.362838992053581 ], [ 28.2329294000651, -15.362921249890771 ], [ 28.232914776169519, -15.362962378797196 ] ] ] ] } },
{ "type": "Feature", "properties": { "gid": 31, "name": "Daina Kaimba (Zingalume)" }, "geometry": { "type": "MultiPolygon", "coordinates": [ [ [ [ 28.243751692122391, -15.353581840346029 ], [ 28.243519537780077, -15.353470199703862 ], [ 28.243570721414606, -15.353387350557115 ], [ 28.243800438440985, -15.353493115419493 ], [ 28.243751692122391, -15.353581840346029 ] ] ] ] } },
{ "type": "Feature", "properties": { "gid": 32, "name": "Woodlands" }, "geometry": { "type": "MultiPolygon", "coordinates": [ [ [ [ 28.356964, -15.447357 ], [ 28.356842, -15.447151 ], [ 28.356733, -15.446998 ], [ 28.356834, -15.44691 ], [ 28.356982, -15.447108 ], [ 28.357085, -15.447311 ], [ 28.356964, -15.447357 ] ] ], [ [ [ 28.346541, -15.447117 ], [ 28.346702, -15.447031 ], [ 28.346786, -15.447186 ], [ 28.346583, -15.447284 ], [ 28.346541, -15.447117 ] ] ] ] } },
{ "type": "Feature", "properties": { "gid": 33, "name": "Kwa Jack" }, "geometry": { "type": "MultiPolygon", "coordinates": [ [ [ [ 28.294842, -15.473285 ], [ 28.295051, -15.473217 ], [ 28.295236, -15.473274 ], [ 28.295325, -15.473446 ], [ 28.295355, -15.473573 ], [ 28.295313, -15.473705 ], [ 28.295152, -15.473843 ], [ 28.29495, -15.473854 ], [ 28.294765, -15.473779 ], [ 28.294688, -15.47359 ], [ 28.294723, -15.473395 ], [ 28.294842, -15.473285 ] ] ] ] } },
{ "type": "Feature", "properties": { "gid": 34, "name": "Chilenje" }, "geometry": { "type": "MultiPolygon", "coordinates": [ [ [ [ 28.335539, -15.447557 ], [ 28.335813, -15.447494 ], [ 28.335879, -15.447603 ], [ 28.335736, -15.447741 ], [ 28.335533, -15.447672 ], [ 28.335539, -15.447557 ] ] ] ] } },
{ "type": "Feature", "properties": { "gid": 35, "name": "Chelstone" }, "geometry": { "type": "MultiPolygon", "coordinates": [ [ [ [ 28.386016, -15.367006 ], [ 28.385856, -15.367213 ], [ 28.385981, -15.367316 ], [ 28.386148, -15.367069 ], [ 28.386016, -15.367006 ] ] ] ] } },
{ "type": "Feature", "properties": { "gid": 36, "name": "Apex " }, "geometry": { "type": "MultiPolygon", "coordinates": [ [ [ [ 28.313342, -15.492865 ], [ 28.313294, -15.493049 ], [ 28.313473, -15.493095 ], [ 28.313545, -15.492888 ], [ 28.313342, -15.492865 ] ] ], [ [ [ 28.324713, -15.503687 ], [ 28.32457, -15.503807 ], [ 28.324641, -15.503894 ], [ 28.324814, -15.503761 ], [ 28.324713, -15.503687 ] ] ] ] } },
{ "type": "Feature", "properties": { "gid": 37, "name": "Zesco Munyaule" }, "geometry": { "type": "MultiPolygon", "coordinates": [ [ [ [ 28.342161, -15.485207 ], [ 28.342149, -15.4855 ], [ 28.34231, -15.485391 ], [ 28.342316, -15.485282 ], [ 28.342161, -15.485207 ] ] ] ] } },
{ "type": "Feature", "properties": { "gid": 38, "name": "Villa Park" }, "geometry": { "type": "MultiPolygon", "coordinates": [ [ [ [ 28.220873, -15.439825 ], [ 28.220915, -15.43975 ], [ 28.221004, -15.439808 ], [ 28.220927, -15.439923 ], [ 28.220873, -15.439825 ] ] ] ] } },
{ "type": "Feature", "properties": { "gid": 39, "name": "Zanimuone" }, "geometry": { "type": "MultiPolygon", "coordinates": [ [ [ [ 28.276282, -15.341197 ], [ 28.276282, -15.341473 ], [ 28.276437, -15.341485 ], [ 28.276437, -15.341128 ], [ 28.276282, -15.341197 ] ] ] ] } },
{ "type": "Feature", "properties": { "gid": 40, "name": "Meanwood Mtumbi" }, "geometry": { "type": "MultiPolygon", "coordinates": [ [ [ [ 28.342361, -15.325229 ], [ 28.342254, -15.32539 ], [ 28.342397, -15.325482 ], [ 28.342516, -15.325321 ], [ 28.342361, -15.325229 ] ] ] ] } },
{ "type": "Feature", "properties": { "gid": 41, "name": "Ibex Hill" }, "geometry": { "type": "MultiPolygon", "coordinates": [ [ [ [ 28.394352, -15.399743 ], [ 28.394352, -15.399904 ], [ 28.394471, -15.399893 ], [ 28.394495, -15.39972 ], [ 28.394352, -15.399743 ] ] ] ] } },
{ "type": "Feature", "properties": { "gid": 42, "name": "Lilayi" }, "geometry": { "type": "MultiPolygon", "coordinates": [ [ [ [ 28.313824, -15.49087 ], [ 28.313741, -15.491054 ], [ 28.313896, -15.491123 ], [ 28.313956, -15.490905 ], [ 28.313824, -15.49087 ] ] ] ] } },
{ "type": "Feature", "properties": { "gid": 43, "name": "Sekelela" }, "geometry": { "type": "MultiPolygon", "coordinates": [ [ [ [ 28.131499, -15.364624 ], [ 28.131392, -15.364819 ], [ 28.131642, -15.364923 ], [ 28.131714, -15.364762 ], [ 28.131499, -15.364624 ] ] ] ] } },
{ "type": "Feature", "properties": { "gid": 44, "name": "Shifwankula" }, "geometry": { "type": "MultiPolygon", "coordinates": [ [ [ [ 28.235039, -15.324162 ], [ 28.234979, -15.324311 ], [ 28.235111, -15.324357 ], [ 28.235206, -15.324162 ], [ 28.235039, -15.324162 ] ] ] ] } },
{ "type": "Feature", "properties": { "gid": 45, "name": "Kasupe" }, "geometry": { "type": "MultiPolygon", "coordinates": [ [ [ [ 28.176042, -15.301634 ], [ 28.176376, -15.301381 ], [ 28.176662, -15.301726 ], [ 28.176257, -15.302025 ], [ 28.176042, -15.301634 ] ] ] ] } },
{ "type": "Feature", "properties": { "gid": 46, "name": "Shantumbu" }, "geometry": { "type": "MultiPolygon", "coordinates": [ [ [ [ 28.368995, -15.561785 ], [ 28.368918, -15.561911 ], [ 28.369061, -15.56198 ], [ 28.369156, -15.561854 ], [ 28.368995, -15.561785 ] ] ] ] } },
{ "type": "Feature", "properties": { "gid": 48, "name": "Kamwala South" }, "geometry": { "type": "MultiPolygon", "coordinates": [ [ [ [ 28.305819, -15.456708 ], [ 28.305736, -15.456748 ], [ 28.305747, -15.456881 ], [ 28.305896, -15.456892 ], [ 28.30595, -15.456789 ], [ 28.305914, -15.456685 ], [ 28.305819, -15.456708 ] ] ], [ [ [ 28.300665, -15.463926 ], [ 28.3006, -15.464006 ], [ 28.300671, -15.46411 ], [ 28.300796, -15.464024 ], [ 28.300665, -15.463926 ] ] ] ] } },
{ "type": "Feature", "properties": { "gid": 49, "name": "Chazanga" }, "geometry": { "type": "MultiPolygon", "coordinates": [ [ [ [ 28.290581, -15.345414 ], [ 28.290504, -15.345563 ], [ 28.290635, -15.345621 ], [ 28.290706, -15.345483 ], [ 28.290581, -15.345414 ] ] ] ] } },
{ "type": "Feature", "properties": { "gid": 50, "name": "Obama (Kamanga)" }, "geometry": { "type": "MultiPolygon", "coordinates": [ [ [ [ 28.375636, -15.351886 ], [ 28.375696, -15.351811 ], [ 28.375874, -15.351909 ], [ 28.375797, -15.352013 ], [ 28.375636, -15.351886 ] ] ] ] } },
{ "type": "Feature", "properties": { "gid": 51, "name": "Mandevu" }, "geometry": { "type": "MultiPolygon", "coordinates": [ [ [ [ 28.283748, -15.373087 ], [ 28.283826, -15.373116 ], [ 28.283802, -15.373225 ], [ 28.283701, -15.373196 ], [ 28.283748, -15.373087 ] ] ], [ [ [ 28.2769, -15.374369 ], [ 28.276805, -15.374397 ], [ 28.276906, -15.374587 ], [ 28.277001, -15.374564 ], [ 28.2769, -15.374369 ] ] ] ] } },
{ "type": "Feature", "properties": { "gid": 52, "name": "Garden Chilulu" }, "geometry": { "type": "MultiPolygon", "coordinates": [ [ [ [ 28.292558, -15.385432 ], [ 28.292522, -15.385283 ], [ 28.292665, -15.38526 ], [ 28.292736, -15.385489 ], [ 28.292558, -15.385432 ] ] ], [ [ [ 28.291032, -15.370371 ], [ 28.290985, -15.370509 ], [ 28.291151, -15.37059 ], [ 28.291247, -15.370394 ], [ 28.291032, -15.370371 ] ] ] ] } },
{ "type": "Feature", "properties": { "gid": 53, "name": "Zingalume" }, "geometry": { "type": "MultiPolygon", "coordinates": [ [ [ [ 28.233773320705819, -15.373271377078922 ], [ 28.233698982569962, -15.373234950420775 ], [ 28.233831816288131, -15.3729576375887 ], [ 28.233924434293463, -15.372994064295328 ], [ 28.233773320705819, -15.373271377078922 ] ] ] ] } },
{ "type": "Feature", "properties": { "gid": 54, "name": "Mass Media" }, "geometry": { "type": "MultiPolygon", "coordinates": [ [ [ [ 28.326887, -15.406797 ], [ 28.327238, -15.406769 ], [ 28.32725, -15.406872 ], [ 28.326875, -15.406889 ], [ 28.326887, -15.406797 ] ] ] ] } },
{ "type": "Feature", "properties": { "gid": 55, "name": "Kalingalinga" }, "geometry": { "type": "MultiPolygon", "coordinates": [ [ [ [ 28.337558, -15.409049 ], [ 28.337618, -15.408871 ], [ 28.337862, -15.408905 ], [ 28.337993, -15.408957 ], [ 28.337951, -15.409152 ], [ 28.337558, -15.409049 ] ] ] ] } },
{ "type": "Feature", "properties": { "gid": 56, "name": "Munali" }, "geometry": { "type": "MultiPolygon", "coordinates": [ [ [ [ 28.343191, -15.386856 ], [ 28.34306, -15.387258 ], [ 28.343144, -15.387293 ], [ 28.343293, -15.386867 ], [ 28.343191, -15.386856 ] ] ] ] } },
{ "type": "Feature", "properties": { "gid": 57, "name": "PF" }, "geometry": { "type": "MultiPolygon", "coordinates": [ [ [ [ 28.42359356835383, -15.284210851022879 ], [ 28.423294789595754, -15.284088208015662 ], [ 28.423344374155608, -15.283971697092349 ], [ 28.423639338716772, -15.28408943444609 ], [ 28.423639338716772, -15.28408943444609 ], [ 28.42359356835383, -15.284210851022879 ] ] ] ] } },
{ "type": "Feature", "properties": { "gid": 58, "name": "Hybrid" }, "geometry": { "type": "MultiPolygon", "coordinates": [ [ [ [ 28.36534, -15.380085 ], [ 28.365406, -15.380217 ], [ 28.365823, -15.38005 ], [ 28.365722, -15.37993 ], [ 28.365722, -15.37993 ], [ 28.36534, -15.380085 ] ] ] ] } },
{ "type": "Feature", "properties": { "gid": 59, "name": "UTH Hospital" }, "geometry": { "type": "MultiPolygon", "coordinates": [ [ [ [ 28.312539244081755, -15.431607386220104 ], [ 28.312166053423702, -15.431626686547423 ], [ 28.312162716398444, -15.431543051782752 ], [ 28.312535350885621, -15.431538226699141 ], [ 28.312539244081755, -15.431607386220104 ] ] ], [ [ [ 28.310871719638083, -15.439853745841724 ], [ 28.310722448253006, -15.43978870226699 ], [ 28.310797083945552, -15.439658615056338 ], [ 28.310939198483393, -15.439721687653508 ], [ 28.310871719638083, -15.439853745841724 ] ] ] ] } }
]
}
