{
    "attacking_loads": [
        56,
        57,
        58,
        59,
        60,
        61,
        62,
        63,
        93
    ],
    "attacking_sgens": [
        56,
        57,
        58,
        59,
        60,
        61,
        62,
        63,
        95
    ],
    "train_epis_length": 384,
    "steps_per_storage": 8,
    "load_actuators_only": true,
    "scaling_sgens": 1.0,
    "scaling_loads": 3.0,
    "action_penalty_factor": 0,
    "train_on_test": true
}