{
    "grid_id": "1-MV-rural--0-no_sw",
    "attacking_loads": [
        56,
        57,
        58,
        59,
        60,
        61,
        62,
        63,
        93
    ],
    "attacking_sgens": [
        56,
        57,
        58,
        59,
        60,
        61,
        62,
        63,
        95
    ],
    "train_epis_length": 384,
    "steps_per_storage": 6,
    "load_actuators_only": true,
    "prevent_underflow": true,
    "prevent_overflow": true,
    "scaling_sgens": 1.0,
    "scaling_loads": 3.0,
    "n_past_obs": 3,
    "action_penalty_factor": 3,
    "test_episodes": [
        [
            -1,
            671
        ],
        [
            3000,
            3672
        ],
        [
            6000,
            6672
        ],
        [
            9000,
            9672
        ],
        [
            12000,
            12672
        ],
        [
            15000,
            15672
        ],
        [
            18000,
            18672
        ],
        [
            21000,
            21672
        ],
        [
            24000,
            24672
        ],
        [
            27000,
            27672
        ],
        [
            30000,
            30672
        ],
        [
            33000,
            33672
        ]
    ],
    "train_on_test": false,
    "seed": 16760726
}