{
    "sw-cms": {
        "blocks": {
            "text": {
                "twoColBannerElement": {
                    "label": "Custom Banner with Image"
                },
                "twoColBanner": {
                    "label": "2 Banner"
                }
            },
            "text-image": {
	            "threeColIconElement": {
                    "label": "3 Spalter mit Icon"
                }
            }
        },
        "elements": {
	        "twoColBannerElement": {
		        "label": "Label für Banner",
		        "config": {
			        "label": {
				        "content": "Text",
				        "horizontalAlign": "Horizontal Align",
				        "horizontalAlignLeft": "Left",
				        "horizontalAlignCenter": "Center",
				        "horizontalAlignRight": "Right",
				        "horizontalAlignBetween":"Zwischenraum",
				        "horizontalAlignAround":"Platz drum herum",
				        "verticalAlign": "Vertical Align",
				        "verticalAlignTop": "Oben",
				        "verticalAlignCenter": "Mitte",
				        "verticalAlignBottom": "Unten",
				        "linkTo": "Button Link",
				        "iconName": "Icon Name",
				        "buttonText": "Button Text",
				        "bannerContent": "Inhalt",
				        "captionMediaUpload": "Beschriftung",
				        "image": "Bild",
				        "backgroundColor": "Hintergrund Farbe",
				        "textColor": "Schriftfarbe",
				        "primaryColor": "Hauptfarbe",
				        "secondColor": "Sekundäre Farbe",
				        "darkColor": "Dunkel",
				        "lightColor": "Hell",
				        "btnColor": "Button Farbe",
				        "headline": "Überschrift",
				        "bannerContentPlaceholder": "Content Placeholder"
			        },
			        "tab": {
				        "content": "Inhalt",
				        "settings": "Einstellungen"
			        },
			        "placeholder": {
			    	    "enterUrl": "URL einfügen"
		        	},
		        	"caption": {
			        	"mediaUpload":"Bild Upload"
		        	}
		        }
	        },
	        "threeColIconElement": {
		        "label": "Label 3 Spalter Element",
		        "config": {
			        "label": {
				       "headline": "Überschrift",
				       "iconName": "Icon Name",
				       "buttonText": "Button Text",
				       "linkTo": "Button Link",
				       "bannerContent": "Inhalt",
				       "image": "Bild"
			        },
			        "tab": {
				        "content": "Inhalt",
				        "settings": "Einstellungen"
			        },
			        "placeholder": {
			    	    "enterUrl": "URL einfügen",
			    	    "bannerContentPlaceholder": "Content Placeholder"
		        	}
		        }
		    },
		    "colors": {
			    "textColor": "Schriftfarbe",
				"primaryColor": "Hauptfarbe",
				"secondColor": "Sekundäre Farbe",
				"darkColor": "Dunkel",
				"lightColor": "Hell",
				"btnColor": "Button Farbe",
				"infoColor": "Info Farbe"
		    }
        }
    }
}
