<?xml version="1.0" encoding="UTF-8" standalone="no"?>
<!-- Created with Inkscape (http://www.inkscape.org/) -->

<svg
   xmlns:dc="http://purl.org/dc/elements/1.1/"
   xmlns:cc="http://creativecommons.org/ns#"
   xmlns:rdf="http://www.w3.org/1999/02/22-rdf-syntax-ns#"
   xmlns:svg="http://www.w3.org/2000/svg"
   xmlns="http://www.w3.org/2000/svg"
   xmlns:sodipodi="http://sodipodi.sourceforge.net/DTD/sodipodi-0.dtd"
   xmlns:inkscape="http://www.inkscape.org/namespaces/inkscape"
   width="3.697113mm"
   height="188.38167mm"
   viewBox="0 0 3.697113 188.38167"
   version="1.1"
   id="svg2891"
   inkscape:version="0.92.3 (2405546, 2018-03-11)"
   sodipodi:docname="verical-divider-edit.svg">
  <defs
     id="defs2885" />
  <sodipodi:namedview
     id="base"
     pagecolor="#ffffff"
     bordercolor="#666666"
     borderopacity="1.0"
     inkscape:pageopacity="0.0"
     inkscape:pageshadow="2"
     inkscape:zoom="0.7"
     inkscape:cx="-355.87031"
     inkscape:cy="324.56828"
     inkscape:document-units="mm"
     inkscape:current-layer="layer1"
     showgrid="false"
     fit-margin-top="0"
     fit-margin-left="0"
     fit-margin-right="0"
     fit-margin-bottom="0"
     inkscape:window-width="1600"
     inkscape:window-height="836"
     inkscape:window-x="0"
     inkscape:window-y="27"
     inkscape:window-maximized="1" />
  <metadata
     id="metadata2888">
    <rdf:RDF>
      <cc:Work
         rdf:about="">
        <dc:format>image/svg+xml</dc:format>
        <dc:type
           rdf:resource="http://purl.org/dc/dcmitype/StillImage" />
        <dc:title></dc:title>
      </cc:Work>
    </rdf:RDF>
  </metadata>
  <g
     inkscape:label="Layer 1"
     inkscape:groupmode="layer"
     id="layer1"
     transform="translate(-112.30021,-46.327028)">
    <path
       style="opacity:1;fill:#1a1a1a;fill-opacity:1;stroke:#080200;stroke-width:0.2;stroke-linecap:round;stroke-linejoin:round;stroke-miterlimit:4;stroke-dasharray:none;stroke-dashoffset:0;stroke-opacity:1"
       d="m 115.52155,233.59619 c -2.54593,-14.46576 -0.56094,-29.2144 -1.10665,-43.80438 -0.005,-33.45181 1.41167,-66.89636 0.51956,-100.349064 -0.35834,-14.268291 -0.28608,-28.610402 -2.5099,-42.748117 0.46243,0.619407 1.41534,8.579282 1.73581,12.65974 1.44637,23.705558 1.36593,47.485051 1.35555,71.229471 -0.4723,26.43345 -0.85798,52.868 -0.8496,79.30591 -0.0722,8.25117 -0.42447,16.57956 1.23102,24.71903 -0.12525,-0.33752 -0.25074,-0.67521 -0.37579,-1.01259 z"
       id="path848"
       inkscape:connector-curvature="0" />
  </g>
</svg>
