[
  {
    "id": "dc0cdc26-0200-46ba-9d05-e4d4db110c40",
    "section": "Tech",
    "title": "Use Cases",
    "path": "tech/use-cases",
    "position": 2
  },
  {
    "id": "f6df3be4-ea0e-4cab-9ac2-c1df0c1fbe23",
    "section": "About",
    "title": "Contact Us",
    "path": "about/contact",
    "position": 1
  },
  {
    "id": "9a61bde3-a7f5-4d4b-a86a-406cf2430174",
    "section": "CDR Link",
    "title": "Intro",
    "path": "tech/link",
    "position": 1
  },
  {
    "id": "748d8e7c-62f0-4468-bc80-efadb2f0414a",
    "section": "Welcome",
    "title": "Welcome",
    "path": "welcome",
    "position": 1
  },
  {
    "id": "e7203942-8c4a-40de-9cfb-080e4f452d90",
    "section": "Tech",
    "title": "Find the Tech for You",
    "path": "tech/find-tech",
    "position": 1
  },
  {
    "id": "29aa2167-eafb-495c-b56a-902443cdfae3",
    "section": "Leafcutter",
    "title": "About",
    "path": "leafcutter/about",
    "position": 19
  },
  {
    "id": "88311e84-968d-4460-890f-1ea54fdb8e18",
    "section": "CDR Link",
    "title": "Status and Updates ",
    "path": "link/updates",
    "position": 5
  },
  {
    "id": "80a7fe05-8e07-427e-ac9c-75eddc2f6d8b",
    "section": "CDR Link",
    "title": "Metamigo",
    "path": "link/channels/metamigo",
    "position": 13
  },
  {
    "id": "4f87bc13-8b55-485c-aa21-903ba2cd781c",
    "section": "Waterbear",
    "title": "Roles and Permissions",
    "path": "waterbear/permissions",
    "position": 4
  },
  {
    "id": "c80e6bba-1a05-4c18-a332-3a8e0f1de1ab",
    "section": "Waterbear",
    "title": "Web form",
    "path": "waterbear/web-form",
    "position": 5
  },
  {
    "id": "2d29f852-575a-490c-89b9-cc17ab82fd94",
    "section": "Waterbear",
    "title": "QA Tool",
    "path": "waterbear/qa-tool",
    "position": 3
  },
  {
    "id": "00cfac1a-a90e-422b-946c-f3a0782f9a47",
    "section": "Waterbear",
    "title": "Five Things to Know About Waterbear",
    "path": "waterbear/five-things",
    "position": 2
  },
  {
    "id": "8b99b22f-48c8-47e9-ba25-0f570a41f9fe",
    "section": "Waterbear",
    "title": "About",
    "path": "waterbear/about",
    "position": 1
  },
  {
    "id": "3d08b049-03f3-4e64-b361-116329e7da7f",
    "section": "CDR Link",
    "title": "WhatsApp",
    "path": "link/channels/whatsapp",
    "position": 18
  },
  {
    "id": "ae610ec6-805b-46f2-aa6d-d96d032b0445",
    "section": "CDR Link",
    "title": "Web",
    "path": "link/channels/web",
    "position": 17
  },
  {
    "id": "1a87b5ec-fcb7-4765-b848-ce510ae9708f",
    "section": "CDR Link",
    "title": "Signal",
    "path": "link/channels/signal",
    "position": 14
  },
  {
    "id": "3f1d3f78-28ba-4856-8738-f5bb7373e054",
    "section": "CDR Link",
    "title": "Facebook",
    "path": "link/channels/facebook",
    "position": 11
  },
  {
    "id": "4e53c167-ae3a-469a-941f-dda45062ee05",
    "section": "CDR Link",
    "title": "Forms",
    "path": "link/channels/forms",
    "position": 12
  },
  {
    "id": "9581ee00-3231-46bf-94bc-e9392c1b614e",
    "section": "CDR Link",
    "title": "Twitter",
    "path": "link/channels/twitter",
    "position": 16
  },
  {
    "id": "d9ef3696-8bde-48d8-bcd7-f124d24ee1a4",
    "section": "CDR Link",
    "title": "Telegram",
    "path": "link/channels/telegram",
    "position": 15
  },
  {
    "id": "53564f04-680b-44e9-a4e6-986ac3a47f49",
    "section": "CDR Link",
    "title": "Email",
    "path": "link/channels/email",
    "position": 10
  },
  {
    "id": "ace0df41-f8a1-4b1f-baaa-67b1815f85e9",
    "section": "CDR Link",
    "title": "Chat",
    "path": "link/channels/chat",
    "position": 9
  },
  {
    "id": "cfa69d1d-d417-465a-b84c-7cdbc9a8d411",
    "section": "CDR Link",
    "title": "Channels",
    "path": "link/channels",
    "position": 8
  },
  {
    "id": "685daaca-f79e-4373-96db-90585cec1fa1",
    "section": "CDR Link",
    "title": "FAQ",
    "path": "link/faq",
    "position": 7
  },
  {
    "id": "d0427833-0413-496d-9260-774246ce8931",
    "section": "CDR Link",
    "title": "Five Things to Know about CDR Link",
    "path": "link/five-things",
    "position": 4
  },
  {
    "id": "683040ae-54ca-4e26-9aae-c8a0ea3f7ffa",
    "section": "CDR Link",
    "title": "About",
    "path": "link/about",
    "position": 2
  },
  {
    "id": "7526b44a-9ac7-4050-ab9f-c1cc222667a8",
    "section": "CDR Link",
    "title": "Demo Instructions",
    "path": "link/demo",
    "position": 6
  },
  {
    "id": "9fae9f6e-b130-45f4-9c58-e02ec79dadaf",
    "section": "About",
    "title": "End-User License Agreement",
    "path": "about/eula",
    "position": 2
  },
  {
    "id": "b2fda554-d8f1-42c2-9a67-078806be3823",
    "section": "About",
    "title": "Privacy Policy",
    "path": "about/privacy",
    "position": 3
  }
]
