﻿"Locale","Provider","Voice","Price"
"Arabic (arb)","Amazon Polly","Zeina","No Charge"
"Welsh (cy-GB)","Amazon Polly","Gwyneth","No Charge"
"Danish (da-DK)","Amazon Polly","Naja","No Charge"
"German (de-DE)","Amazon Polly","Marlene","No Charge"
"English (US) (en-US)","Amazon Polly","Salli","No Charge"
"English (Australian) (en-AU)","Amazon Polly","Nicole","No Charge"
"English (British) (en-GB)","Amazon Polly","Amy","No Charge"
"English (Welsh) (en-GB-WLS)","Amazon Polly","Geraint","No Charge"
"English (Indian) (en-IN)","Amazon Polly","Aditi","No Charge"
"Spanish (Castilian) (es-ES)","Amazon Polly","Conchita","No Charge"
"Spanish (Mexico) (es-MX)","Amazon Polly","Mia","No Charge"
"Spanish (Latin American) (es-US)","Amazon Polly","Penelope","No Charge"
"French (Canadian) (fr-CA)","Amazon Polly","Chantal","No Charge"
"French (fr-FR)","Amazon Polly","Celine","No Charge"
"Hindi (hi-IN)","Amazon Polly","Aditi","No Charge"
"Icelandic (is-IS)","Amazon Polly","Dora","No Charge"
"Italian (it-IT)","Amazon Polly","Carla","No Charge"
"Japanese (ja-JP)","Amazon Polly","Mizuki","No Charge"
"Korean (ko-KR)","Amazon Polly","Seoyeon","No Charge"
"Norwegian (nb-NO)","Amazon Polly","Liv","No Charge"
"Dutch (nl-NL)","Amazon Polly","Lotte","No Charge"
"Polish (pl-PL)","Amazon Polly","Ewa","No Charge"
"Portuguese (Brazilian) (pt-BR)","Amazon Polly","Vitoria","No Charge"
"Portuguese (European) (pt-PT)","Amazon Polly","Ines","No Charge"
"Romanian (ro-RO)","Amazon Polly","Carmen","No Charge"
"Russian (ru-RU)","Amazon Polly","Tatyana","No Charge"
"Swedish (sv-SE)","Amazon Polly","Astrid","No Charge"
"Turkish (tr-TR)","Amazon Polly","Filiz","No Charge"
"Chinese (Mandarin) (zh-CN)","Amazon Polly","Zhiyu","No Charge"
