{
  "title": "VerticalBar",
  "type": "histogram",
  "aggs": [
    {
      "id": "1",
      "enabled": true,
      "type": "count",
      "params": {},
      "schema": "metric"
    },
    {
      "id": "2",
      "enabled": true,
      "type": "terms",
      "params": {
        "field": "actor.keyword",
        "orderBy": "1",
        "order": "desc",
        "size": 10,
        "otherBucket": false,
        "otherBucketLabel": "Other",
        "missingBucket": false,
        "missingBucketLabel": "Missing"
      },
      "schema": "segment"
    }
  ],
  "params": {
    "type": "histogram",
    "grid": { "categoryLines": false },
    "categoryAxes": [
      {
        "id": "CategoryAxis-1",
        "type": "category",
        "position": "bottom",
        "show": true,
        "style": {},
        "scale": { "type": "linear" },
        "labels": { "show": true, "filter": true, "truncate": 100 },
        "title": {}
      }
    ],
    "valueAxes": [
      {
        "id": "ValueAxis-1",
        "name": "LeftAxis-1",
        "type": "value",
        "position": "left",
        "show": true,
        "style": {},
        "scale": { "type": "linear", "mode": "normal" },
        "labels": {
          "show": true,
          "rotate": 0,
          "filter": false,
          "truncate": 100
        },
        "title": { "text": "Count" }
      }
    ],
    "seriesParams": [
      {
        "show": true,
        "type": "histogram",
        "mode": "normal",
        "data": { "label": "Count", "id": "1" },
        "valueAxis": "ValueAxis-1",
        "drawLinesBetweenPoints": true,
        "lineWidth": 2,
        "showCircles": true
      }
    ],
    "addTooltip": true,
    "addLegend": true,
    "legendPosition": "right",
    "times": [],
    "addTimeMarker": false,
    "labels": { "show": false },
    "thresholdLine": {
      "show": false,
      "value": 10,
      "width": 1,
      "style": "full",
      "color": "#E7664C"
    }
  }
}
