<?xml version="1.0" encoding="UTF-8"?>
<!DOCTYPE svg PUBLIC '-//W3C//DTD SVG 1.0//EN'
          'http://www.w3.org/TR/2001/REC-SVG-20010904/DTD/svg10.dtd'>
<svg fill-opacity="1" xmlns:xlink="http://www.w3.org/1999/xlink" color-rendering="auto" color-interpolation="auto" text-rendering="auto" stroke="black" stroke-linecap="square" stroke-miterlimit="10" shape-rendering="auto" stroke-opacity="1" fill="black" stroke-dasharray="none" font-weight="normal" stroke-width="1" viewBox="0 0 151 211" xmlns="http://www.w3.org/2000/svg" font-family="'Dialog'" font-style="normal" stroke-linejoin="miter" font-size="12px" stroke-dashoffset="0" image-rendering="auto"
><!--Generated by Archi with Batik SVG Generator--><defs id="genericDefs"
  /><g
  ><defs id="defs1"
    ><clipPath clipPathUnits="userSpaceOnUse" id="clipPath1"
      ><path d="M9 119 L142 119 L142 202 L9 202 L9 119 Z"
      /></clipPath
      ><clipPath clipPathUnits="userSpaceOnUse" id="clipPath2"
      ><path d="M22 123 L128 123 L128 198 L22 198 L22 123 Z"
      /></clipPath
      ><clipPath clipPathUnits="userSpaceOnUse" id="clipPath3"
      ><path d="M9 9 L142 9 L142 92 L9 92 L9 9 Z"
      /></clipPath
      ><clipPath clipPathUnits="userSpaceOnUse" id="clipPath4"
      ><path d="M29 42 L121 42 L121 59 L29 59 L29 42 Z"
      /></clipPath
      ><clipPath clipPathUnits="userSpaceOnUse" id="clipPath5"
      ><path d="M59 78 L88 78 L88 132 L59 132 L59 78 Z"
      /></clipPath
      ><clipPath clipPathUnits="userSpaceOnUse" id="clipPath6"
      ><path d="M69 88 L78 88 L78 102 L69 102 L69 88 Z"
      /></clipPath
    ></defs
    ><g fill="rgb(202,181,234)" text-rendering="optimizeLegibility" stroke-miterlimit="0" stroke-width="0" stroke="rgb(202,181,234)" stroke-linejoin="round"
    ><path d="M20 120 L127 120 L137 130 L137 187 L127 197 L20 197 L10 187 L10 130 L20 120" fill-rule="evenodd" clip-path="url(#clipPath1)" stroke="none"
    /></g
    ><g fill="rgb(141,126,163)" text-rendering="optimizeLegibility" stroke-width="3" stroke-linecap="butt" stroke="rgb(141,126,163)"
    ><polygon fill="none" points=" 20 120 127 120 137 130 137 187 127 197 20 197 10 187 10 130" clip-path="url(#clipPath1)"
      /><polygon fill="none" stroke-width="1" clip-path="url(#clipPath1)" points=" 120 128 132 128 128 137 116 137" stroke="black"
      /><path fill="black" d="M27.9531 133.625 L27.9531 132.625 L31.5781 132.6094 L31.5781 135.7969 Q30.75 136.4688 29.8594 136.8125 Q28.9688 137.1406 28.0312 137.1406 Q26.7656 137.1406 25.7188 136.6094 Q24.6875 136.0625 24.1562 135.0469 Q23.6406 134.0156 23.6406 132.75 Q23.6406 131.4844 24.1562 130.4062 Q24.6875 129.3125 25.6719 128.7969 Q26.6562 128.2656 27.9375 128.2656 Q28.875 128.2656 29.625 128.5625 Q30.375 128.8594 30.7969 129.4062 Q31.2344 129.9375 31.4531 130.8125 L30.4375 131.0938 Q30.2344 130.4375 29.9375 130.0625 Q29.6562 129.6875 29.125 129.4688 Q28.5938 129.2344 27.9531 129.2344 Q27.1719 129.2344 26.5938 129.4688 Q26.0312 129.7031 25.6719 130.0938 Q25.3281 130.4844 25.1406 130.9531 Q24.8125 131.75 24.8125 132.6719 Q24.8125 133.8281 25.2031 134.6094 Q25.6094 135.375 26.3594 135.75 Q27.1094 136.125 27.9688 136.125 Q28.7031 136.125 29.4062 135.8438 Q30.1094 135.5469 30.4688 135.2344 L30.4688 133.625 L27.9531 133.625 ZM37.3809 135 L38.4746 135.125 Q38.2246 136.0781 37.5215 136.6094 Q36.8184 137.1406 35.7402 137.1406 Q34.3809 137.1406 33.5684 136.2969 Q32.7715 135.4531 32.7715 133.9375 Q32.7715 132.375 33.584 131.5156 Q34.3965 130.6406 35.6777 130.6406 Q36.9277 130.6406 37.709 131.4844 Q38.5059 132.3281 38.5059 133.875 Q38.5059 133.9688 38.5059 134.1562 L33.8652 134.1562 Q33.9277 135.1875 34.4434 135.7344 Q34.959 136.2656 35.7402 136.2656 Q36.3184 136.2656 36.7246 135.9688 Q37.1465 135.6562 37.3809 135 ZM33.9277 133.2969 L37.3965 133.2969 Q37.334 132.5 37.0059 132.1094 Q36.4902 131.5 35.6934 131.5 Q34.959 131.5 34.459 131.9844 Q33.9746 132.4688 33.9277 133.2969 ZM43.8359 137 L43.8359 136.2188 Q43.2422 137.1406 42.1016 137.1406 Q41.3516 137.1406 40.7266 136.7344 Q40.1016 136.3125 39.7578 135.5781 Q39.4141 134.8438 39.4141 133.8906 Q39.4141 132.9688 39.7266 132.2031 Q40.0391 131.4375 40.6641 131.0469 Q41.2891 130.6406 42.0547 130.6406 Q42.6172 130.6406 43.0547 130.875 Q43.4922 131.1094 43.7734 131.4844 L43.7734 128.4062 L44.8203 128.4062 L44.8203 137 L43.8359 137 ZM40.5078 133.8906 Q40.5078 135.0938 41.0078 135.6875 Q41.5078 136.2656 42.1953 136.2656 Q42.8828 136.2656 43.3672 135.7031 Q43.8516 135.1406 43.8516 133.9844 Q43.8516 132.7031 43.3516 132.1094 Q42.8672 131.5156 42.1484 131.5156 Q41.4453 131.5156 40.9766 132.0938 Q40.5078 132.6562 40.5078 133.8906 ZM46.0879 133.8906 Q46.0879 132.1562 47.041 131.3281 Q47.8379 130.6406 48.9941 130.6406 Q50.2754 130.6406 51.0879 131.4844 Q51.916 132.3125 51.916 133.7969 Q51.916 135 51.5566 135.6875 Q51.1973 136.375 50.4941 136.7656 Q49.8066 137.1406 48.9941 137.1406 Q47.6973 137.1406 46.8848 136.3125 Q46.0879 135.4688 46.0879 133.8906 ZM47.166 133.8906 Q47.166 135.0781 47.6816 135.6719 Q48.2129 136.2656 48.9941 136.2656 Q49.791 136.2656 50.3066 135.6719 Q50.8223 135.0781 50.8223 133.8594 Q50.8223 132.7031 50.291 132.1094 Q49.7754 131.5156 48.9941 131.5156 Q48.2129 131.5156 47.6816 132.1094 Q47.166 132.6875 47.166 133.8906 ZM57.2148 134.7188 L58.2461 134.8594 Q58.0742 135.9219 57.3711 136.5312 Q56.668 137.1406 55.6523 137.1406 Q54.3711 137.1406 53.5898 136.3125 Q52.8242 135.4688 52.8242 133.9062 Q52.8242 132.9062 53.1523 132.1562 Q53.4961 131.3906 54.168 131.0156 Q54.8555 130.6406 55.668 130.6406 Q56.668 130.6406 57.3086 131.1562 Q57.9648 131.6562 58.1523 132.6094 L57.1211 132.7656 Q56.9805 132.1406 56.6055 131.8281 Q56.2305 131.5 55.6992 131.5 Q54.9023 131.5 54.4023 132.0781 Q53.9023 132.6406 53.9023 133.875 Q53.9023 135.1406 54.3867 135.7031 Q54.8711 136.2656 55.6367 136.2656 Q56.2617 136.2656 56.668 135.8906 Q57.0898 135.5156 57.2148 134.7188 ZM63.2305 137 L63.2305 136.0781 Q62.4961 137.1406 61.2461 137.1406 Q60.6992 137.1406 60.2148 136.9375 Q59.7461 136.7188 59.5117 136.4062 Q59.2773 136.0781 59.1836 135.6094 Q59.1211 135.3125 59.1211 134.625 L59.1211 130.7812 L60.1836 130.7812 L60.1836 134.2344 Q60.1836 135.0469 60.2461 135.3438 Q60.3398 135.75 60.6523 136 Q60.9805 136.2344 61.4648 136.2344 Q61.9336 136.2344 62.3398 136 Q62.7617 135.75 62.9336 135.3281 Q63.1211 134.9062 63.1211 134.1094 L63.1211 130.7812 L64.168 130.7812 L64.168 137 L63.2305 137 ZM65.8262 137 L65.8262 130.7812 L66.7637 130.7812 L66.7637 131.6562 Q67.0605 131.1875 67.5449 130.9219 Q68.0293 130.6406 68.6543 130.6406 Q69.3418 130.6406 69.7793 130.9219 Q70.2324 131.2031 70.4043 131.7188 Q71.1543 130.6406 72.3262 130.6406 Q73.2637 130.6406 73.748 131.1562 Q74.248 131.6562 74.248 132.7344 L74.248 137 L73.2012 137 L73.2012 133.0781 Q73.2012 132.4531 73.0918 132.1719 Q72.998 131.8906 72.7324 131.7188 Q72.4668 131.5469 72.0918 131.5469 Q71.4355 131.5469 70.998 131.9844 Q70.5762 132.4219 70.5762 133.3906 L70.5762 137 L69.5137 137 L69.5137 132.9531 Q69.5137 132.25 69.248 131.9062 Q68.998 131.5469 68.4199 131.5469 Q67.9668 131.5469 67.5918 131.7812 Q67.2168 132.0156 67.0449 132.4688 Q66.873 132.9219 66.873 133.7656 L66.873 137 L65.8262 137 ZM80.0723 135 L81.166 135.125 Q80.916 136.0781 80.2129 136.6094 Q79.5098 137.1406 78.4316 137.1406 Q77.0723 137.1406 76.2598 136.2969 Q75.4629 135.4531 75.4629 133.9375 Q75.4629 132.375 76.2754 131.5156 Q77.0879 130.6406 78.3691 130.6406 Q79.6191 130.6406 80.4004 131.4844 Q81.1973 132.3281 81.1973 133.875 Q81.1973 133.9688 81.1973 134.1562 L76.5566 134.1562 Q76.6191 135.1875 77.1348 135.7344 Q77.6504 136.2656 78.4316 136.2656 Q79.0098 136.2656 79.416 135.9688 Q79.8379 135.6562 80.0723 135 ZM76.6191 133.2969 L80.0879 133.2969 Q80.0254 132.5 79.6973 132.1094 Q79.1816 131.5 78.3848 131.5 Q77.6504 131.5 77.1504 131.9844 Q76.666 132.4688 76.6191 133.2969 ZM82.4961 137 L82.4961 130.7812 L83.4336 130.7812 L83.4336 131.6562 Q84.1211 130.6406 85.418 130.6406 Q85.9805 130.6406 86.4492 130.8438 Q86.9336 131.0469 87.168 131.375 Q87.4023 131.7031 87.4961 132.1406 Q87.543 132.4375 87.543 133.1719 L87.543 137 L86.4961 137 L86.4961 133.2188 Q86.4961 132.5625 86.3711 132.25 Q86.2461 131.9375 85.9336 131.75 Q85.6211 131.5469 85.1992 131.5469 Q84.5273 131.5469 84.0273 131.9844 Q83.543 132.4062 83.543 133.5938 L83.543 137 L82.4961 137 ZM91.4668 136.0625 L91.623 136.9844 Q91.1699 137.0781 90.8262 137.0781 Q90.248 137.0781 89.9355 136.9062 Q89.623 136.7188 89.4824 136.4219 Q89.3574 136.125 89.3574 135.1719 L89.3574 131.5938 L88.5918 131.5938 L88.5918 130.7812 L89.3574 130.7812 L89.3574 129.2344 L90.4043 128.6094 L90.4043 130.7812 L91.4668 130.7812 L91.4668 131.5938 L90.4043 131.5938 L90.4043 135.2344 Q90.4043 135.6875 90.4512 135.8125 Q90.5137 135.9375 90.6387 136.0156 Q90.7637 136.0938 90.998 136.0938 Q91.1855 136.0938 91.4668 136.0625 ZM96.7539 135 L97.8477 135.125 Q97.5977 136.0781 96.8945 136.6094 Q96.1914 137.1406 95.1133 137.1406 Q93.7539 137.1406 92.9414 136.2969 Q92.1445 135.4531 92.1445 133.9375 Q92.1445 132.375 92.957 131.5156 Q93.7695 130.6406 95.0508 130.6406 Q96.3008 130.6406 97.082 131.4844 Q97.8789 132.3281 97.8789 133.875 Q97.8789 133.9688 97.8789 134.1562 L93.2383 134.1562 Q93.3008 135.1875 93.8164 135.7344 Q94.332 136.2656 95.1133 136.2656 Q95.6914 136.2656 96.0977 135.9688 Q96.5195 135.6562 96.7539 135 ZM93.3008 133.2969 L96.7695 133.2969 Q96.707 132.5 96.3789 132.1094 Q95.8633 131.5 95.0664 131.5 Q94.332 131.5 93.832 131.9844 Q93.3477 132.4688 93.3008 133.2969 ZM103.4277 135 L104.5215 135.125 Q104.2715 136.0781 103.5684 136.6094 Q102.8652 137.1406 101.7871 137.1406 Q100.4277 137.1406 99.6152 136.2969 Q98.8184 135.4531 98.8184 133.9375 Q98.8184 132.375 99.6309 131.5156 Q100.4434 130.6406 101.7246 130.6406 Q102.9746 130.6406 103.7559 131.4844 Q104.5527 132.3281 104.5527 133.875 Q104.5527 133.9688 104.5527 134.1562 L99.9121 134.1562 Q99.9746 135.1875 100.4902 135.7344 Q101.0059 136.2656 101.7871 136.2656 Q102.3652 136.2656 102.7715 135.9688 Q103.1934 135.6562 103.4277 135 ZM99.9746 133.2969 L103.4434 133.2969 Q103.3809 132.5 103.0527 132.1094 Q102.5371 131.5 101.7402 131.5 Q101.0059 131.5 100.5059 131.9844 Q100.0215 132.4688 99.9746 133.2969 ZM105.8359 137 L105.8359 130.7812 L106.7891 130.7812 L106.7891 131.7188 Q107.1484 131.0625 107.4453 130.8594 Q107.7578 130.6406 108.1328 130.6406 Q108.6641 130.6406 109.2109 130.9688 L108.8516 131.9531 Q108.4609 131.7188 108.0859 131.7188 Q107.7266 131.7188 107.4453 131.9375 Q107.1797 132.1406 107.0703 132.5156 Q106.8828 133.0781 106.8828 133.7344 L106.8828 137 L105.8359 137 ZM113.8789 137 L113.8789 136.2188 Q113.2852 137.1406 112.1445 137.1406 Q111.3945 137.1406 110.7695 136.7344 Q110.1445 136.3125 109.8008 135.5781 Q109.457 134.8438 109.457 133.8906 Q109.457 132.9688 109.7695 132.2031 Q110.082 131.4375 110.707 131.0469 Q111.332 130.6406 112.0977 130.6406 Q112.6602 130.6406 113.0977 130.875 Q113.5352 131.1094 113.8164 131.4844 L113.8164 128.4062 L114.8633 128.4062 L114.8633 137 L113.8789 137 ZM110.5508 133.8906 Q110.5508 135.0938 111.0508 135.6875 Q111.5508 136.2656 112.2383 136.2656 Q112.9258 136.2656 113.4102 135.7031 Q113.8945 135.1406 113.8945 133.9844 Q113.8945 132.7031 113.3945 132.1094 Q112.9102 131.5156 112.1914 131.5156 Q111.4883 131.5156 111.0195 132.0938 Q110.5508 132.6562 110.5508 133.8906 ZM120.7715 135 L121.8652 135.125 Q121.6152 136.0781 120.9121 136.6094 Q120.209 137.1406 119.1309 137.1406 Q117.7715 137.1406 116.959 136.2969 Q116.1621 135.4531 116.1621 133.9375 Q116.1621 132.375 116.9746 131.5156 Q117.7871 130.6406 119.0684 130.6406 Q120.3184 130.6406 121.0996 131.4844 Q121.8965 132.3281 121.8965 133.875 Q121.8965 133.9688 121.8965 134.1562 L117.2559 134.1562 Q117.3184 135.1875 117.834 135.7344 Q118.3496 136.2656 119.1309 136.2656 Q119.709 136.2656 120.1152 135.9688 Q120.5371 135.6562 120.7715 135 ZM117.3184 133.2969 L120.7871 133.2969 Q120.7246 132.5 120.3965 132.1094 Q119.8809 131.5 119.084 131.5 Q118.3496 131.5 117.8496 131.9844 Q117.3652 132.4688 117.3184 133.2969 Z" stroke-width="1" clip-path="url(#clipPath2)" stroke="none"
      /><path fill="black" d="M31.7656 152 L30.7812 152 L30.7812 143.4062 L31.8438 143.4062 L31.8438 146.4688 Q32.5156 145.6406 33.5469 145.6406 Q34.125 145.6406 34.625 145.875 Q35.1406 146.0938 35.4688 146.5156 Q35.8125 146.9375 36 147.5312 Q36.1875 148.125 36.1875 148.7969 Q36.1875 150.3906 35.3906 151.2656 Q34.5938 152.1406 33.5 152.1406 Q32.3906 152.1406 31.7656 151.2188 L31.7656 152 ZM31.75 148.8438 Q31.75 149.9531 32.0625 150.4531 Q32.5625 151.2656 33.4062 151.2656 Q34.0938 151.2656 34.5938 150.6719 Q35.1094 150.0781 35.1094 148.875 Q35.1094 147.6562 34.625 147.0781 Q34.1406 146.5 33.4531 146.5 Q32.7656 146.5 32.25 147.1094 Q31.75 147.7031 31.75 148.8438 ZM41.7207 150 L42.8145 150.125 Q42.5645 151.0781 41.8613 151.6094 Q41.1582 152.1406 40.0801 152.1406 Q38.7207 152.1406 37.9082 151.2969 Q37.1113 150.4531 37.1113 148.9375 Q37.1113 147.375 37.9238 146.5156 Q38.7363 145.6406 40.0176 145.6406 Q41.2676 145.6406 42.0488 146.4844 Q42.8457 147.3281 42.8457 148.875 Q42.8457 148.9688 42.8457 149.1562 L38.2051 149.1562 Q38.2676 150.1875 38.7832 150.7344 Q39.2988 151.2656 40.0801 151.2656 Q40.6582 151.2656 41.0645 150.9688 Q41.4863 150.6562 41.7207 150 ZM38.2676 148.2969 L41.7363 148.2969 Q41.6738 147.5 41.3457 147.1094 Q40.8301 146.5 40.0332 146.5 Q39.2988 146.5 38.7988 146.9844 Q38.3145 147.4688 38.2676 148.2969 ZM45.8633 152 L43.5039 145.7812 L44.6133 145.7812 L45.957 149.5 Q46.1602 150.1094 46.3477 150.75 Q46.4883 150.2656 46.7383 149.5781 L48.1289 145.7812 L49.207 145.7812 L46.8477 152 L45.8633 152 ZM50.1445 144.625 L50.1445 143.4062 L51.207 143.4062 L51.207 144.625 L50.1445 144.625 ZM50.1445 152 L50.1445 145.7812 L51.207 145.7812 L51.207 152 L50.1445 152 ZM52.8105 152 L52.8105 145.7812 L53.748 145.7812 L53.748 146.6562 Q54.4355 145.6406 55.7324 145.6406 Q56.2949 145.6406 56.7637 145.8438 Q57.248 146.0469 57.4824 146.375 Q57.7168 146.7031 57.8105 147.1406 Q57.8574 147.4375 57.8574 148.1719 L57.8574 152 L56.8105 152 L56.8105 148.2188 Q56.8105 147.5625 56.6855 147.25 Q56.5605 146.9375 56.248 146.75 Q55.9355 146.5469 55.5137 146.5469 Q54.8418 146.5469 54.3418 146.9844 Q53.8574 147.4062 53.8574 148.5938 L53.8574 152 L52.8105 152 ZM63.5156 152 L63.5156 151.2188 Q62.9219 152.1406 61.7812 152.1406 Q61.0312 152.1406 60.4062 151.7344 Q59.7812 151.3125 59.4375 150.5781 Q59.0938 149.8438 59.0938 148.8906 Q59.0938 147.9688 59.4062 147.2031 Q59.7188 146.4375 60.3438 146.0469 Q60.9688 145.6406 61.7344 145.6406 Q62.2969 145.6406 62.7344 145.875 Q63.1719 146.1094 63.4531 146.4844 L63.4531 143.4062 L64.5 143.4062 L64.5 152 L63.5156 152 ZM60.1875 148.8906 Q60.1875 150.0938 60.6875 150.6875 Q61.1875 151.2656 61.875 151.2656 Q62.5625 151.2656 63.0469 150.7031 Q63.5312 150.1406 63.5312 148.9844 Q63.5312 147.7031 63.0312 147.1094 Q62.5469 146.5156 61.8281 146.5156 Q61.125 146.5156 60.6562 147.0938 Q60.1875 147.6562 60.1875 148.8906 ZM66.1582 144.625 L66.1582 143.4062 L67.2207 143.4062 L67.2207 144.625 L66.1582 144.625 ZM66.1582 152 L66.1582 145.7812 L67.2207 145.7812 L67.2207 152 L66.1582 152 ZM68.8242 152 L68.8242 145.7812 L69.7617 145.7812 L69.7617 146.6562 Q70.4492 145.6406 71.7461 145.6406 Q72.3086 145.6406 72.7773 145.8438 Q73.2617 146.0469 73.4961 146.375 Q73.7305 146.7031 73.8242 147.1406 Q73.8711 147.4375 73.8711 148.1719 L73.8711 152 L72.8242 152 L72.8242 148.2188 Q72.8242 147.5625 72.6992 147.25 Q72.5742 146.9375 72.2617 146.75 Q71.9492 146.5469 71.5273 146.5469 Q70.8555 146.5469 70.3555 146.9844 Q69.8711 147.4062 69.8711 148.5938 L69.8711 152 L68.8242 152 ZM75.2949 152.5156 L76.3262 152.6719 Q76.3887 153.1406 76.6855 153.3594 Q77.0762 153.6562 77.748 153.6562 Q78.4824 153.6562 78.873 153.3594 Q79.2793 153.0625 79.4199 152.5469 Q79.5137 152.2188 79.498 151.1875 Q78.8105 152 77.7793 152 Q76.498 152 75.7949 151.0781 Q75.0918 150.1406 75.0918 148.8594 Q75.0918 147.9688 75.4043 147.2188 Q75.7324 146.4531 76.3418 146.0469 Q76.9512 145.6406 77.7793 145.6406 Q78.8887 145.6406 79.6074 146.5312 L79.6074 145.7812 L80.5762 145.7812 L80.5762 151.1562 Q80.5762 152.6094 80.2793 153.2188 Q79.9824 153.8281 79.3418 154.1719 Q78.7012 154.5312 77.7637 154.5312 Q76.6543 154.5312 75.9668 154.0312 Q75.2793 153.5312 75.2949 152.5156 ZM76.1699 148.7812 Q76.1699 150 76.6543 150.5625 Q77.1387 151.125 77.873 151.125 Q78.6074 151.125 79.0918 150.5625 Q79.5918 150 79.5918 148.8125 Q79.5918 147.6719 79.0762 147.0938 Q78.5762 146.5156 77.8574 146.5156 Q77.1543 146.5156 76.6543 147.0938 Q76.1699 147.6562 76.1699 148.7812 ZM86.4219 150 L87.5156 150.125 Q87.2656 151.0781 86.5625 151.6094 Q85.8594 152.1406 84.7812 152.1406 Q83.4219 152.1406 82.6094 151.2969 Q81.8125 150.4531 81.8125 148.9375 Q81.8125 147.375 82.625 146.5156 Q83.4375 145.6406 84.7188 145.6406 Q85.9688 145.6406 86.75 146.4844 Q87.5469 147.3281 87.5469 148.875 Q87.5469 148.9688 87.5469 149.1562 L82.9062 149.1562 Q82.9688 150.1875 83.4844 150.7344 Q84 151.2656 84.7812 151.2656 Q85.3594 151.2656 85.7656 150.9688 Q86.1875 150.6562 86.4219 150 ZM82.9688 148.2969 L86.4375 148.2969 Q86.375 147.5 86.0469 147.1094 Q85.5312 146.5 84.7344 146.5 Q84 146.5 83.5 146.9844 Q83.0156 147.4688 82.9688 148.2969 ZM88.8457 152 L88.8457 145.7812 L89.7832 145.7812 L89.7832 146.6562 Q90.4707 145.6406 91.7676 145.6406 Q92.3301 145.6406 92.7988 145.8438 Q93.2832 146.0469 93.5176 146.375 Q93.752 146.7031 93.8457 147.1406 Q93.8926 147.4375 93.8926 148.1719 L93.8926 152 L92.8457 152 L92.8457 148.2188 Q92.8457 147.5625 92.7207 147.25 Q92.5957 146.9375 92.2832 146.75 Q91.9707 146.5469 91.5488 146.5469 Q90.877 146.5469 90.377 146.9844 Q89.8926 147.4062 89.8926 148.5938 L89.8926 152 L88.8457 152 ZM98.291 152 L98.291 151.1406 L102.2598 146.5938 Q101.5723 146.625 101.0566 146.625 L98.5254 146.625 L98.5254 145.7812 L103.6191 145.7812 L103.6191 146.4688 L100.2441 150.4219 L99.5879 151.1406 Q100.3066 151.0938 100.916 151.0938 L103.8066 151.0938 L103.8066 152 L98.291 152 ZM104.8535 144.625 L104.8535 143.4062 L105.916 143.4062 L105.916 144.625 L104.8535 144.625 ZM104.8535 152 L104.8535 145.7812 L105.916 145.7812 L105.916 152 L104.8535 152 ZM107.5039 144.6406 L107.5039 143.4062 L108.5664 143.4062 L108.5664 144.6406 L107.5039 144.6406 ZM106.1758 154.4219 L106.3633 153.5156 Q106.6914 153.5938 106.8633 153.5938 Q107.1914 153.5938 107.3477 153.375 Q107.5039 153.1719 107.5039 152.3125 L107.5039 145.7812 L108.5664 145.7812 L108.5664 152.3438 Q108.5664 153.4844 108.2695 153.9375 Q107.8789 154.5312 107.0039 154.5312 Q106.5664 154.5312 106.1758 154.4219 ZM110.1855 152 L110.1855 145.7812 L111.123 145.7812 L111.123 146.6562 Q111.8105 145.6406 113.1074 145.6406 Q113.6699 145.6406 114.1387 145.8438 Q114.623 146.0469 114.8574 146.375 Q115.0918 146.7031 115.1855 147.1406 Q115.2324 147.4375 115.2324 148.1719 L115.2324 152 L114.1855 152 L114.1855 148.2188 Q114.1855 147.5625 114.0605 147.25 Q113.9355 146.9375 113.623 146.75 Q113.3105 146.5469 112.8887 146.5469 Q112.2168 146.5469 111.7168 146.9844 Q111.2324 147.4062 111.2324 148.5938 L111.2324 152 L110.1855 152 Z" stroke-width="1" clip-path="url(#clipPath2)" stroke="none"
      /><path fill="black" d="M27.4062 163.8906 Q27.4062 162.1562 28.3594 161.3281 Q29.1562 160.6406 30.3125 160.6406 Q31.5938 160.6406 32.4062 161.4844 Q33.2344 162.3125 33.2344 163.7969 Q33.2344 165 32.875 165.6875 Q32.5156 166.375 31.8125 166.7656 Q31.125 167.1406 30.3125 167.1406 Q29.0156 167.1406 28.2031 166.3125 Q27.4062 165.4688 27.4062 163.8906 ZM28.4844 163.8906 Q28.4844 165.0781 29 165.6719 Q29.5312 166.2656 30.3125 166.2656 Q31.1094 166.2656 31.625 165.6719 Q32.1406 165.0781 32.1406 163.8594 Q32.1406 162.7031 31.6094 162.1094 Q31.0938 161.5156 30.3125 161.5156 Q29.5312 161.5156 29 162.1094 Q28.4844 162.6875 28.4844 163.8906 ZM34.4707 167 L34.4707 160.7812 L35.4082 160.7812 L35.4082 161.6562 Q36.0957 160.6406 37.3926 160.6406 Q37.9551 160.6406 38.4238 160.8438 Q38.9082 161.0469 39.1426 161.375 Q39.377 161.7031 39.4707 162.1406 Q39.5176 162.4375 39.5176 163.1719 L39.5176 167 L38.4707 167 L38.4707 163.2188 Q38.4707 162.5625 38.3457 162.25 Q38.2207 161.9375 37.9082 161.75 Q37.5957 161.5469 37.1738 161.5469 Q36.502 161.5469 36.002 161.9844 Q35.5176 162.4062 35.5176 163.5938 L35.5176 167 L34.4707 167 ZM43.4414 166.0625 L43.5977 166.9844 Q43.1445 167.0781 42.8008 167.0781 Q42.2227 167.0781 41.9102 166.9062 Q41.5977 166.7188 41.457 166.4219 Q41.332 166.125 41.332 165.1719 L41.332 161.5938 L40.5664 161.5938 L40.5664 160.7812 L41.332 160.7812 L41.332 159.2344 L42.3789 158.6094 L42.3789 160.7812 L43.4414 160.7812 L43.4414 161.5938 L42.3789 161.5938 L42.3789 165.2344 Q42.3789 165.6875 42.4258 165.8125 Q42.4883 165.9375 42.6133 166.0156 Q42.7383 166.0938 42.9727 166.0938 Q43.1602 166.0938 43.4414 166.0625 ZM44.4473 167 L44.4473 158.4062 L45.5098 158.4062 L45.5098 167 L44.4473 167 ZM51.3945 165 L52.4883 165.125 Q52.2383 166.0781 51.5352 166.6094 Q50.832 167.1406 49.7539 167.1406 Q48.3945 167.1406 47.582 166.2969 Q46.7852 165.4531 46.7852 163.9375 Q46.7852 162.375 47.5977 161.5156 Q48.4102 160.6406 49.6914 160.6406 Q50.9414 160.6406 51.7227 161.4844 Q52.5195 162.3281 52.5195 163.875 Q52.5195 163.9688 52.5195 164.1562 L47.8789 164.1562 Q47.9414 165.1875 48.457 165.7344 Q48.9727 166.2656 49.7539 166.2656 Q50.332 166.2656 50.7383 165.9688 Q51.1602 165.6562 51.3945 165 ZM47.9414 163.2969 L51.4102 163.2969 Q51.3477 162.5 51.0195 162.1094 Q50.5039 161.5 49.707 161.5 Q48.9727 161.5 48.4727 161.9844 Q47.9883 162.4688 47.9414 163.2969 ZM58.0684 165 L59.1621 165.125 Q58.9121 166.0781 58.209 166.6094 Q57.5059 167.1406 56.4277 167.1406 Q55.0684 167.1406 54.2559 166.2969 Q53.459 165.4531 53.459 163.9375 Q53.459 162.375 54.2715 161.5156 Q55.084 160.6406 56.3652 160.6406 Q57.6152 160.6406 58.3965 161.4844 Q59.1934 162.3281 59.1934 163.875 Q59.1934 163.9688 59.1934 164.1562 L54.5527 164.1562 Q54.6152 165.1875 55.1309 165.7344 Q55.6465 166.2656 56.4277 166.2656 Q57.0059 166.2656 57.4121 165.9688 Q57.834 165.6562 58.0684 165 ZM54.6152 163.2969 L58.084 163.2969 Q58.0215 162.5 57.6934 162.1094 Q57.1777 161.5 56.3809 161.5 Q55.6465 161.5 55.1465 161.9844 Q54.6621 162.4688 54.6152 163.2969 ZM60.4922 167 L60.4922 160.7812 L61.4297 160.7812 L61.4297 161.6562 Q62.1172 160.6406 63.4141 160.6406 Q63.9766 160.6406 64.4453 160.8438 Q64.9297 161.0469 65.1641 161.375 Q65.3984 161.7031 65.4922 162.1406 Q65.5391 162.4375 65.5391 163.1719 L65.5391 167 L64.4922 167 L64.4922 163.2188 Q64.4922 162.5625 64.3672 162.25 Q64.2422 161.9375 63.9297 161.75 Q63.6172 161.5469 63.1953 161.5469 Q62.5234 161.5469 62.0234 161.9844 Q61.5391 162.4062 61.5391 163.5938 L61.5391 167 L60.4922 167 ZM71.1973 167 L71.1973 166.2188 Q70.6035 167.1406 69.4629 167.1406 Q68.7129 167.1406 68.0879 166.7344 Q67.4629 166.3125 67.1191 165.5781 Q66.7754 164.8438 66.7754 163.8906 Q66.7754 162.9688 67.0879 162.2031 Q67.4004 161.4375 68.0254 161.0469 Q68.6504 160.6406 69.416 160.6406 Q69.9785 160.6406 70.416 160.875 Q70.8535 161.1094 71.1348 161.4844 L71.1348 158.4062 L72.1816 158.4062 L72.1816 167 L71.1973 167 ZM67.8691 163.8906 Q67.8691 165.0938 68.3691 165.6875 Q68.8691 166.2656 69.5566 166.2656 Q70.2441 166.2656 70.7285 165.7031 Q71.2129 165.1406 71.2129 163.9844 Q71.2129 162.7031 70.7129 162.1094 Q70.2285 161.5156 69.5098 161.5156 Q68.8066 161.5156 68.3379 162.0938 Q67.8691 162.6562 67.8691 163.8906 ZM81.2363 166.2344 Q80.6426 166.7344 80.0957 166.9375 Q79.5645 167.1406 78.9395 167.1406 Q77.9082 167.1406 77.3613 166.6406 Q76.8145 166.1406 76.8145 165.3594 Q76.8145 164.9062 77.0176 164.5312 Q77.2207 164.1406 77.5645 163.9219 Q77.9082 163.6875 78.3301 163.5781 Q78.627 163.4844 79.2676 163.4062 Q80.5332 163.2656 81.1426 163.0469 Q81.1426 162.8281 81.1426 162.7812 Q81.1426 162.125 80.8457 161.8594 Q80.4395 161.5156 79.6426 161.5156 Q78.9082 161.5156 78.5488 161.7812 Q78.1895 162.0312 78.0176 162.6875 L76.9863 162.5469 Q77.127 161.8906 77.4551 161.4844 Q77.7832 161.0781 78.3926 160.8594 Q79.002 160.6406 79.7988 160.6406 Q80.5957 160.6406 81.0957 160.8281 Q81.5957 161.0156 81.8301 161.2969 Q82.0645 161.5781 82.1582 162.0156 Q82.2051 162.2812 82.2051 162.9844 L82.2051 164.3906 Q82.2051 165.8594 82.2676 166.25 Q82.3457 166.6406 82.5488 167 L81.4395 167 Q81.2832 166.6719 81.2363 166.2344 ZM81.1426 163.875 Q80.5645 164.1094 79.4238 164.2812 Q78.7676 164.375 78.502 164.5 Q78.2363 164.6094 78.0801 164.8281 Q77.9395 165.0469 77.9395 165.3281 Q77.9395 165.75 78.252 166.0312 Q78.5801 166.3125 79.1895 166.3125 Q79.7988 166.3125 80.2676 166.0469 Q80.752 165.7812 80.9707 165.3125 Q81.1426 164.9531 81.1426 164.2656 L81.1426 163.875 ZM87.9102 166.2344 Q87.3164 166.7344 86.7695 166.9375 Q86.2383 167.1406 85.6133 167.1406 Q84.582 167.1406 84.0352 166.6406 Q83.4883 166.1406 83.4883 165.3594 Q83.4883 164.9062 83.6914 164.5312 Q83.8945 164.1406 84.2383 163.9219 Q84.582 163.6875 85.0039 163.5781 Q85.3008 163.4844 85.9414 163.4062 Q87.207 163.2656 87.8164 163.0469 Q87.8164 162.8281 87.8164 162.7812 Q87.8164 162.125 87.5195 161.8594 Q87.1133 161.5156 86.3164 161.5156 Q85.582 161.5156 85.2227 161.7812 Q84.8633 162.0312 84.6914 162.6875 L83.6602 162.5469 Q83.8008 161.8906 84.1289 161.4844 Q84.457 161.0781 85.0664 160.8594 Q85.6758 160.6406 86.4727 160.6406 Q87.2695 160.6406 87.7695 160.8281 Q88.2695 161.0156 88.5039 161.2969 Q88.7383 161.5781 88.832 162.0156 Q88.8789 162.2812 88.8789 162.9844 L88.8789 164.3906 Q88.8789 165.8594 88.9414 166.25 Q89.0195 166.6406 89.2227 167 L88.1133 167 Q87.957 166.6719 87.9102 166.2344 ZM87.8164 163.875 Q87.2383 164.1094 86.0977 164.2812 Q85.4414 164.375 85.1758 164.5 Q84.9102 164.6094 84.7539 164.8281 Q84.6133 165.0469 84.6133 165.3281 Q84.6133 165.75 84.9258 166.0312 Q85.2539 166.3125 85.8633 166.3125 Q86.4727 166.3125 86.9414 166.0469 Q87.4258 165.7812 87.6445 165.3125 Q87.8164 164.9531 87.8164 164.2656 L87.8164 163.875 ZM90.5215 167 L90.5215 160.7812 L91.459 160.7812 L91.459 161.6562 Q92.1465 160.6406 93.4434 160.6406 Q94.0059 160.6406 94.4746 160.8438 Q94.959 161.0469 95.1934 161.375 Q95.4277 161.7031 95.5215 162.1406 Q95.5684 162.4375 95.5684 163.1719 L95.5684 167 L94.5215 167 L94.5215 163.2188 Q94.5215 162.5625 94.3965 162.25 Q94.2715 161.9375 93.959 161.75 Q93.6465 161.5469 93.2246 161.5469 Q92.5527 161.5469 92.0527 161.9844 Q91.5684 162.4062 91.5684 163.5938 L91.5684 167 L90.5215 167 ZM104.7793 165 L105.873 165.125 Q105.623 166.0781 104.9199 166.6094 Q104.2168 167.1406 103.1387 167.1406 Q101.7793 167.1406 100.9668 166.2969 Q100.1699 165.4531 100.1699 163.9375 Q100.1699 162.375 100.9824 161.5156 Q101.7949 160.6406 103.0762 160.6406 Q104.3262 160.6406 105.1074 161.4844 Q105.9043 162.3281 105.9043 163.875 Q105.9043 163.9688 105.9043 164.1562 L101.2637 164.1562 Q101.3262 165.1875 101.8418 165.7344 Q102.3574 166.2656 103.1387 166.2656 Q103.7168 166.2656 104.123 165.9688 Q104.5449 165.6562 104.7793 165 ZM101.3262 163.2969 L104.7949 163.2969 Q104.7324 162.5 104.4043 162.1094 Q103.8887 161.5 103.0918 161.5 Q102.3574 161.5 101.8574 161.9844 Q101.373 162.4688 101.3262 163.2969 ZM111.4531 165 L112.5469 165.125 Q112.2969 166.0781 111.5938 166.6094 Q110.8906 167.1406 109.8125 167.1406 Q108.4531 167.1406 107.6406 166.2969 Q106.8438 165.4531 106.8438 163.9375 Q106.8438 162.375 107.6562 161.5156 Q108.4688 160.6406 109.75 160.6406 Q111 160.6406 111.7812 161.4844 Q112.5781 162.3281 112.5781 163.875 Q112.5781 163.9688 112.5781 164.1562 L107.9375 164.1562 Q108 165.1875 108.5156 165.7344 Q109.0312 166.2656 109.8125 166.2656 Q110.3906 166.2656 110.7969 165.9688 Q111.2188 165.6562 111.4531 165 ZM108 163.2969 L111.4688 163.2969 Q111.4062 162.5 111.0781 162.1094 Q110.5625 161.5 109.7656 161.5 Q109.0312 161.5 108.5312 161.9844 Q108.0469 162.4688 108 163.2969 ZM113.877 167 L113.877 160.7812 L114.8145 160.7812 L114.8145 161.6562 Q115.502 160.6406 116.7988 160.6406 Q117.3613 160.6406 117.8301 160.8438 Q118.3145 161.0469 118.5488 161.375 Q118.7832 161.7031 118.877 162.1406 Q118.9238 162.4375 118.9238 163.1719 L118.9238 167 L117.877 167 L117.877 163.2188 Q117.877 162.5625 117.752 162.25 Q117.627 161.9375 117.3145 161.75 Q117.002 161.5469 116.5801 161.5469 Q115.9082 161.5469 115.4082 161.9844 Q114.9238 162.4062 114.9238 163.5938 L114.9238 167 L113.877 167 Z" stroke-width="1" clip-path="url(#clipPath2)" stroke="none"
      /><path fill="black" d="M53.9375 182 L52.0312 175.7812 L53.125 175.7812 L54.1094 179.375 L54.4844 180.7031 Q54.5156 180.6094 54.8125 179.4219 L55.7969 175.7812 L56.875 175.7812 L57.8125 179.3906 L58.125 180.5781 L58.4844 179.375 L59.5469 175.7812 L60.5781 175.7812 L58.625 182 L57.5312 182 L56.5469 178.2656 L56.2969 177.2188 L55.0469 182 L53.9375 182 ZM65.7129 180 L66.8066 180.125 Q66.5566 181.0781 65.8535 181.6094 Q65.1504 182.1406 64.0723 182.1406 Q62.7129 182.1406 61.9004 181.2969 Q61.1035 180.4531 61.1035 178.9375 Q61.1035 177.375 61.916 176.5156 Q62.7285 175.6406 64.0098 175.6406 Q65.2598 175.6406 66.041 176.4844 Q66.8379 177.3281 66.8379 178.875 Q66.8379 178.9688 66.8379 179.1562 L62.1973 179.1562 Q62.2598 180.1875 62.7754 180.7344 Q63.291 181.2656 64.0723 181.2656 Q64.6504 181.2656 65.0566 180.9688 Q65.4785 180.6562 65.7129 180 ZM62.2598 178.2969 L65.7285 178.2969 Q65.666 177.5 65.3379 177.1094 Q64.8223 176.5 64.0254 176.5 Q63.291 176.5 62.791 176.9844 Q62.3066 177.4688 62.2598 178.2969 ZM68.1211 182 L68.1211 175.7812 L69.0742 175.7812 L69.0742 176.7188 Q69.4336 176.0625 69.7305 175.8594 Q70.043 175.6406 70.418 175.6406 Q70.9492 175.6406 71.4961 175.9688 L71.1367 176.9531 Q70.7461 176.7188 70.3711 176.7188 Q70.0117 176.7188 69.7305 176.9375 Q69.4648 177.1406 69.3555 177.5156 Q69.168 178.0781 69.168 178.7344 L69.168 182 L68.1211 182 ZM72.1328 182 L72.1328 173.4062 L73.1953 173.4062 L73.1953 178.3125 L75.6797 175.7812 L77.0547 175.7812 L74.6641 178.0781 L77.2891 182 L75.9922 182 L73.9297 178.8125 L73.1953 179.5312 L73.1953 182 L72.1328 182 ZM82.3828 180 L83.4766 180.125 Q83.2266 181.0781 82.5234 181.6094 Q81.8203 182.1406 80.7422 182.1406 Q79.3828 182.1406 78.5703 181.2969 Q77.7734 180.4531 77.7734 178.9375 Q77.7734 177.375 78.5859 176.5156 Q79.3984 175.6406 80.6797 175.6406 Q81.9297 175.6406 82.7109 176.4844 Q83.5078 177.3281 83.5078 178.875 Q83.5078 178.9688 83.5078 179.1562 L78.8672 179.1562 Q78.9297 180.1875 79.4453 180.7344 Q79.9609 181.2656 80.7422 181.2656 Q81.3203 181.2656 81.7266 180.9688 Q82.1484 180.6562 82.3828 180 ZM78.9297 178.2969 L82.3984 178.2969 Q82.3359 177.5 82.0078 177.1094 Q81.4922 176.5 80.6953 176.5 Q79.9609 176.5 79.4609 176.9844 Q78.9766 177.4688 78.9297 178.2969 ZM84.8066 182 L84.8066 175.7812 L85.7441 175.7812 L85.7441 176.6562 Q86.4316 175.6406 87.7285 175.6406 Q88.291 175.6406 88.7598 175.8438 Q89.2441 176.0469 89.4785 176.375 Q89.7129 176.7031 89.8066 177.1406 Q89.8535 177.4375 89.8535 178.1719 L89.8535 182 L88.8066 182 L88.8066 178.2188 Q88.8066 177.5625 88.6816 177.25 Q88.5566 176.9375 88.2441 176.75 Q87.9316 176.5469 87.5098 176.5469 Q86.8379 176.5469 86.3379 176.9844 Q85.8535 177.4062 85.8535 178.5938 L85.8535 182 L84.8066 182 ZM95.5117 182 L95.5117 181.2188 Q94.918 182.1406 93.7773 182.1406 Q93.0273 182.1406 92.4023 181.7344 Q91.7773 181.3125 91.4336 180.5781 Q91.0898 179.8438 91.0898 178.8906 Q91.0898 177.9688 91.4023 177.2031 Q91.7148 176.4375 92.3398 176.0469 Q92.9648 175.6406 93.7305 175.6406 Q94.293 175.6406 94.7305 175.875 Q95.168 176.1094 95.4492 176.4844 L95.4492 173.4062 L96.4961 173.4062 L96.4961 182 L95.5117 182 ZM92.1836 178.8906 Q92.1836 180.0938 92.6836 180.6875 Q93.1836 181.2656 93.8711 181.2656 Q94.5586 181.2656 95.043 180.7031 Q95.5273 180.1406 95.5273 178.9844 Q95.5273 177.7031 95.0273 177.1094 Q94.543 176.5156 93.8242 176.5156 Q93.1211 176.5156 92.6523 177.0938 Q92.1836 177.6562 92.1836 178.8906 Z" stroke-width="1" clip-path="url(#clipPath2)" stroke="none"
      /><path fill="black" d="M26.7969 199.3906 L26.7969 190.7812 L27.75 190.7812 L27.75 191.5781 Q28.0938 191.1094 28.5156 190.875 Q28.9531 190.6406 29.5625 190.6406 Q30.3594 190.6406 30.9688 191.0469 Q31.5781 191.4531 31.875 192.2031 Q32.1875 192.9531 32.1875 193.8438 Q32.1875 194.7969 31.8438 195.5625 Q31.5156 196.3281 30.8594 196.7344 Q30.2031 197.1406 29.4844 197.1406 Q28.9531 197.1406 28.5312 196.9219 Q28.1094 196.6875 27.8438 196.3594 L27.8438 199.3906 L26.7969 199.3906 ZM27.75 193.9219 Q27.75 195.125 28.2344 195.7031 Q28.7188 196.2656 29.4062 196.2656 Q30.1094 196.2656 30.6094 195.6719 Q31.1094 195.0781 31.1094 193.8281 Q31.1094 192.6406 30.625 192.0625 Q30.1406 191.4688 29.4531 191.4688 Q28.7812 191.4688 28.2656 192.0938 Q27.75 192.7188 27.75 193.9219 ZM33.4551 197 L33.4551 190.7812 L34.4082 190.7812 L34.4082 191.7188 Q34.7676 191.0625 35.0645 190.8594 Q35.377 190.6406 35.752 190.6406 Q36.2832 190.6406 36.8301 190.9688 L36.4707 191.9531 Q36.0801 191.7188 35.7051 191.7188 Q35.3457 191.7188 35.0645 191.9375 Q34.7988 192.1406 34.6895 192.5156 Q34.502 193.0781 34.502 193.7344 L34.502 197 L33.4551 197 ZM37.0762 193.8906 Q37.0762 192.1562 38.0293 191.3281 Q38.8262 190.6406 39.9824 190.6406 Q41.2637 190.6406 42.0762 191.4844 Q42.9043 192.3125 42.9043 193.7969 Q42.9043 195 42.5449 195.6875 Q42.1855 196.375 41.4824 196.7656 Q40.7949 197.1406 39.9824 197.1406 Q38.6855 197.1406 37.873 196.3125 Q37.0762 195.4688 37.0762 193.8906 ZM38.1543 193.8906 Q38.1543 195.0781 38.6699 195.6719 Q39.2012 196.2656 39.9824 196.2656 Q40.7793 196.2656 41.2949 195.6719 Q41.8105 195.0781 41.8105 193.8594 Q41.8105 192.7031 41.2793 192.1094 Q40.7637 191.5156 39.9824 191.5156 Q39.2012 191.5156 38.6699 192.1094 Q38.1543 192.6875 38.1543 193.8906 ZM46.4375 196.0625 L46.5938 196.9844 Q46.1406 197.0781 45.7969 197.0781 Q45.2188 197.0781 44.9062 196.9062 Q44.5938 196.7188 44.4531 196.4219 Q44.3281 196.125 44.3281 195.1719 L44.3281 191.5938 L43.5625 191.5938 L43.5625 190.7812 L44.3281 190.7812 L44.3281 189.2344 L45.375 188.6094 L45.375 190.7812 L46.4375 190.7812 L46.4375 191.5938 L45.375 191.5938 L45.375 195.2344 Q45.375 195.6875 45.4219 195.8125 Q45.4844 195.9375 45.6094 196.0156 Q45.7344 196.0938 45.9688 196.0938 Q46.1562 196.0938 46.4375 196.0625 ZM47.084 193.8906 Q47.084 192.1562 48.0371 191.3281 Q48.834 190.6406 49.9902 190.6406 Q51.2715 190.6406 52.084 191.4844 Q52.9121 192.3125 52.9121 193.7969 Q52.9121 195 52.5527 195.6875 Q52.1934 196.375 51.4902 196.7656 Q50.8027 197.1406 49.9902 197.1406 Q48.6934 197.1406 47.8809 196.3125 Q47.084 195.4688 47.084 193.8906 ZM48.1621 193.8906 Q48.1621 195.0781 48.6777 195.6719 Q49.209 196.2656 49.9902 196.2656 Q50.7871 196.2656 51.3027 195.6719 Q51.8184 195.0781 51.8184 193.8594 Q51.8184 192.7031 51.2871 192.1094 Q50.7715 191.5156 49.9902 191.5156 Q49.209 191.5156 48.6777 192.1094 Q48.1621 192.6875 48.1621 193.8906 ZM56.4453 196.0625 L56.6016 196.9844 Q56.1484 197.0781 55.8047 197.0781 Q55.2266 197.0781 54.9141 196.9062 Q54.6016 196.7188 54.4609 196.4219 Q54.3359 196.125 54.3359 195.1719 L54.3359 191.5938 L53.5703 191.5938 L53.5703 190.7812 L54.3359 190.7812 L54.3359 189.2344 L55.3828 188.6094 L55.3828 190.7812 L56.4453 190.7812 L56.4453 191.5938 L55.3828 191.5938 L55.3828 195.2344 Q55.3828 195.6875 55.4297 195.8125 Q55.4922 195.9375 55.6172 196.0156 Q55.7422 196.0938 55.9766 196.0938 Q56.1641 196.0938 56.4453 196.0625 ZM57.4355 199.3906 L57.3105 198.4062 Q57.6543 198.5 57.9199 198.5 Q58.2637 198.5 58.4668 198.375 Q58.6855 198.2656 58.8262 198.0625 Q58.9199 197.8906 59.1543 197.2656 Q59.1699 197.1875 59.248 197.0156 L56.873 190.7812 L58.0137 190.7812 L59.3105 194.375 Q59.5605 195.0625 59.7637 195.8281 Q59.9512 195.0938 60.2012 194.4062 L61.5293 190.7812 L62.5762 190.7812 L60.2168 197.1094 Q59.8262 198.125 59.623 198.5156 Q59.3418 199.0469 58.9668 199.2812 Q58.6074 199.5312 58.1074 199.5312 Q57.8105 199.5312 57.4355 199.3906 ZM63.4824 199.3906 L63.4824 190.7812 L64.4355 190.7812 L64.4355 191.5781 Q64.7793 191.1094 65.2012 190.875 Q65.6387 190.6406 66.248 190.6406 Q67.0449 190.6406 67.6543 191.0469 Q68.2637 191.4531 68.5605 192.2031 Q68.873 192.9531 68.873 193.8438 Q68.873 194.7969 68.5293 195.5625 Q68.2012 196.3281 67.5449 196.7344 Q66.8887 197.1406 66.1699 197.1406 Q65.6387 197.1406 65.2168 196.9219 Q64.7949 196.6875 64.5293 196.3594 L64.5293 199.3906 L63.4824 199.3906 ZM64.4355 193.9219 Q64.4355 195.125 64.9199 195.7031 Q65.4043 196.2656 66.0918 196.2656 Q66.7949 196.2656 67.2949 195.6719 Q67.7949 195.0781 67.7949 193.8281 Q67.7949 192.6406 67.3105 192.0625 Q66.8262 191.4688 66.1387 191.4688 Q65.4668 191.4688 64.9512 192.0938 Q64.4355 192.7188 64.4355 193.9219 ZM74.4062 195 L75.5 195.125 Q75.25 196.0781 74.5469 196.6094 Q73.8438 197.1406 72.7656 197.1406 Q71.4062 197.1406 70.5938 196.2969 Q69.7969 195.4531 69.7969 193.9375 Q69.7969 192.375 70.6094 191.5156 Q71.4219 190.6406 72.7031 190.6406 Q73.9531 190.6406 74.7344 191.4844 Q75.5312 192.3281 75.5312 193.875 Q75.5312 193.9688 75.5312 194.1562 L70.8906 194.1562 Q70.9531 195.1875 71.4688 195.7344 Q71.9844 196.2656 72.7656 196.2656 Q73.3438 196.2656 73.75 195.9688 Q74.1719 195.6562 74.4062 195 ZM70.9531 193.2969 L74.4219 193.2969 Q74.3594 192.5 74.0312 192.1094 Q73.5156 191.5 72.7188 191.5 Q71.9844 191.5 71.4844 191.9844 Q71 192.4688 70.9531 193.2969 ZM76.8145 197 L76.8145 190.7812 L77.7676 190.7812 L77.7676 191.7188 Q78.127 191.0625 78.4238 190.8594 Q78.7363 190.6406 79.1113 190.6406 Q79.6426 190.6406 80.1895 190.9688 L79.8301 191.9531 Q79.4395 191.7188 79.0645 191.7188 Q78.7051 191.7188 78.4238 191.9375 Q78.1582 192.1406 78.0488 192.5156 Q77.8613 193.0781 77.8613 193.7344 L77.8613 197 L76.8145 197 ZM85.0762 195 L86.1699 195.125 Q85.9199 196.0781 85.2168 196.6094 Q84.5137 197.1406 83.4355 197.1406 Q82.0762 197.1406 81.2637 196.2969 Q80.4668 195.4531 80.4668 193.9375 Q80.4668 192.375 81.2793 191.5156 Q82.0918 190.6406 83.373 190.6406 Q84.623 190.6406 85.4043 191.4844 Q86.2012 192.3281 86.2012 193.875 Q86.2012 193.9688 86.2012 194.1562 L81.5605 194.1562 Q81.623 195.1875 82.1387 195.7344 Q82.6543 196.2656 83.4355 196.2656 Q84.0137 196.2656 84.4199 195.9688 Q84.8418 195.6562 85.0762 195 ZM81.623 193.2969 L85.0918 193.2969 Q85.0293 192.5 84.7012 192.1094 Q84.1855 191.5 83.3887 191.5 Q82.6543 191.5 82.1543 191.9844 Q81.6699 192.4688 81.623 193.2969 ZM87.2969 197.5156 L88.3281 197.6719 Q88.3906 198.1406 88.6875 198.3594 Q89.0781 198.6562 89.75 198.6562 Q90.4844 198.6562 90.875 198.3594 Q91.2812 198.0625 91.4219 197.5469 Q91.5156 197.2188 91.5 196.1875 Q90.8125 197 89.7812 197 Q88.5 197 87.7969 196.0781 Q87.0938 195.1406 87.0938 193.8594 Q87.0938 192.9688 87.4062 192.2188 Q87.7344 191.4531 88.3438 191.0469 Q88.9531 190.6406 89.7812 190.6406 Q90.8906 190.6406 91.6094 191.5312 L91.6094 190.7812 L92.5781 190.7812 L92.5781 196.1562 Q92.5781 197.6094 92.2812 198.2188 Q91.9844 198.8281 91.3438 199.1719 Q90.7031 199.5312 89.7656 199.5312 Q88.6562 199.5312 87.9688 199.0312 Q87.2812 198.5312 87.2969 197.5156 ZM88.1719 193.7812 Q88.1719 195 88.6562 195.5625 Q89.1406 196.125 89.875 196.125 Q90.6094 196.125 91.0938 195.5625 Q91.5938 195 91.5938 193.8125 Q91.5938 192.6719 91.0781 192.0938 Q90.5781 191.5156 89.8594 191.5156 Q89.1562 191.5156 88.6562 192.0938 Q88.1719 192.6562 88.1719 193.7812 ZM94.1738 189.625 L94.1738 188.4062 L95.2363 188.4062 L95.2363 189.625 L94.1738 189.625 ZM94.1738 197 L94.1738 190.7812 L95.2363 190.7812 L95.2363 197 L94.1738 197 ZM96.418 195.1406 L97.4492 194.9844 Q97.543 195.6094 97.9336 195.9375 Q98.3398 196.2656 99.0742 196.2656 Q99.793 196.2656 100.1367 195.9844 Q100.4961 195.6875 100.4961 195.2812 Q100.4961 194.9219 100.1836 194.7188 Q99.9648 194.5781 99.1055 194.3594 Q97.9492 194.0625 97.4961 193.8594 Q97.0586 193.6406 96.8242 193.2656 Q96.5898 192.8906 96.5898 192.4219 Q96.5898 192.0156 96.7773 191.6562 Q96.9648 191.2969 97.293 191.0625 Q97.543 190.8906 97.9648 190.7656 Q98.3867 190.6406 98.8867 190.6406 Q99.6055 190.6406 100.1523 190.8594 Q100.7148 191.0625 100.9805 191.4219 Q101.2461 191.7812 101.3398 192.375 L100.3086 192.5156 Q100.2461 192.0469 99.9023 191.7812 Q99.5742 191.5 98.9492 191.5 Q98.2305 191.5 97.918 191.75 Q97.6055 191.9844 97.6055 192.3125 Q97.6055 192.5156 97.7305 192.6719 Q97.8711 192.8438 98.1367 192.9531 Q98.293 193.0156 99.0742 193.2188 Q100.1992 193.5312 100.6367 193.7188 Q101.0742 193.9062 101.3242 194.2656 Q101.5742 194.625 101.5742 195.1719 Q101.5742 195.7031 101.2617 196.1719 Q100.9648 196.625 100.3867 196.8906 Q99.8086 197.1406 99.0742 197.1406 Q97.8555 197.1406 97.2148 196.6406 Q96.5898 196.125 96.418 195.1406 ZM105.1367 196.0625 L105.293 196.9844 Q104.8398 197.0781 104.4961 197.0781 Q103.918 197.0781 103.6055 196.9062 Q103.293 196.7188 103.1523 196.4219 Q103.0273 196.125 103.0273 195.1719 L103.0273 191.5938 L102.2617 191.5938 L102.2617 190.7812 L103.0273 190.7812 L103.0273 189.2344 L104.0742 188.6094 L104.0742 190.7812 L105.1367 190.7812 L105.1367 191.5938 L104.0742 191.5938 L104.0742 195.2344 Q104.0742 195.6875 104.1211 195.8125 Q104.1836 195.9375 104.3086 196.0156 Q104.4336 196.0938 104.668 196.0938 Q104.8555 196.0938 105.1367 196.0625 ZM110.4238 195 L111.5176 195.125 Q111.2676 196.0781 110.5645 196.6094 Q109.8613 197.1406 108.7832 197.1406 Q107.4238 197.1406 106.6113 196.2969 Q105.8145 195.4531 105.8145 193.9375 Q105.8145 192.375 106.627 191.5156 Q107.4395 190.6406 108.7207 190.6406 Q109.9707 190.6406 110.752 191.4844 Q111.5488 192.3281 111.5488 193.875 Q111.5488 193.9688 111.5488 194.1562 L106.9082 194.1562 Q106.9707 195.1875 107.4863 195.7344 Q108.002 196.2656 108.7832 196.2656 Q109.3613 196.2656 109.7676 195.9688 Q110.1895 195.6562 110.4238 195 ZM106.9707 193.2969 L110.4395 193.2969 Q110.377 192.5 110.0488 192.1094 Q109.5332 191.5 108.7363 191.5 Q108.002 191.5 107.502 191.9844 Q107.0176 192.4688 106.9707 193.2969 ZM112.832 197 L112.832 190.7812 L113.7852 190.7812 L113.7852 191.7188 Q114.1445 191.0625 114.4414 190.8594 Q114.7539 190.6406 115.1289 190.6406 Q115.6602 190.6406 116.207 190.9688 L115.8477 191.9531 Q115.457 191.7188 115.082 191.7188 Q114.7227 191.7188 114.4414 191.9375 Q114.1758 192.1406 114.0664 192.5156 Q113.8789 193.0781 113.8789 193.7344 L113.8789 197 L112.832 197 Z" stroke-width="1" clip-path="url(#clipPath2)" stroke="none"
      /><path fill="rgb(204,204,255)" d="M20 10 L130 10 L140 20 L140 80 L130 90 L20 90 L10 80 L10 20 L20 10" stroke-width="1" clip-path="url(#clipPath3)" fill-rule="evenodd" stroke="none"
      /><polygon fill="none" stroke-width="1" clip-path="url(#clipPath3)" points=" 20 10 130 10 140 20 140 80 130 90 20 90 10 80 10 20" stroke="rgb(142,142,178)"
      /><ellipse clip-path="url(#clipPath3)" fill="none" rx="7" cx="128" ry="4.5" cy="21.5" stroke="black" stroke-width="1"
      /><path fill="black" d="M30.9219 56 L30.9219 47.4062 L34.1719 47.4062 Q35.0156 47.4062 35.4688 47.4844 Q36.1094 47.5938 36.5312 47.8906 Q36.9688 48.1875 37.2188 48.7188 Q37.4844 49.25 37.4844 49.8906 Q37.4844 50.9844 36.7812 51.75 Q36.0938 52.5 34.2656 52.5 L32.0625 52.5 L32.0625 56 L30.9219 56 ZM32.0625 51.5 L34.2812 51.5 Q35.3906 51.5 35.8438 51.0938 Q36.3125 50.6719 36.3125 49.9219 Q36.3125 49.3906 36.0312 49.0156 Q35.7656 48.625 35.3281 48.5 Q35.0312 48.4219 34.2656 48.4219 L32.0625 48.4219 L32.0625 51.5 ZM38.7852 56 L38.7852 49.7812 L39.7383 49.7812 L39.7383 50.7188 Q40.0977 50.0625 40.3945 49.8594 Q40.707 49.6406 41.082 49.6406 Q41.6133 49.6406 42.1602 49.9688 L41.8008 50.9531 Q41.4102 50.7188 41.0352 50.7188 Q40.6758 50.7188 40.3945 50.9375 Q40.1289 51.1406 40.0195 51.5156 Q39.832 52.0781 39.832 52.7344 L39.832 56 L38.7852 56 ZM42.4062 52.8906 Q42.4062 51.1562 43.3594 50.3281 Q44.1562 49.6406 45.3125 49.6406 Q46.5938 49.6406 47.4062 50.4844 Q48.2344 51.3125 48.2344 52.7969 Q48.2344 54 47.875 54.6875 Q47.5156 55.375 46.8125 55.7656 Q46.125 56.1406 45.3125 56.1406 Q44.0156 56.1406 43.2031 55.3125 Q42.4062 54.4688 42.4062 52.8906 ZM43.4844 52.8906 Q43.4844 54.0781 44 54.6719 Q44.5312 55.2656 45.3125 55.2656 Q46.1094 55.2656 46.625 54.6719 Q47.1406 54.0781 47.1406 52.8594 Q47.1406 51.7031 46.6094 51.1094 Q46.0938 50.5156 45.3125 50.5156 Q44.5312 50.5156 44 51.1094 Q43.4844 51.6875 43.4844 52.8906 ZM49.7207 56 L49.7207 50.5938 L48.7832 50.5938 L48.7832 49.7812 L49.7207 49.7812 L49.7207 49.1094 Q49.7207 48.4844 49.8301 48.1875 Q49.9863 47.7656 50.3613 47.5156 Q50.752 47.2656 51.4395 47.2656 Q51.8926 47.2656 52.4238 47.375 L52.2676 48.2812 Q51.9395 48.2344 51.6426 48.2344 Q51.1582 48.2344 50.9551 48.4375 Q50.7676 48.6406 50.7676 49.2031 L50.7676 49.7812 L51.9863 49.7812 L51.9863 50.5938 L50.7676 50.5938 L50.7676 56 L49.7207 56 ZM57.0547 54 L58.1484 54.125 Q57.8984 55.0781 57.1953 55.6094 Q56.4922 56.1406 55.4141 56.1406 Q54.0547 56.1406 53.2422 55.2969 Q52.4453 54.4531 52.4453 52.9375 Q52.4453 51.375 53.2578 50.5156 Q54.0703 49.6406 55.3516 49.6406 Q56.6016 49.6406 57.3828 50.4844 Q58.1797 51.3281 58.1797 52.875 Q58.1797 52.9688 58.1797 53.1562 L53.5391 53.1562 Q53.6016 54.1875 54.1172 54.7344 Q54.6328 55.2656 55.4141 55.2656 Q55.9922 55.2656 56.3984 54.9688 Q56.8203 54.6562 57.0547 54 ZM53.6016 52.2969 L57.0703 52.2969 Q57.0078 51.5 56.6797 51.1094 Q56.1641 50.5 55.3672 50.5 Q54.6328 50.5 54.1328 50.9844 Q53.6484 51.4688 53.6016 52.2969 ZM59.0566 54.1406 L60.0879 53.9844 Q60.1816 54.6094 60.5723 54.9375 Q60.9785 55.2656 61.7129 55.2656 Q62.4316 55.2656 62.7754 54.9844 Q63.1348 54.6875 63.1348 54.2812 Q63.1348 53.9219 62.8223 53.7188 Q62.6035 53.5781 61.7441 53.3594 Q60.5879 53.0625 60.1348 52.8594 Q59.6973 52.6406 59.4629 52.2656 Q59.2285 51.8906 59.2285 51.4219 Q59.2285 51.0156 59.416 50.6562 Q59.6035 50.2969 59.9316 50.0625 Q60.1816 49.8906 60.6035 49.7656 Q61.0254 49.6406 61.5254 49.6406 Q62.2441 49.6406 62.791 49.8594 Q63.3535 50.0625 63.6191 50.4219 Q63.8848 50.7812 63.9785 51.375 L62.9473 51.5156 Q62.8848 51.0469 62.541 50.7812 Q62.2129 50.5 61.5879 50.5 Q60.8691 50.5 60.5566 50.75 Q60.2441 50.9844 60.2441 51.3125 Q60.2441 51.5156 60.3691 51.6719 Q60.5098 51.8438 60.7754 51.9531 Q60.9316 52.0156 61.7129 52.2188 Q62.8379 52.5312 63.2754 52.7188 Q63.7129 52.9062 63.9629 53.2656 Q64.2129 53.625 64.2129 54.1719 Q64.2129 54.7031 63.9004 55.1719 Q63.6035 55.625 63.0254 55.8906 Q62.4473 56.1406 61.7129 56.1406 Q60.4941 56.1406 59.8535 55.6406 Q59.2285 55.125 59.0566 54.1406 ZM65.0566 54.1406 L66.0879 53.9844 Q66.1816 54.6094 66.5723 54.9375 Q66.9785 55.2656 67.7129 55.2656 Q68.4316 55.2656 68.7754 54.9844 Q69.1348 54.6875 69.1348 54.2812 Q69.1348 53.9219 68.8223 53.7188 Q68.6035 53.5781 67.7441 53.3594 Q66.5879 53.0625 66.1348 52.8594 Q65.6973 52.6406 65.4629 52.2656 Q65.2285 51.8906 65.2285 51.4219 Q65.2285 51.0156 65.416 50.6562 Q65.6035 50.2969 65.9316 50.0625 Q66.1816 49.8906 66.6035 49.7656 Q67.0254 49.6406 67.5254 49.6406 Q68.2441 49.6406 68.791 49.8594 Q69.3535 50.0625 69.6191 50.4219 Q69.8848 50.7812 69.9785 51.375 L68.9473 51.5156 Q68.8848 51.0469 68.541 50.7812 Q68.2129 50.5 67.5879 50.5 Q66.8691 50.5 66.5566 50.75 Q66.2441 50.9844 66.2441 51.3125 Q66.2441 51.5156 66.3691 51.6719 Q66.5098 51.8438 66.7754 51.9531 Q66.9316 52.0156 67.7129 52.2188 Q68.8379 52.5312 69.2754 52.7188 Q69.7129 52.9062 69.9629 53.2656 Q70.2129 53.625 70.2129 54.1719 Q70.2129 54.7031 69.9004 55.1719 Q69.6035 55.625 69.0254 55.8906 Q68.4473 56.1406 67.7129 56.1406 Q66.4941 56.1406 65.8535 55.6406 Q65.2285 55.125 65.0566 54.1406 ZM71.4785 48.625 L71.4785 47.4062 L72.541 47.4062 L72.541 48.625 L71.4785 48.625 ZM71.4785 56 L71.4785 49.7812 L72.541 49.7812 L72.541 56 L71.4785 56 ZM73.7539 52.8906 Q73.7539 51.1562 74.707 50.3281 Q75.5039 49.6406 76.6602 49.6406 Q77.9414 49.6406 78.7539 50.4844 Q79.582 51.3125 79.582 52.7969 Q79.582 54 79.2227 54.6875 Q78.8633 55.375 78.1602 55.7656 Q77.4727 56.1406 76.6602 56.1406 Q75.3633 56.1406 74.5508 55.3125 Q73.7539 54.4688 73.7539 52.8906 ZM74.832 52.8906 Q74.832 54.0781 75.3477 54.6719 Q75.8789 55.2656 76.6602 55.2656 Q77.457 55.2656 77.9727 54.6719 Q78.4883 54.0781 78.4883 52.8594 Q78.4883 51.7031 77.957 51.1094 Q77.4414 50.5156 76.6602 50.5156 Q75.8789 50.5156 75.3477 51.1094 Q74.832 51.6875 74.832 52.8906 ZM80.8184 56 L80.8184 49.7812 L81.7559 49.7812 L81.7559 50.6562 Q82.4434 49.6406 83.7402 49.6406 Q84.3027 49.6406 84.7715 49.8438 Q85.2559 50.0469 85.4902 50.375 Q85.7246 50.7031 85.8184 51.1406 Q85.8652 51.4375 85.8652 52.1719 L85.8652 56 L84.8184 56 L84.8184 52.2188 Q84.8184 51.5625 84.6934 51.25 Q84.5684 50.9375 84.2559 50.75 Q83.9434 50.5469 83.5215 50.5469 Q82.8496 50.5469 82.3496 50.9844 Q81.8652 51.4062 81.8652 52.5938 L81.8652 56 L80.8184 56 ZM91.5547 55.2344 Q90.9609 55.7344 90.4141 55.9375 Q89.8828 56.1406 89.2578 56.1406 Q88.2266 56.1406 87.6797 55.6406 Q87.1328 55.1406 87.1328 54.3594 Q87.1328 53.9062 87.3359 53.5312 Q87.5391 53.1406 87.8828 52.9219 Q88.2266 52.6875 88.6484 52.5781 Q88.9453 52.4844 89.5859 52.4062 Q90.8516 52.2656 91.4609 52.0469 Q91.4609 51.8281 91.4609 51.7812 Q91.4609 51.125 91.1641 50.8594 Q90.7578 50.5156 89.9609 50.5156 Q89.2266 50.5156 88.8672 50.7812 Q88.5078 51.0312 88.3359 51.6875 L87.3047 51.5469 Q87.4453 50.8906 87.7734 50.4844 Q88.1016 50.0781 88.7109 49.8594 Q89.3203 49.6406 90.1172 49.6406 Q90.9141 49.6406 91.4141 49.8281 Q91.9141 50.0156 92.1484 50.2969 Q92.3828 50.5781 92.4766 51.0156 Q92.5234 51.2812 92.5234 51.9844 L92.5234 53.3906 Q92.5234 54.8594 92.5859 55.25 Q92.6641 55.6406 92.8672 56 L91.7578 56 Q91.6016 55.6719 91.5547 55.2344 ZM91.4609 52.875 Q90.8828 53.1094 89.7422 53.2812 Q89.0859 53.375 88.8203 53.5 Q88.5547 53.6094 88.3984 53.8281 Q88.2578 54.0469 88.2578 54.3281 Q88.2578 54.75 88.5703 55.0312 Q88.8984 55.3125 89.5078 55.3125 Q90.1172 55.3125 90.5859 55.0469 Q91.0703 54.7812 91.2891 54.3125 Q91.4609 53.9531 91.4609 53.2656 L91.4609 52.875 ZM94.1348 56 L94.1348 47.4062 L95.1973 47.4062 L95.1973 56 L94.1348 56 ZM96.832 48.625 L96.832 47.4062 L97.8945 47.4062 L97.8945 48.625 L96.832 48.625 ZM96.832 56 L96.832 49.7812 L97.8945 49.7812 L97.8945 56 L96.832 56 ZM101.7949 55.0625 L101.9512 55.9844 Q101.498 56.0781 101.1543 56.0781 Q100.5762 56.0781 100.2637 55.9062 Q99.9512 55.7188 99.8105 55.4219 Q99.6855 55.125 99.6855 54.1719 L99.6855 50.5938 L98.9199 50.5938 L98.9199 49.7812 L99.6855 49.7812 L99.6855 48.2344 L100.7324 47.6094 L100.7324 49.7812 L101.7949 49.7812 L101.7949 50.5938 L100.7324 50.5938 L100.7324 54.2344 Q100.7324 54.6875 100.7793 54.8125 Q100.8418 54.9375 100.9668 55.0156 Q101.0918 55.0938 101.3262 55.0938 Q101.5137 55.0938 101.7949 55.0625 ZM107.082 54 L108.1758 54.125 Q107.9258 55.0781 107.2227 55.6094 Q106.5195 56.1406 105.4414 56.1406 Q104.082 56.1406 103.2695 55.2969 Q102.4727 54.4531 102.4727 52.9375 Q102.4727 51.375 103.2852 50.5156 Q104.0977 49.6406 105.3789 49.6406 Q106.6289 49.6406 107.4102 50.4844 Q108.207 51.3281 108.207 52.875 Q108.207 52.9688 108.207 53.1562 L103.5664 53.1562 Q103.6289 54.1875 104.1445 54.7344 Q104.6602 55.2656 105.4414 55.2656 Q106.0195 55.2656 106.4258 54.9688 Q106.8477 54.6562 107.082 54 ZM103.6289 52.2969 L107.0977 52.2969 Q107.0352 51.5 106.707 51.1094 Q106.1914 50.5 105.3945 50.5 Q104.6602 50.5 104.1602 50.9844 Q103.6758 51.4688 103.6289 52.2969 ZM109.5059 48.625 L109.5059 47.4062 L110.5684 47.4062 L110.5684 48.625 L109.5059 48.625 ZM109.5059 56 L109.5059 49.7812 L110.5684 49.7812 L110.5684 56 L109.5059 56 ZM114.4688 55.0625 L114.625 55.9844 Q114.1719 56.0781 113.8281 56.0781 Q113.25 56.0781 112.9375 55.9062 Q112.625 55.7188 112.4844 55.4219 Q112.3594 55.125 112.3594 54.1719 L112.3594 50.5938 L111.5938 50.5938 L111.5938 49.7812 L112.3594 49.7812 L112.3594 48.2344 L113.4062 47.6094 L113.4062 49.7812 L114.4688 49.7812 L114.4688 50.5938 L113.4062 50.5938 L113.4062 54.2344 Q113.4062 54.6875 113.4531 54.8125 Q113.5156 54.9375 113.6406 55.0156 Q113.7656 55.0938 114 55.0938 Q114.1875 55.0938 114.4688 55.0625 Z" stroke-width="1" clip-path="url(#clipPath4)" stroke="none"
    /></g
    ><g fill="rgb(29,29,29)" text-rendering="optimizeLegibility" font-family="'Segoe UI'" stroke-linecap="butt" stroke="rgb(29,29,29)"
    ><path fill="none" d="M75 120 L75 90" clip-path="url(#clipPath5)"
      /><path fill="none" d="M75 90 L71 99" clip-path="url(#clipPath6)"
    /></g
  ></g
></svg
>
