{
  "version": 10,
  "style": "ORM",
  "scale100Multiplier": 1,
  "scale100Divisor": 5,
  "scaleZoomMultiplier": 140,
  "scaleZoomDivisor": 500,
  "scalePrintMultiplier": 1,
  "scalePrintDivisor": 1,
  "allowPaperChange": true,
  "scrollBarLeft": 0,
  "scrollBarTop": 0,
  "defaultObjects": [
  ],
  "classDiagramVersion": 1,
  "objects": [
    {
      "type": "ClaimType",
      "name": "Persoon",
      "left": 290,
      "top": 850
    },
    {
      "type": "ClaimType",
      "name": "Persoon\\Voornaam",
      "left": 1130,
      "top": 910
    },
    {
      "type": "ClaimType",
      "name": "Persoon\\Voorvoegsel",
      "left": 1170,
      "top": 1350
    },
    {
      "type": "ClaimType",
      "name": "Persoon\\Achternaam",
      "left": 1190,
      "top": 540
    }
  ],
  "referenceLines": [
    {
      "from": "Persoon\\Voornaam",
      "to": "Persoon",
      "referencingAttribute": "Persoon",
      "type": "straight",
      "style": "solid",
      "connectors": [
      ],
      "comment": "",
      "masterCardText": "",
      "detailCardText": "",
      "fromComment": "",
      "toComment": "",
      "minMasters": 1,
      "maxMasters": 1,
      "minDetails": 0,
      "maxDetails": -2
    },
    {
      "from": "Persoon\\Voorvoegsel",
      "to": "Persoon",
      "referencingAttribute": "Persoon",
      "type": "straight",
      "style": "solid",
      "connectors": [
      ],
      "comment": "",
      "masterCardText": "",
      "detailCardText": "",
      "fromComment": "",
      "toComment": "",
      "minMasters": 1,
      "maxMasters": 1,
      "minDetails": 0,
      "maxDetails": -2
    },
    {
      "from": "Persoon\\Achternaam",
      "to": "Persoon",
      "referencingAttribute": "Persoon",
      "type": "straight",
      "style": "solid",
      "connectors": [
      ],
      "comment": "",
      "masterCardText": "",
      "detailCardText": "",
      "fromComment": "",
      "toComment": "",
      "minMasters": 1,
      "maxMasters": 1,
      "minDetails": 0,
      "maxDetails": -2
    }
  ],
  "subtypeLines": [
  ]
}
