{
  "version" : 11,
  "style" : "ORM",
  "scale100Multiplier" : 1,
  "scale100Divisor" : 5,
  "scaleZoomMultiplier" : 120,
  "scaleZoomDivisor" : 500,
  "scalePrintMultiplier" : 1,
  "scalePrintDivisor" : 1,
  "allowPaperChange" : true,
  "scrollBarLeft" : 0,
  "scrollBarTop" : 0,
  "defaultObjects" : [
  ],
  "classDiagramVersion" : 1,
  "objects" : [
    {
      "type" : "LabelType",
      "name" : "personID",
      "left" : 2850,
      "top" : 1400
    },
    {
      "type" : "ClaimType",
      "name" : "Person",
      "left" : 2850,
      "top" : 1940
    },
    {
      "type" : "LabelType",
      "name" : "firstName",
      "left" : 4120,
      "top" : 1570
    },
    {
      "type" : "ClaimType",
      "name" : "Person/FirstName",
      "left" : 3520,
      "top" : 1620
    },
    {
      "type" : "LabelType",
      "name" : "lastName",
      "left" : 4120,
      "top" : 2050
    },
    {
      "type" : "ClaimType",
      "name" : "Person/LastName",
      "left" : 3510,
      "top" : 2110
    },
    {
      "type" : "LabelType",
      "name" : "buildingID",
      "left" : 440,
      "top" : 170
    },
    {
      "type" : "ClaimType",
      "name" : "Building",
      "left" : 430,
      "top" : 690
    },
    {
      "type" : "LabelType",
      "name" : "addressID",
      "left" : 2190,
      "top" : 180
    },
    {
      "type" : "ClaimType",
      "name" : "Address",
      "left" : 2170,
      "top" : 690
    },
    {
      "type" : "LabelType",
      "name" : "postalCode",
      "left" : 3600,
      "top" : 400
    },
    {
      "type" : "ClaimType",
      "name" : "Address/PostalCode",
      "left" : 2830,
      "top" : 460
    },
    {
      "type" : "LabelType",
      "name" : "streetName",
      "left" : 3600,
      "top" : 820
    },
    {
      "type" : "ClaimType",
      "name" : "Address/StreetName",
      "left" : 2850,
      "top" : 880
    },
    {
      "type" : "ClaimType",
      "name" : "Building/Address",
      "left" : 1240,
      "top" : 700
    },
    {
      "type" : "ClaimType",
      "name" : "Building/Ownership",
      "left" : 1420,
      "top" : 1480
    },
    {
      "type" : "LabelType",
      "name" : "percentage",
      "left" : 2370,
      "top" : 2020
    },
    {
      "type" : "ClaimType",
      "name" : "Building/Ownership/Percentage",
      "left" : 1400,
      "top" : 2080
    },
    {
      "type" : "ClaimType",
      "name" : "Student",
      "left" : 2880,
      "top" : 3000
    },
    {
      "type" : "LabelType",
      "name" : "apartmentID",
      "left" : 490,
      "top" : 2410
    },
    {
      "type" : "ClaimType",
      "name" : "Apartment",
      "left" : 450,
      "top" : 3000
    },
    {
      "type" : "ClaimType",
      "name" : "Apartment/Building",
      "left" : 330,
      "top" : 1960
    },
    {
      "type" : "ClaimType",
      "name" : "Apartment/Tenant",
      "left" : 1480,
      "top" : 3000
    }
  ],
  "referenceLines" : [
    {
      "from" : "Person",
      "to" : "personID",
      "referencingAttribute" : "personID",
      "type" : "straight",
      "style" : "solid",
      "connectors" : [
      ],
      "comment" : "",
      "masterCardText" : "",
      "detailCardText" : "",
      "fromComment" : "",
      "toComment" : "",
      "minMasters" : -1,
      "maxMasters" : -1,
      "minDetails" : -1,
      "maxDetails" : -1
    },
    {
      "from" : "Person/FirstName",
      "to" : "Person",
      "referencingAttribute" : "Person",
      "type" : "straight",
      "style" : "solid",
      "connectors" : [
      ],
      "comment" : "",
      "masterCardText" : "",
      "detailCardText" : "",
      "fromComment" : "",
      "toComment" : "",
      "minMasters" : 1,
      "maxMasters" : 1,
      "minDetails" : 1,
      "maxDetails" : -2
    },
    {
      "from" : "Person/FirstName",
      "to" : "firstName",
      "referencingAttribute" : "firstName",
      "type" : "straight",
      "style" : "solid",
      "connectors" : [
      ],
      "comment" : "",
      "masterCardText" : "",
      "detailCardText" : "",
      "fromComment" : "",
      "toComment" : "",
      "minMasters" : -1,
      "maxMasters" : -1,
      "minDetails" : -1,
      "maxDetails" : -1
    },
    {
      "from" : "Person/LastName",
      "to" : "Person",
      "referencingAttribute" : "Person",
      "type" : "straight",
      "style" : "solid",
      "connectors" : [
      ],
      "comment" : "",
      "masterCardText" : "",
      "detailCardText" : "",
      "fromComment" : "",
      "toComment" : "",
      "minMasters" : 1,
      "maxMasters" : 1,
      "minDetails" : 1,
      "maxDetails" : -2
    },
    {
      "from" : "Person/LastName",
      "to" : "lastName",
      "referencingAttribute" : "lastName",
      "type" : "straight",
      "style" : "solid",
      "connectors" : [
      ],
      "comment" : "",
      "masterCardText" : "",
      "detailCardText" : "",
      "fromComment" : "",
      "toComment" : "",
      "minMasters" : -1,
      "maxMasters" : -1,
      "minDetails" : -1,
      "maxDetails" : -1
    },
    {
      "from" : "Building",
      "to" : "buildingID",
      "referencingAttribute" : "buildingID",
      "type" : "straight",
      "style" : "solid",
      "connectors" : [
      ],
      "comment" : "",
      "masterCardText" : "",
      "detailCardText" : "",
      "fromComment" : "",
      "toComment" : "",
      "minMasters" : -1,
      "maxMasters" : -1,
      "minDetails" : -1,
      "maxDetails" : -1
    },
    {
      "from" : "Address",
      "to" : "addressID",
      "referencingAttribute" : "addressID",
      "type" : "straight",
      "style" : "solid",
      "connectors" : [
      ],
      "comment" : "",
      "masterCardText" : "",
      "detailCardText" : "",
      "fromComment" : "",
      "toComment" : "",
      "minMasters" : -1,
      "maxMasters" : -1,
      "minDetails" : -1,
      "maxDetails" : -1
    },
    {
      "from" : "Address/PostalCode",
      "to" : "Address",
      "referencingAttribute" : "Address",
      "type" : "straight",
      "style" : "solid",
      "connectors" : [
      ],
      "comment" : "",
      "masterCardText" : "",
      "detailCardText" : "",
      "fromComment" : "",
      "toComment" : "",
      "minMasters" : 1,
      "maxMasters" : 1,
      "minDetails" : 1,
      "maxDetails" : -2
    },
    {
      "from" : "Address/PostalCode",
      "to" : "postalCode",
      "referencingAttribute" : "postalCode",
      "type" : "straight",
      "style" : "solid",
      "connectors" : [
      ],
      "comment" : "",
      "masterCardText" : "",
      "detailCardText" : "",
      "fromComment" : "",
      "toComment" : "",
      "minMasters" : -1,
      "maxMasters" : -1,
      "minDetails" : -1,
      "maxDetails" : -1
    },
    {
      "from" : "Address/StreetName",
      "to" : "Address",
      "referencingAttribute" : "Address",
      "type" : "straight",
      "style" : "solid",
      "connectors" : [
      ],
      "comment" : "",
      "masterCardText" : "",
      "detailCardText" : "",
      "fromComment" : "",
      "toComment" : "",
      "minMasters" : 1,
      "maxMasters" : 1,
      "minDetails" : 1,
      "maxDetails" : -2
    },
    {
      "from" : "Address/StreetName",
      "to" : "streetName",
      "referencingAttribute" : "streetName",
      "type" : "straight",
      "style" : "solid",
      "connectors" : [
      ],
      "comment" : "",
      "masterCardText" : "",
      "detailCardText" : "",
      "fromComment" : "",
      "toComment" : "",
      "minMasters" : -1,
      "maxMasters" : -1,
      "minDetails" : -1,
      "maxDetails" : -1
    },
    {
      "from" : "Building/Address",
      "to" : "Building",
      "referencingAttribute" : "Building",
      "type" : "straight",
      "style" : "solid",
      "connectors" : [
      ],
      "comment" : "",
      "masterCardText" : "",
      "detailCardText" : "",
      "fromComment" : "",
      "toComment" : "",
      "minMasters" : 1,
      "maxMasters" : 1,
      "minDetails" : 0,
      "maxDetails" : -2
    },
    {
      "from" : "Building/Address",
      "to" : "Address",
      "referencingAttribute" : "Address",
      "type" : "straight",
      "style" : "solid",
      "connectors" : [
      ],
      "comment" : "",
      "masterCardText" : "",
      "detailCardText" : "",
      "fromComment" : "",
      "toComment" : "",
      "minMasters" : 1,
      "maxMasters" : 1,
      "minDetails" : 0,
      "maxDetails" : -2
    },
    {
      "from" : "Building/Ownership",
      "to" : "Building",
      "referencingAttribute" : "Building",
      "type" : "straight",
      "style" : "solid",
      "connectors" : [
        {
          "x" : 1060,
          "y" : 1560,
          "autoPosition" : false
        }
      ],
      "comment" : "",
      "masterCardText" : "",
      "detailCardText" : "",
      "fromComment" : "",
      "toComment" : "",
      "minMasters" : 1,
      "maxMasters" : 1,
      "minDetails" : 0,
      "maxDetails" : -2
    },
    {
      "from" : "Building/Ownership",
      "to" : "Person",
      "referencingAttribute" : "Person",
      "type" : "straight",
      "style" : "solid",
      "connectors" : [
        {
          "x" : 2360,
          "y" : 1560,
          "autoPosition" : false
        }
      ],
      "comment" : "",
      "masterCardText" : "",
      "detailCardText" : "",
      "fromComment" : "",
      "toComment" : "",
      "minMasters" : 1,
      "maxMasters" : 1,
      "minDetails" : 0,
      "maxDetails" : -2
    },
    {
      "from" : "Building/Ownership/Percentage",
      "to" : "Building/Ownership",
      "referencingAttribute" : "Building/Ownership",
      "type" : "straight",
      "style" : "solid",
      "connectors" : [
      ],
      "comment" : "",
      "masterCardText" : "",
      "detailCardText" : "",
      "fromComment" : "",
      "toComment" : "",
      "minMasters" : 1,
      "maxMasters" : 1,
      "minDetails" : 0,
      "maxDetails" : -2
    },
    {
      "from" : "Building/Ownership/Percentage",
      "to" : "percentage",
      "referencingAttribute" : "percentage",
      "type" : "straight",
      "style" : "solid",
      "connectors" : [
      ],
      "comment" : "",
      "masterCardText" : "",
      "detailCardText" : "",
      "fromComment" : "",
      "toComment" : "",
      "minMasters" : -1,
      "maxMasters" : -1,
      "minDetails" : -1,
      "maxDetails" : -1
    },
    {
      "from" : "Student",
      "to" : "Person",
      "referencingAttribute" : "Person",
      "type" : "straight",
      "style" : "solid",
      "connectors" : [
      ],
      "comment" : "",
      "masterCardText" : "",
      "detailCardText" : "",
      "fromComment" : "",
      "toComment" : "",
      "minMasters" : 1,
      "maxMasters" : 1,
      "minDetails" : 0,
      "maxDetails" : -2
    },
    {
      "from" : "Apartment",
      "to" : "apartmentID",
      "referencingAttribute" : "apartmentID",
      "type" : "straight",
      "style" : "solid",
      "connectors" : [
      ],
      "comment" : "",
      "masterCardText" : "",
      "detailCardText" : "",
      "fromComment" : "",
      "toComment" : "",
      "minMasters" : -1,
      "maxMasters" : -1,
      "minDetails" : -1,
      "maxDetails" : -1
    },
    {
      "from" : "Apartment/Building",
      "to" : "Apartment",
      "referencingAttribute" : "Apartment",
      "type" : "straight",
      "style" : "solid",
      "connectors" : [
        {
          "x" : 160,
          "y" : 2040,
          "autoPosition" : false
        },
        {
          "x" : 160,
          "y" : 3080,
          "autoPosition" : false
        }
      ],
      "comment" : "",
      "masterCardText" : "",
      "detailCardText" : "",
      "fromComment" : "",
      "toComment" : "",
      "minMasters" : 1,
      "maxMasters" : 1,
      "minDetails" : 0,
      "maxDetails" : -2
    },
    {
      "from" : "Apartment/Building",
      "to" : "Building",
      "referencingAttribute" : "Building",
      "type" : "straight",
      "style" : "solid",
      "connectors" : [
      ],
      "comment" : "",
      "masterCardText" : "",
      "detailCardText" : "",
      "fromComment" : "",
      "toComment" : "",
      "minMasters" : 1,
      "maxMasters" : 1,
      "minDetails" : 0,
      "maxDetails" : -2
    },
    {
      "from" : "Apartment/Tenant",
      "to" : "Apartment",
      "referencingAttribute" : "Apartment",
      "type" : "straight",
      "style" : "solid",
      "connectors" : [
      ],
      "comment" : "",
      "masterCardText" : "",
      "detailCardText" : "",
      "fromComment" : "",
      "toComment" : "",
      "minMasters" : 1,
      "maxMasters" : 1,
      "minDetails" : 0,
      "maxDetails" : -2
    },
    {
      "from" : "Apartment/Tenant",
      "to" : "Student",
      "referencingAttribute" : "Student",
      "type" : "straight",
      "style" : "solid",
      "connectors" : [
      ],
      "comment" : "",
      "masterCardText" : "",
      "detailCardText" : "",
      "fromComment" : "",
      "toComment" : "",
      "minMasters" : 1,
      "maxMasters" : 1,
      "minDetails" : 0,
      "maxDetails" : -2
    }
  ],
  "subtypeLines" : [
  ]
}
