{
    "validFrom": 8,
    "document": {
        "ID": "GW",
        "omschrijving": "Akte geslachtswijzing"
    },
    "persoon": {
        "ID": "p1",
        "geslacht": "V",
        "voornaam": "Eve"
    }
}