{
    "validFrom": 1,
    "document": {
        "ID": "AD",
        "omschrijving": "Adoptieakte"
    },
    "persoon": {
        "ID": "p1",
        "voornaam": "Evan",
        "achternaam": "Taylor"
    }
}