{
  "version": 10,
  "style": "UML-IM",
  "scale100Multiplier": 1,
  "scale100Divisor": 5,
  "scaleZoomMultiplier": 200,
  "scaleZoomDivisor": 500,
  "scalePrintMultiplier": 1,
  "scalePrintDivisor": 1,
  "allowPaperChange": true,
  "scrollBarLeft": 0,
  "scrollBarTop": 0,
  "defaultObjects": [
  ],
  "classDiagramVersion": 1,
  "objects": [
    {
      "type": "Class",
      "name": "Address",
      "left": 1300,
      "top": 370
    },
    {
      "type": "Class",
      "name": "Apartment",
      "left": 220,
      "top": 1620
    },
    {
      "type": "Class",
      "name": "Building",
      "left": 240,
      "top": 220
    },
    {
      "type": "Class",
      "name": "Building\/Ownership",
      "left": 1330,
      "top": 1070
    },
    {
      "type": "Class",
      "name": "Person",
      "left": 2380,
      "top": 750
    },
    {
      "type": "Class",
      "name": "Student",
      "left": 2430,
      "top": 1720
    }
  ],
  "referenceLines": [
    {
      "from": "Building",
      "to": "Address",
      "referencingAttribute": "Address",
      "type": "straight",
      "style": "solid",
      "connectors": [
      ],
      "comment": "",
      "masterCardText": "0..1",
      "detailCardText": "*",
      "fromComment": "",
      "toComment": "",
      "minMasters": 0,
      "maxMasters": 1,
      "minDetails": 0,
      "maxDetails": -2
    },
    {
      "from": "Apartment",
      "to": "Building",
      "referencingAttribute": "Building",
      "type": "straight",
      "style": "solid",
      "connectors": [
      ],
      "comment": "",
      "masterCardText": "0..1",
      "detailCardText": "*",
      "fromComment": "",
      "toComment": "",
      "minMasters": 0,
      "maxMasters": 1,
      "minDetails": 0,
      "maxDetails": -2
    },
    {
      "from": "Building\/Ownership",
      "to": "Building",
      "referencingAttribute": "Building",
      "type": "straight",
      "style": "solid",
      "connectors": [
        {
          "x": 860,
          "y": 910,
          "autoPosition": false
        }
      ],
      "comment": "",
      "masterCardText": "1",
      "detailCardText": "*",
      "fromComment": "",
      "toComment": "",
      "minMasters": 1,
      "maxMasters": 1,
      "minDetails": 0,
      "maxDetails": -2
    },
    {
      "from": "Building\/Ownership",
      "to": "Person",
      "referencingAttribute": "Person",
      "type": "straight",
      "style": "solid",
      "connectors": [
      ],
      "comment": "",
      "masterCardText": "1",
      "detailCardText": "*",
      "fromComment": "",
      "toComment": "",
      "minMasters": 1,
      "maxMasters": 1,
      "minDetails": 0,
      "maxDetails": -2
    },
    {
      "from": "Student",
      "to": "Person",
      "referencingAttribute": "Person",
      "type": "straight",
      "style": "solid",
      "connectors": [
      ],
      "comment": "",
      "masterCardText": "1",
      "detailCardText": "*",
      "fromComment": "",
      "toComment": "",
      "minMasters": 1,
      "maxMasters": 1,
      "minDetails": 0,
      "maxDetails": -2
    },
    {
      "from": "Apartment",
      "to": "Student",
      "referencingAttribute": "Student",
      "type": "straight",
      "style": "solid",
      "connectors": [
      ],
      "comment": "",
      "masterCardText": "0..1",
      "detailCardText": "*",
      "fromComment": "",
      "toComment": "",
      "minMasters": 0,
      "maxMasters": 1,
      "minDetails": 0,
      "maxDetails": -2
    }
  ],
  "subtypeLines": [
  ]
}
