<?xml version="1.0" encoding="UTF-8"?>
<svg width="245.24" height="66.377" color-interpolation-filters="sRGB" data-v-6805eed4="" preserveAspectRatio="xMidYMid" version="1.0" viewBox="0 0 245.24 66.377" xmlns="http://www.w3.org/2000/svg">
 <g transform="translate(67 10.938)" fill="#b22166" fill-rule="">
  <g class="tp-name iconsvg-namesvg" data-gra="path-name">
   <path transform="translate(-1.03 24.14)" d="m3.2-18.53v14.69h-2.17v3.84h8.92v-3.84h-1.97v-4.37h3.87l4.41 8.21h5.57v-3.84h-2.6l-2.81-5.07c2.67-1.04 4.34-3.01 4.34-6.45 0-5.07-3.67-7.01-8.84-7.01h-10.89v3.84zm4.78 0h3.94c2.6 0 4.37 0.9 4.37 3.47 0 2.54-1.8 3.51-4.37 3.51h-3.94zm15.32 1.37v3.37h2.24v10.38h-2.24v3.41h9.01v-3.41h-2.23v-13.75zm1.04-4.54c0 1.7 1.26 2.5 3.27 2.5 2 0 3.3-0.8 3.3-2.5 0-1.63-1.3-2.44-3.3-2.44-2.01 0-3.27 0.81-3.27 2.44zm8.58 26.87c0.9 0.4 2.4 0.77 3.7 0.77 4.37 0 5.41-3.8 5.41-7.48v-15.62h-6.78v3.37h2.24v12.29c0 2.27-0.67 3.24-1.7 3.34-0.84 0-1.57-0.27-2.34-0.64zm6.37-29.31c-2 0-3.27 0.81-3.27 2.44 0 1.7 1.27 2.5 3.27 2.5 1.97 0 3.31-0.8 3.31-2.5 0-1.63-1.34-2.44-3.31-2.44zm12.42 24.14v-7.24h1.3l5.08 7.24h5.9v-3.41h-3.3l-3.81-5.34 4.74-5.04h2.11v-3.37h-9.02v3.37h1.87l-3.23 3.57h-1.64v-13.35h-6.71v3.37h2.17v16.79h-2.17v3.41zm21.3-17.43c-4.94 0-7.38 1.94-7.38 5.04 0 5.75 9.45 5.11 9.45 7.68 0 1.34-1.04 1.71-2.74 1.71-1.03 0-1.94-0.17-2.9-0.41l-0.24-2.5h-3.44v4.94c1.87 0.64 4.41 1.24 7.08 1.24 4.91 0 6.84-1.84 6.84-4.91 0-5.81-9.44-5.14-9.44-8.05 0-1.23 1.23-1.56 3.1-1.56 0.8 0 1.54 0.03 2.24 0.26l0.23 2.51h3.24v-4.78c-1.3-0.53-3.5-1.17-6.04-1.17zm8.51 8.78c0 5.75 3.14 8.92 7.45 8.92 2.03 0 3.8-0.74 5.1-2.11v1.84h6.71v-3.41h-2.17v-20.16h-6.74v3.37h2.2v4.91c-1.23-1.43-3-2.14-5.1-2.14-4.31 0-7.45 3.18-7.45 8.78zm4.67 0.1c0-3.07 1.74-4.84 4.14-4.84 1.84 0 3.24 1.07 3.74 2.91v3.97c-0.5 1.84-1.97 2.87-3.74 2.87-2.4 0-4.14-1.83-4.14-4.91zm15.99-8.61v3.37h2.24v10.38h-2.24v3.41h9.02v-3.41h-2.24v-13.75zm1.04-4.54c0 1.7 1.27 2.5 3.27 2.5s3.31-0.8 3.31-2.5c0-1.63-1.31-2.44-3.31-2.44s-3.27 0.81-3.27 2.44zm8.88 13.05c0 5.75 3.6 8.92 8.78 8.92 3.1 0 5.27-0.97 7.04-2.47l-1.07-3.58c-1.43 1.17-2.9 2.11-5 2.11-2.67 0-4.31-1.3-4.88-3.44h11.75c0.04-0.5 0.07-1.5 0.07-1.94 0-4.9-2.54-8.38-8.01-8.38-4.98 0-8.68 3.18-8.68 8.78zm4.74-1.16c0.37-2.44 1.94-3.94 4.07-3.94 2.77 0 4.08 1.93 4.08 3.94zm13.22-7.32v3.38h2.17v10.34h-2.17v3.41h8.91v-3.41h-2.2v-7.61c0.63-1.47 1.64-2.77 3.24-2.77 2.13 0 3.17 1.51 3.17 4.71v9.08h6.71v-3.41h-2.17v-6.81c0-4.7-2.34-7.24-6.34-7.24-2.01 0-3.51 0.87-4.61 2.07v-1.74zm28.84-0.3c-4.94 0-7.38 1.94-7.38 5.04 0 5.75 9.45 5.11 9.45 7.68 0 1.34-1.03 1.71-2.74 1.71-1.03 0-1.93-0.17-2.9-0.41l-0.23-2.5h-3.44v4.94c1.87 0.64 4.4 1.24 7.08 1.24 4.9 0 6.84-1.84 6.84-4.91 0-5.81-9.45-5.14-9.45-8.05 0-1.23 1.24-1.56 3.11-1.56 0.8 0 1.53 0.03 2.23 0.26l0.24 2.51h3.23v-4.78c-1.3-0.53-3.5-1.17-6.04-1.17zm7.95 0.27v3.37h2.63v6.45c0 5.34 1.97 7.67 5.41 7.67 1.3 0 2.74-0.3 4.38-0.9l-0.54-4c-1.03 0.36-1.87 0.6-2.64 0.6-1.3 0-2.07-0.8-2.07-3.24v-6.58h4.81v-3.37h-4.81v-5.01h-4.54v5.01z"/>
  </g>
  <g class="tp-slogan iconsvg-slogansvg" transform="translate(16.56 36.08)" fill="#391561" data-gra="path-slogan">
   <path transform="translate(0,8.28)" d="m0-7.87 2.52 7.87h1.16l2.5-7.87h-1.02l-1.26 4.25c-0.14 0.47-0.26 0.9-0.37 1.3s-0.24 0.84-0.39 1.3h-0.04c-0.16-0.46-0.29-0.9-0.39-1.3-0.11-0.4-0.24-0.83-0.38-1.3l-1.26-4.25zm10.04 8.01c0.5 0 0.95-0.09 1.37-0.28 0.41-0.2 0.76-0.47 1.06-0.83 0.3-0.35 0.54-0.78 0.7-1.29s0.25-1.08 0.25-1.71-0.09-1.19-0.25-1.69-0.4-0.92-0.7-1.27-0.65-0.62-1.06-0.8c-0.42-0.19-0.87-0.29-1.37-0.29-0.49 0-0.95 0.1-1.36 0.28s-0.76 0.45-1.06 0.8-0.53 0.77-0.69 1.27-0.25 1.07-0.25 1.7 0.09 1.2 0.25 1.71 0.39 0.94 0.69 1.29c0.3 0.36 0.65 0.63 1.06 0.83 0.41 0.19 0.87 0.28 1.36 0.28zm0-0.87c-0.35 0-0.67-0.08-0.95-0.23s-0.53-0.37-0.73-0.65c-0.21-0.29-0.36-0.63-0.48-1.02-0.11-0.4-0.16-0.85-0.16-1.34s0.05-0.93 0.16-1.32c0.12-0.39 0.27-0.73 0.48-1 0.2-0.27 0.45-0.48 0.73-0.63s0.6-0.22 0.95-0.22c0.36 0 0.67 0.07 0.96 0.22 0.28 0.15 0.53 0.36 0.73 0.63s0.36 0.61 0.47 1c0.12 0.39 0.17 0.83 0.17 1.32s-0.05 0.94-0.17 1.34c-0.11 0.39-0.27 0.73-0.47 1.02-0.2 0.28-0.45 0.5-0.73 0.65-0.29 0.15-0.6 0.23-0.96 0.23zm7.97 0.87c0.5 0 0.95-0.09 1.36-0.28 0.42-0.2 0.77-0.47 1.07-0.83 0.3-0.35 0.53-0.78 0.7-1.29 0.16-0.51 0.24-1.08 0.24-1.71s-0.08-1.19-0.24-1.69c-0.17-0.5-0.4-0.92-0.7-1.27s-0.65-0.62-1.07-0.8c-0.41-0.19-0.86-0.29-1.36-0.29-0.49 0-0.95 0.1-1.36 0.28s-0.77 0.45-1.06 0.8c-0.3 0.35-0.53 0.77-0.69 1.27-0.17 0.5-0.25 1.07-0.25 1.7s0.08 1.2 0.25 1.71c0.16 0.51 0.39 0.94 0.69 1.29 0.29 0.36 0.65 0.63 1.06 0.83 0.41 0.19 0.87 0.28 1.36 0.28zm0-0.87c-0.35 0-0.67-0.08-0.95-0.23-0.29-0.15-0.53-0.37-0.73-0.65-0.21-0.29-0.37-0.63-0.48-1.02-0.11-0.4-0.17-0.85-0.17-1.34s0.06-0.93 0.17-1.32 0.27-0.73 0.48-1c0.2-0.27 0.44-0.48 0.73-0.63 0.28-0.15 0.6-0.22 0.95-0.22s0.67 0.07 0.96 0.22c0.28 0.15 0.52 0.36 0.73 0.63 0.2 0.27 0.36 0.61 0.47 1s0.17 0.83 0.17 1.32-0.06 0.94-0.17 1.34c-0.11 0.39-0.27 0.73-0.47 1.02-0.21 0.28-0.45 0.5-0.73 0.65-0.29 0.15-0.61 0.23-0.96 0.23zm6.06-3.41v-2.93h1.32c0.62 0 1.09 0.11 1.42 0.31 0.33 0.21 0.49 0.58 0.49 1.1 0 0.51-0.16 0.89-0.49 1.14s-0.8 0.38-1.42 0.38zm3.33 4.14h1.12l-1.99-3.43c0.54-0.14 0.97-0.39 1.29-0.76s0.48-0.86 0.48-1.47c0-0.41-0.07-0.76-0.21-1.04-0.13-0.28-0.32-0.5-0.57-0.68-0.24-0.18-0.53-0.3-0.87-0.38-0.34-0.07-0.71-0.11-1.11-0.11h-2.46v7.87h0.99v-3.32h1.43zm6.07-4.14v-2.93h1.32c0.61 0 1.09 0.11 1.41 0.31 0.33 0.21 0.5 0.58 0.5 1.1 0 0.51-0.17 0.89-0.5 1.14-0.32 0.25-0.8 0.38-1.41 0.38zm3.32 4.14h1.13l-1.99-3.43c0.53-0.14 0.96-0.39 1.28-0.76s0.48-0.86 0.48-1.47c0-0.41-0.07-0.76-0.2-1.04-0.14-0.28-0.33-0.5-0.57-0.68-0.25-0.18-0.54-0.3-0.88-0.38-0.34-0.07-0.71-0.11-1.11-0.11h-2.46v7.87h1v-3.32h1.43zm2.65-7.87v7.87h4.66v-0.85h-3.66v-2.86h2.99v-0.85h-2.99v-2.47h3.54v-0.84zm9.68 4.67h-2.37l0.37-1.2c0.15-0.44 0.28-0.88 0.41-1.32 0.13-0.43 0.25-0.88 0.37-1.34h0.05c0.13 0.46 0.26 0.91 0.39 1.34 0.12 0.44 0.26 0.88 0.4 1.32zm0.25 0.8 0.74 2.4h1.07l-2.66-7.87h-1.13l-2.67 7.87h1.02l0.76-2.4zm2.93-5.47v7.87h4.44v-0.85h-3.45v-7.02zm5.83 0v7.87h0.99v-7.87zm3.18 6.15-0.6 0.7c0.34 0.36 0.75 0.64 1.22 0.85s0.99 0.31 1.54 0.31c0.41 0 0.79-0.05 1.11-0.17 0.33-0.12 0.61-0.28 0.84-0.48 0.24-0.2 0.41-0.44 0.54-0.71 0.12-0.28 0.18-0.57 0.18-0.88 0-0.29-0.04-0.54-0.12-0.76-0.09-0.22-0.2-0.41-0.34-0.58-0.15-0.16-0.32-0.31-0.52-0.43s-0.41-0.23-0.64-0.33l-1.11-0.48c-0.16-0.06-0.32-0.13-0.47-0.21s-0.29-0.16-0.42-0.26-0.23-0.22-0.31-0.35c-0.07-0.13-0.11-0.3-0.11-0.49 0-0.36 0.13-0.64 0.4-0.84 0.27-0.21 0.62-0.31 1.06-0.31 0.37 0 0.7 0.07 0.99 0.2 0.3 0.13 0.56 0.31 0.8 0.54l0.54-0.64c-0.28-0.29-0.62-0.53-1.02-0.71s-0.83-0.27-1.31-0.27c-0.36 0-0.69 0.06-0.99 0.16s-0.56 0.25-0.78 0.44-0.39 0.41-0.51 0.66c-0.13 0.26-0.19 0.54-0.19 0.83s0.05 0.54 0.15 0.76c0.09 0.22 0.22 0.41 0.37 0.57s0.32 0.3 0.51 0.41c0.2 0.11 0.38 0.21 0.57 0.29l1.13 0.49c0.18 0.09 0.35 0.17 0.51 0.25s0.3 0.17 0.42 0.27c0.11 0.1 0.2 0.22 0.27 0.36s0.1 0.31 0.1 0.51c0 0.39-0.14 0.7-0.43 0.93-0.29 0.24-0.69 0.36-1.21 0.36-0.41 0-0.8-0.09-1.18-0.27s-0.71-0.42-0.99-0.72zm7.77-5.31v7.03h1.01v-7.03h2.38v-0.84h-5.76v0.84zm4.8-0.84v7.87h1v-7.87zm3.18 6.15-0.6 0.7c0.35 0.36 0.76 0.64 1.23 0.85s0.98 0.31 1.53 0.31c0.42 0 0.79-0.05 1.12-0.17s0.61-0.28 0.84-0.48 0.41-0.44 0.53-0.71c0.13-0.28 0.19-0.57 0.19-0.88 0-0.29-0.04-0.54-0.13-0.76-0.08-0.22-0.19-0.41-0.34-0.58-0.14-0.16-0.31-0.31-0.51-0.43s-0.42-0.23-0.64-0.33l-1.12-0.48c-0.16-0.06-0.31-0.13-0.46-0.21-0.16-0.08-0.3-0.16-0.42-0.26-0.13-0.1-0.23-0.22-0.31-0.35s-0.11-0.3-0.11-0.49c0-0.36 0.13-0.64 0.4-0.84 0.27-0.21 0.62-0.31 1.06-0.31 0.37 0 0.7 0.07 0.99 0.2s0.56 0.31 0.8 0.54l0.54-0.64c-0.28-0.29-0.62-0.53-1.02-0.71s-0.84-0.27-1.31-0.27c-0.36 0-0.69 0.06-0.99 0.16s-0.56 0.25-0.78 0.44-0.39 0.41-0.52 0.66c-0.12 0.26-0.18 0.54-0.18 0.83s0.05 0.54 0.14 0.76c0.1 0.22 0.22 0.41 0.37 0.57 0.16 0.16 0.33 0.3 0.52 0.41s0.38 0.21 0.56 0.29l1.13 0.49c0.19 0.09 0.36 0.17 0.52 0.25s0.3 0.17 0.41 0.27c0.12 0.1 0.21 0.22 0.28 0.36s0.1 0.31 0.1 0.51c0 0.39-0.14 0.7-0.43 0.93-0.29 0.24-0.69 0.36-1.21 0.36-0.41 0-0.81-0.09-1.19-0.27s-0.71-0.42-0.99-0.72zm5.93-2.22c0 0.64 0.09 1.22 0.26 1.73 0.17 0.5 0.41 0.93 0.72 1.28s0.67 0.61 1.09 0.8c0.42 0.18 0.88 0.27 1.38 0.27s0.95-0.1 1.34-0.3 0.74-0.48 1.06-0.84l-0.57-0.61c-0.25 0.28-0.52 0.5-0.81 0.65-0.28 0.15-0.62 0.23-1 0.23s-0.71-0.08-1.01-0.23-0.56-0.37-0.77-0.65c-0.2-0.28-0.37-0.62-0.48-1.01-0.12-0.4-0.18-0.84-0.18-1.34 0-0.49 0.06-0.93 0.18-1.32s0.29-0.73 0.51-1c0.21-0.28 0.47-0.49 0.78-0.64 0.3-0.15 0.64-0.22 1.02-0.22 0.33 0 0.63 0.07 0.88 0.2s0.48 0.31 0.69 0.53l0.56-0.63c-0.23-0.26-0.52-0.49-0.88-0.68-0.36-0.2-0.78-0.3-1.26-0.3-0.51 0-0.97 0.1-1.4 0.29-0.43 0.18-0.8 0.45-1.11 0.81-0.31 0.35-0.56 0.78-0.73 1.28-0.18 0.5-0.27 1.07-0.27 1.7zm7.31-3.93v7.87h1v-3.71h3.66v3.71h1v-7.87h-1v3.3h-3.66v-3.3zm7.82 0v7.87h4.66v-0.85h-3.66v-2.86h2.99v-0.85h-2.99v-2.47h3.54v-0.84zm8.75 0v7.87h2.02c0.59 0 1.11-0.09 1.57-0.27s0.84-0.44 1.15-0.78 0.55-0.76 0.71-1.25 0.24-1.05 0.24-1.67c0-1.26-0.32-2.22-0.95-2.89-0.63-0.68-1.55-1.01-2.77-1.01zm1.9 7.05h-0.9v-6.24h0.9c0.92 0 1.61 0.27 2.07 0.8 0.46 0.52 0.69 1.29 0.69 2.29s-0.23 1.77-0.69 2.33c-0.46 0.55-1.15 0.82-2.07 0.82zm5.48-7.05v7.87h4.66v-0.85h-3.66v-2.86h2.99v-0.85h-2.99v-2.47h3.54v-0.84zm6.33 0v7.87h0.92v-4.33c0-0.35-0.02-0.74-0.05-1.17-0.03-0.42-0.06-0.81-0.08-1.16h0.05l0.62 1.75 1.52 4.12h0.57l1.51-4.12 0.64-1.75h0.04c-0.03 0.35-0.06 0.74-0.09 1.16-0.02 0.43-0.04 0.82-0.04 1.17v4.33h0.95v-7.87h-1.18l-1.51 4.22-0.55 1.61h-0.05l-0.57-1.61-1.53-4.22zm11.62 8.01c0.5 0 0.95-0.09 1.37-0.28 0.41-0.2 0.76-0.47 1.06-0.83 0.3-0.35 0.54-0.78 0.7-1.29s0.25-1.08 0.25-1.71-0.09-1.19-0.25-1.69-0.4-0.92-0.7-1.27-0.65-0.62-1.06-0.8c-0.42-0.19-0.87-0.29-1.37-0.29-0.49 0-0.95 0.1-1.36 0.28s-0.76 0.45-1.06 0.8-0.53 0.77-0.69 1.27-0.25 1.07-0.25 1.7 0.09 1.2 0.25 1.71 0.39 0.94 0.69 1.29c0.3 0.36 0.65 0.63 1.06 0.83 0.41 0.19 0.87 0.28 1.36 0.28zm0-0.87c-0.35 0-0.67-0.08-0.95-0.23s-0.53-0.37-0.73-0.65c-0.21-0.29-0.36-0.63-0.48-1.02-0.11-0.4-0.16-0.85-0.16-1.34s0.05-0.93 0.16-1.32c0.12-0.39 0.27-0.73 0.48-1 0.2-0.27 0.45-0.48 0.73-0.63s0.6-0.22 0.95-0.22c0.36 0 0.67 0.07 0.96 0.22 0.28 0.15 0.53 0.36 0.73 0.63s0.36 0.61 0.47 1c0.12 0.39 0.17 0.83 0.17 1.32s-0.05 0.94-0.17 1.34c-0.11 0.39-0.27 0.73-0.47 1.02-0.2 0.28-0.45 0.5-0.73 0.65-0.29 0.15-0.6 0.23-0.96 0.23zm4.98-6.45 0.2 2.01h0.6l0.19-2.01 0.03-1.1h-1.05zm3.1 5.46-0.6 0.7c0.34 0.36 0.75 0.64 1.22 0.85 0.48 0.21 0.99 0.31 1.54 0.31 0.42 0 0.79-0.05 1.12-0.17 0.32-0.12 0.6-0.28 0.84-0.48 0.23-0.2 0.41-0.44 0.53-0.71 0.12-0.28 0.19-0.57 0.19-0.88 0-0.29-0.05-0.54-0.13-0.76s-0.2-0.41-0.34-0.58c-0.15-0.16-0.32-0.31-0.52-0.43s-0.41-0.23-0.63-0.33l-1.12-0.48c-0.16-0.06-0.32-0.13-0.47-0.21s-0.29-0.16-0.42-0.26-0.23-0.22-0.3-0.35c-0.08-0.13-0.12-0.3-0.12-0.49 0-0.36 0.14-0.64 0.4-0.84 0.27-0.21 0.63-0.31 1.07-0.31 0.36 0 0.69 0.07 0.99 0.2 0.29 0.13 0.55 0.31 0.79 0.54l0.54-0.64c-0.28-0.29-0.62-0.53-1.02-0.71s-0.83-0.27-1.3-0.27c-0.36 0-0.69 0.06-0.99 0.16s-0.56 0.25-0.78 0.44-0.4 0.41-0.52 0.66c-0.12 0.26-0.19 0.54-0.19 0.83s0.05 0.54 0.15 0.76c0.09 0.22 0.22 0.41 0.37 0.57s0.32 0.3 0.52 0.41c0.19 0.11 0.38 0.21 0.56 0.29l1.13 0.49c0.18 0.09 0.35 0.17 0.51 0.25s0.3 0.17 0.42 0.27c0.11 0.1 0.21 0.22 0.27 0.36 0.07 0.14 0.11 0.31 0.11 0.51 0 0.39-0.15 0.7-0.44 0.93-0.28 0.24-0.69 0.36-1.21 0.36-0.41 0-0.8-0.09-1.18-0.27s-0.71-0.42-0.99-0.72z"/>
  </g>
 </g>
 <path d="m9.6778 54.11 29.794-16.93-7.9735-4.8789-21.4 12.683-0.4202-0.23943z" fill="#391561" opacity=".5" stroke-width=".068999"/>
 <path d="m9.6778 22.546v32.387l-9.6516-4.8768v-32.778z" fill="#b22166" stroke-width=".068999"/>
 <g fill="#391561" stroke-width=".068999">
  <path d="m29.796 56.58-20.837-10.769-8.2067 4.4097 29.318 16.037 0.14283-0.0828z"/>
  <path d="m60 15.612-30.75-15.612-8.0259 4.8824 29.59 16.132 0.20907-0.13593z" opacity=".5"/>
  <path d="m30.008 0.45954c-0.15318-0.10557-0.45263-0.26703-0.59822-0.37742-0.0014-0.00207-0.07935-0.067619 0.14559 0.051749 0.0062 0.00345-0.29946-0.068309-0.30566-0.071069l-8.2743 5.088-0.22977 33.783 9.6516-5.4999v-32.77c-0.13731-0.056579-0.27186-0.12351-0.38915-0.20424z" opacity=".5"/>
 </g>
 <path d="m29.854 33.636 30.146-17.946-9.0402-4.565-20.68 12.899-0.42572-0.25046z" fill="#b22166" stroke-width=".068999"/>
 <g fill="#391561" stroke-width=".068999">
  <path d="m9.8441 21.392 28.276-16.856-8.7898-4.5229-20.439 12.363-0.82799 0.434 0.41399 7.8417c0.56027 0.12903 1.015 0.39122 1.3662 0.73967zm50.156 28.04v-33.742l-9.4225 5.6075-0.22977 33.635z" opacity=".5"/>
  <path d="m30.206 66.304 29.794-16.932-8.2536-4.8506-21.12 12.655-0.42089-0.23736z" opacity=".5"/>
  <path d="m52.136 53.84 7.8638-4.4076-28.292-16.831-8.4751 3.9019 28.06 17.817c0.29048-0.26288 0.4271-0.35396 0.84316-0.48023z" opacity=".5"/>
  <path d="m39.857 60.959v-33.305l-9.4211 5.6372-0.23046 33.086z" opacity=".5"/>
 </g>
 <path d="m29.848 23.702-21.49-11.056-8.3571 4.7016 30.188 16.53 0.20976-0.13455z" fill="#b22166" stroke-width=".068999"/>
 <path d="m30.372 33.286 0.02553 32.972-9.6516-5.0459v-32.61z" fill="#391561" stroke-width=".068999"/>
</svg>
