module gitlab.com/digilab.overheid.nl/research/fds-poc/fictieve-belastingsamenwerking-omgeving-backend

go 1.21.1

require (
	github.com/gofiber/fiber/v2 v2.50.0
	gopkg.in/yaml.v3 v3.0.1
)

require (
	github.com/andybalholm/brotli v1.0.6 // indirect
	github.com/google/uuid v1.4.0 // indirect
	github.com/klauspost/compress v1.17.2 // indirect
	github.com/mattn/go-colorable v0.1.13 // indirect
	github.com/mattn/go-isatty v0.0.20 // indirect
	github.com/mattn/go-runewidth v0.0.15 // indirect
	github.com/rivo/uniseg v0.4.4 // indirect
	github.com/valyala/bytebufferpool v1.0.0 // indirect
	github.com/valyala/fasthttp v1.50.0 // indirect
	github.com/valyala/tcplisten v1.0.0 // indirect
	golang.org/x/sys v0.14.0 // indirect
)
