<?xml version="1.0" encoding="UTF-8"?>
<svg width="179.28" height="104.28" color-interpolation-filters="sRGB" data-v-6805eed4="" preserveAspectRatio="xMidYMid" version="1.0" viewBox="0 0 179.28 104.28" xmlns="http://www.w3.org/2000/svg">
 <path d="m9.32 71.116c0-1.79-1.37-3.22-3.23-3.22h-6.09v1.61l1.07 0.18v8.96l-1.07 0.18v1.61h5.73c2.03 0 3.77-1.61 3.77-3.67 0-1.35-0.72-2.42-1.62-3.01 0.9-0.58 1.44-1.51 1.44-2.64zm-6.1 1.61v-2.86h2.51c0.79 0 1.44 0.62 1.44 1.43s-0.65 1.43-1.44 1.43zm4.13 4.22c0 0.86-0.79 1.52-1.62 1.52h-2.51v-3.76h2.51c0.83 0 1.62 0.68 1.62 1.52zm7.61-3.5c0.36 0 0.63 0.23 0.63 0.63 0 0.3-0.18 0.54-0.54 0.63l-2.15 0.53v-1.16c0-0.36 0.27-0.63 0.63-0.63zm2.42 6.99v-1.97h-3.23c-0.68 0-1.18-0.41-1.25-1.17l2.6-0.62c1.13-0.27 2.24-1.08 2.24-2.6s-1.11-2.6-2.69-2.6h-1.79c-1.43 0-2.51 1.15-2.51 2.6v2.96c0 1.86 1.54 3.4 3.4 3.4zm1.25-11.83 1.08 0.18v9.86l-1.08 0.18v1.61h4.31v-1.61l-1.08-0.18v-11.65h-3.23zm5.56 2.87v3.05h1.61l0.18-1.08h1.7c0.36 0 0.63 0.34 0.63 0.72v0.46l-2.78 0.7c-1.18 0.31-2.06 1.33-2.06 2.51 0 1.58 0.92 2.6 2.6 2.6h5.47v-1.61l-1.08-0.18v-4.57c0-1.45-1.07-2.6-2.6-2.6zm1.43 6.27c0-0.36 0.24-0.59 0.54-0.66l2.15-0.5v1.88h-1.97c-0.45 0-0.72-0.36-0.72-0.72zm10.63-0.52c0.25 0.07 0.48 0.29 0.48 0.61 0 0.36-0.27 0.63-0.62 0.63h-2.24l-0.24-1.08h-1.56v3.05h4.22c1.52 0 2.59-1.2 2.59-2.6 0-1.29-0.89-2.18-2.06-2.51l-2.33-0.64c-0.25-0.07-0.44-0.27-0.44-0.61 0-0.36 0.26-0.63 0.62-0.63h1.88l0.18 1.08h1.62v-3.05h-3.86c-1.52 0-2.6 1.11-2.6 2.6 0 1.29 0.9 2.29 2.07 2.58zm4.43-3.96v4.39c0 1.53 1.16 2.78 2.68 2.78h1.44v-1.97h-1.17c-0.45 0-0.8-0.36-0.8-0.81v-4.21l1.79-0.18v-1.79h-1.79v-3.58h-1.96l-0.19 3.58h-1.08v1.61zm4.83-0.18 1.08 0.18v5.38l-1.08 0.18v1.61h4.3v-1.61l-1.07-0.18v-7.17h-3.23zm1.08-3.04h2.15v-2.15h-2.15zm12 3.94c0-1.43-1.21-2.51-2.68-2.51h-0.72c-0.63 0-1.25 0.27-1.61 0.54l-0.36-0.54h-2.69v1.61l1.08 0.18v5.38l-1.08 0.18v1.61h4.3v-1.61l-1.07-0.18v-3.85c0-0.81 0.62-1.35 1.43-1.35h0.54c0.45 0 0.71 0.36 0.71 0.72v4.48l-1.07 0.18v1.61h4.3v-1.61l-1.08-0.18zm6.63-0.54v5.02h-1.43c-0.72 0-1.25-0.54-1.25-1.26v-3.13c0-0.38 0.27-0.63 0.62-0.63zm-2.32-1.97c-1.44 0-2.51 1.08-2.51 2.6v2.96c0 1.86 1.43 3.4 3.4 3.4h1.43v0.72c0 0.82-0.62 1.43-1.43 1.43h-2.33v1.97h2.33c1.97 0 3.59-1.61 3.59-3.58v-7.71l1.07-0.18v-1.61zm10.8 5.75c0.25 0.07 0.48 0.29 0.48 0.61 0 0.36-0.26 0.63-0.62 0.63h-2.24l-0.24-1.08h-1.55v3.05h4.21c1.52 0 2.59-1.2 2.59-2.6 0-1.29-0.89-2.18-2.06-2.51l-2.33-0.64c-0.25-0.07-0.44-0.27-0.44-0.61 0-0.36 0.27-0.63 0.62-0.63h1.89l0.17 1.08h1.62v-3.05h-3.86c-1.52 0-2.59 1.11-2.59 2.6 0 1.29 0.89 2.29 2.06 2.58zm4.43-5.75v3.05h1.61l0.18-1.08h1.7c0.36 0 0.63 0.34 0.63 0.72v0.46l-2.78 0.7c-1.18 0.31-2.06 1.33-2.06 2.51 0 1.58 0.91 2.6 2.6 2.6h5.46v-1.61l-1.07-0.18v-4.57c0-1.45-1.08-2.6-2.6-2.6zm1.43 6.27c0-0.36 0.23-0.59 0.54-0.66l2.15-0.5v1.88h-1.97c-0.45 0-0.72-0.36-0.72-0.72zm19.53-3.76c0-1.43-1.22-2.51-2.69-2.51h-0.71c-0.81 0-1.53 0.18-2.15 0.72-0.54-0.54-1.15-0.72-1.97-0.72h-0.72c-0.63 0-1.25 0.27-1.61 0.54l-0.36-0.54h-2.69v1.61l1.08 0.18v5.38l-1.08 0.18v1.61h4.3v-1.61l-1.07-0.18v-3.85c0-0.81 0.62-1.35 1.43-1.35h0.54c0.41 0 0.71 0.36 0.71 0.72v4.48l-1.07 0.18v1.61h4.3v-1.61l-1.08-0.18v-3.85c0-0.81 0.65-1.35 1.44-1.35h0.54c0.44 0 0.71 0.36 0.71 0.72v4.48l-1.07 0.18v1.61h4.3v-1.61l-1.08-0.18zm6.01-0.54c0.35 0 0.62 0.23 0.62 0.63 0 0.3-0.18 0.54-0.53 0.63l-2.16 0.53v-1.16c0-0.36 0.27-0.63 0.63-0.63zm2.41 6.99v-1.97h-3.22c-0.68 0-1.18-0.41-1.26-1.17l2.6-0.62c1.13-0.27 2.24-1.08 2.24-2.6s-1.11-2.6-2.68-2.6h-1.8c-1.43 0-2.51 1.15-2.51 2.6v2.96c0 1.86 1.55 3.4 3.41 3.4zm9.32-6.45c0-1.43-1.22-2.51-2.69-2.51h-0.71c-0.63 0-1.26 0.27-1.61 0.54l-0.36-0.54h-2.69v1.61l1.07 0.18v5.38l-1.07 0.18v1.61h4.3v-1.61l-1.08-0.18v-3.85c0-0.81 0.63-1.35 1.44-1.35h0.54c0.44 0 0.71 0.36 0.71 0.72v4.48l-1.07 0.18v1.61h4.3v-1.61l-1.08-0.18zm5.29 3.4-1.35-4.12 1.08-0.18v-1.61h-4.3v1.61l1.07 0.18 2.51 7.17h1.97l1.44-4.12 1.43 4.12h1.97l2.51-7.17 1.08-0.18v-1.61h-4.3v1.61l1.07 0.18-1.34 4.12-1.35-4.12 1.08-0.18v-1.61h-4.3v1.61l1.07 0.18zm14.24-3.94c0.36 0 0.63 0.23 0.63 0.63 0 0.3-0.18 0.54-0.54 0.63l-2.15 0.53v-1.16c0-0.36 0.27-0.63 0.63-0.63zm2.42 6.99v-1.97h-3.22c-0.68 0-1.18-0.41-1.26-1.17l2.6-0.62c1.13-0.27 2.24-1.08 2.24-2.6s-1.11-2.6-2.69-2.6h-1.79c-1.43 0-2.51 1.15-2.51 2.6v2.96c0 1.86 1.54 3.4 3.41 3.4zm6.45-6.99 0.18 1.08h1.62v-3.05h-2.33c-0.63 0-1.26 0.25-1.62 0.54l-0.35-0.54h-2.69v1.61l1.07 0.18v5.38l-1.07 0.18v1.61h4.3v-1.61l-1.08-0.18v-3.77c0-0.89 0.54-1.43 1.44-1.43zm6.81 2.33 2.69-2.51 0.9-0.18v-1.61h-4.3v1.61l0.75 0.13-1.83 1.75v-7.97h-3.22v1.61l1.07 0.18v9.86l-1.07 0.18v1.61h4.3v-1.61l-1.08-0.18v-1.97l3.23 3.76h2.15v-1.61l-1.08-0.18zm4.3-2.69 1.08 0.18v5.38l-1.08 0.18v1.61h4.31v-1.61l-1.08-0.18v-7.17h-3.23zm1.08-3.04h2.15v-2.15h-2.15zm12.01 3.94c0-1.43-1.22-2.51-2.69-2.51h-0.72c-0.63 0-1.25 0.27-1.61 0.54l-0.36-0.54h-2.69v1.61l1.08 0.18v5.38l-1.08 0.18v1.61h4.3v-1.61l-1.07-0.18v-3.85c0-0.81 0.62-1.35 1.43-1.35h0.54c0.45 0 0.72 0.36 0.72 0.72v4.48l-1.08 0.18v1.61h4.3v-1.61l-1.07-0.18zm6.63-0.54v5.02h-1.44c-0.71 0-1.25-0.54-1.25-1.26v-3.13c0-0.38 0.27-0.63 0.63-0.63zm-2.33-1.97c-1.44 0-2.51 1.08-2.51 2.6v2.96c0 1.86 1.43 3.4 3.4 3.4h1.44v0.72c0 0.82-0.63 1.43-1.44 1.43h-2.33v1.97h2.33c1.97 0 3.59-1.61 3.59-3.58v-7.71l1.07-0.18v-1.61z" fill="#129f4e"/>
 <path d="m29.32 92.822-6.032 9.056h6.032v2.272h-9.136v-2.08l5.984-9.056h-5.984v-2.272h9.136zm8.512 11.456q-1.888 0-3.456-0.88-1.584-0.88-2.496-2.448-0.928-1.568-0.928-3.536t0.928-3.52q0.912-1.568 2.496-2.448 1.568-0.896 3.456-0.896 1.904 0 3.456 0.896 1.568 0.88 2.48 2.448 0.912 1.552 0.912 3.52t-0.912 3.536-2.48 2.448q-1.584 0.88-3.456 0.88zm0-2.4q1.2 0 2.128-0.544t1.44-1.568q0.512-1.008 0.512-2.352t-0.512-2.352-1.44-1.552q-0.928-0.528-2.128-0.528-1.216 0-2.144 0.528-0.928 0.544-1.456 1.552-0.512 1.008-0.512 2.352t0.512 2.352q0.528 1.024 1.456 1.568t2.144 0.544zm20.304-11.152v13.424h-2.688l-6.08-9.2v9.2h-2.688v-13.424h2.688l6.08 9.216v-9.216zm14.112 0v13.424h-2.688l-6.08-9.2v9.2h-2.688v-13.424h2.688l6.08 9.216v-9.216zm10.432 2.192h-5.088v3.36h4.512v2.128h-4.512v3.552h5.088v2.192h-7.776v-13.424h7.776zm13.904-2.192v13.424h-2.688l-6.096-9.2v9.2h-2.688v-13.424h2.688l6.096 9.216v-9.216zm17.664 0.016h2.896l-3.744 13.408h-3.168l-2.512-9.536-2.64 9.536-3.136 0.016-3.616-13.424h2.88l2.368 10.416 2.72-10.416h2.992l2.576 10.352zm10.864 13.536q-1.888 0-3.456-0.88t-2.496-2.448-0.928-3.536 0.928-3.52q0.928-1.568 2.496-2.448 1.568-0.896 3.456-0.896 1.904 0 3.472 0.896 1.552 0.88 2.464 2.448 0.912 1.552 0.912 3.52t-0.912 3.536-2.48 2.448-3.456 0.88zm0-2.4q1.216 0 2.128-0.544 0.928-0.544 1.44-1.568 0.528-1.008 0.528-2.352t-0.528-2.352q-0.512-1.008-1.44-1.552-0.912-0.528-2.128-0.528t-2.144 0.528q-0.928 0.544-1.44 1.552-0.528 1.008-0.528 2.352t0.528 2.352q0.512 1.024 1.44 1.568t2.144 0.544zm8.816-11.136h2.688v8.304q0 1.36 0.704 2.08 0.72 0.72 2 0.72 1.312 0 2.016-0.72t0.704-2.08v-8.304h2.72v8.288q0 1.696-0.752 2.88-0.736 1.184-1.968 1.776-1.248 0.592-2.752 0.592t-2.72-0.592-1.936-1.776q-0.704-1.184-0.704-2.88zm18.096 0q2.112 0 3.728 0.832 1.6 0.832 2.464 2.352 0.88 1.52 0.88 3.536t-0.88 3.536q-0.864 1.504-2.464 2.32-1.616 0.832-3.728 0.832h-4.672v-13.408zm-0.096 11.12q2.112 0 3.264-1.152t1.152-3.248q0-2.08-1.152-3.264t-3.264-1.184h-1.888v8.848z" fill="#364939" stroke-width="1.6"/>
 <path d="m89.64 29.996 5.2993-19.796c0.48729-1.7664 1.6446-3.3501 3.3501-4.3247 3.411-1.9492 7.7966-0.79184 9.7458 2.6192 0.91367 1.5837 1.1573 3.2892 0.85276 4.9338m-23.999-8.3448c-0.60911-0.42638-1.401-0.67002-2.1928-0.67002-2.1319 0-3.8983 1.7664-3.8983 3.8983 0 1.0964 0.42638 2.071 1.1573 2.741l6.3957 6.3957m11.634-11.451c-0.5482-1.5837-1.6446-2.9846-3.1674-3.8374-3.411-1.9492-7.7966-0.79184-9.7458 2.6192-0.97458 1.7055-1.2182 3.6547-0.73093 5.4211l5.2993 19.796m-16.568-19.187c-0.73093-0.06091-1.5228 0.12182-2.2537 0.48729-1.8273 1.0964-2.4974 3.4719-1.401 5.2993 0.5482 0.91366 1.401 1.5228 2.3755 1.8273l8.7103 2.3146m4.3856-15.715c-1.2791-1.0964-2.9237-1.7664-4.6901-1.7664-3.9592 0-7.1266 3.2283-7.1266 7.1266 0 1.9492 0.79184 3.7765 2.071 5.0556l14.497 14.497m-23.938-8.223c-0.67002 0.30456-1.2791 0.85275-1.7055 1.5837-1.0964 1.8273-0.42638 4.2029 1.401 5.2993 0.91366 0.5482 2.0101 0.67002 2.9237 0.36547l8.7103-2.3146m-3.9592-15.898c-1.6446-0.30456-3.411-0.06091-4.9338 0.85275-3.411 1.9492-4.5683 6.3347-2.6192 9.7458 0.97458 1.7055 2.5583 2.8628 4.3247 3.3501l19.796 5.2993m-24.913 4.7511c-0.42638 0.60911-0.67002 1.401-0.67002 2.1928 0 2.1319 1.7664 3.8983 3.8983 3.8983 1.0964 0 2.071-0.42638 2.741-1.1573l6.3957-6.3957m-11.451-11.634c-1.5837 0.5482-2.9846 1.6446-3.8374 3.1674-1.9492 3.411-0.79184 7.7966 2.6192 9.7458 1.7055 0.97458 3.6547 1.2182 5.4211 0.73093l19.796-5.2993m-19.187 16.568c-0.06091 0.73093 0.12182 1.5228 0.48729 2.2537 1.0964 1.8273 3.4719 2.4974 5.2993 1.401 0.91366-0.5482 1.5228-1.401 1.8273-2.3755l2.3146-8.7103m-15.715-4.3856c-1.0964 1.2791-1.7664 2.9237-1.7664 4.6901 0 3.9592 3.2283 7.1266 7.1266 7.1266 1.9492 0 3.7765-0.79184 5.0556-2.071l14.497-14.497m-8.223 23.938c0.30456 0.67002 0.85275 1.2791 1.5837 1.7055 1.8273 1.0964 4.2029 0.42638 5.2993-1.401 0.5482-0.91366 0.67002-2.0101 0.36547-2.9237l-2.3146-8.7103m-15.898 3.9592c-0.30456 1.6446-0.06091 3.411 0.85275 4.9338 1.9492 3.411 6.3347 4.5683 9.7458 2.6192 1.7055-0.97458 2.8628-2.5583 3.3501-4.3247l5.2993-19.796m4.7511 24.913c0.60911 0.42638 1.401 0.67002 2.1928 0.67002 2.1319 0 3.8983-1.7664 3.8983-3.8983 0-1.0964-0.42638-2.071-1.1573-2.741l-6.3347-6.3957m-11.695 11.451c0.5482 1.5837 1.6446 2.9846 3.1674 3.8374 3.411 1.9492 7.7966 0.79184 9.7458-2.6192 0.97458-1.7055 1.2182-3.6547 0.73093-5.4211l-5.2993-19.796m16.568 19.187c0.73093 0.06091 1.5228-0.12182 2.2537-0.48729 1.8273-1.0964 2.4974-3.4719 1.401-5.2993-0.5482-0.91367-1.401-1.5228-2.3755-1.8273l-8.7103-2.3146m-4.3856 15.715c1.2791 1.0964 2.9237 1.7664 4.6901 1.7664 3.9592 0 7.1266-3.2283 7.1266-7.1266 0-1.9492-0.79184-3.7765-2.071-5.0556l-14.497-14.558m23.938 8.2839c0.67002-0.30456 1.2791-0.85276 1.7055-1.5837 1.0964-1.8273 0.42638-4.2029-1.401-5.2993-0.91366-0.5482-2.0101-0.67002-2.9237-0.36547l-8.7103 2.3146m3.9592 15.898c1.6446 0.30456 3.411 0.06091 4.9338-0.85276 3.411-1.9492 4.5683-6.3347 2.6192-9.7458-0.97458-1.7055-2.5583-2.8628-4.3247-3.3501l-19.796-5.2993m24.913-4.7511c0.42638-0.60911 0.67002-1.401 0.67002-2.1928 0-2.1319-1.7664-3.8983-3.8983-3.8983-1.0964 0-2.071 0.42638-2.741 1.1573l-6.3957 6.3347m11.451 11.695c1.5837-0.5482 2.9846-1.6446 3.8374-3.1674 1.9492-3.411 0.79184-7.7966-2.6192-9.7458-1.7055-0.97458-3.6547-1.2182-5.4211-0.73093l-19.796 5.2993m19.187-16.568c0.0609-0.73093-0.12183-1.5228-0.48729-2.2537-1.0964-1.8273-3.4719-2.4974-5.2993-1.401-0.91367 0.5482-1.5228 1.401-1.8273 2.3755l-2.3146 8.7103m15.715 4.3856c1.0964-1.2791 1.7664-2.9237 1.7664-4.6901 0-3.9592-3.2283-7.1266-7.1266-7.1266-1.9492 0-3.7765 0.79184-5.0556 2.071l-14.558 14.497m8.2839-23.938c-0.30456-0.67002-0.85275-1.2791-1.5837-1.7055-1.8273-1.0964-4.2029-0.42638-5.2993 1.401-0.5482 0.91367-0.67002 2.0101-0.36547 2.9237l2.3146 8.7103m-8.1012-12.304c-1.2791-1.0964-2.9237-1.7664-4.6901-1.7664-3.9592 0-7.1266 3.2283-7.1266 7.1266 0 1.9492 0.79184 3.7765 2.071 5.0556l14.497 14.497-14.497-14.497" fill="none" stroke="#364939" stroke-miterlimit="10" stroke-width="2.4364"/>
</svg>
