module gitlab.com/digilab.overheid.nl/research/fds-poc/fictieve-belastingsamenwerking-backend

go 1.21.0

require (
	github.com/go-chi/chi/v5 v5.0.10
	github.com/go-pdf/fpdf v0.9.0
	github.com/golang-migrate/migrate/v4 v4.16.2
	github.com/google/uuid v1.3.0
	github.com/huandu/xstrings v1.4.0
	github.com/iamolegga/enviper v1.4.2
	github.com/jmoiron/sqlx v1.3.5
	github.com/lib/pq v1.10.2
	github.com/signintech/gopdf v0.20.0
	github.com/spf13/cobra v1.7.0
	github.com/spf13/viper v1.17.0
	golang.org/x/sync v0.5.0
)

require (
	github.com/fsnotify/fsnotify v1.6.0 // indirect
	github.com/hashicorp/errwrap v1.1.0 // indirect
	github.com/hashicorp/go-multierror v1.1.1 // indirect
	github.com/hashicorp/hcl v1.0.0 // indirect
	github.com/inconshreveable/mousetrap v1.1.0 // indirect
	github.com/magiconair/properties v1.8.7 // indirect
	github.com/mitchellh/mapstructure v1.5.0 // indirect
	github.com/pelletier/go-toml/v2 v2.1.0 // indirect
	github.com/phpdave11/gofpdi v1.0.14-0.20211212211723-1f10f9844311 // indirect
	github.com/pkg/errors v0.9.1 // indirect
	github.com/sagikazarmark/locafero v0.3.0 // indirect
	github.com/sagikazarmark/slog-shim v0.1.0 // indirect
	github.com/sourcegraph/conc v0.3.0 // indirect
	github.com/spf13/afero v1.10.0 // indirect
	github.com/spf13/cast v1.5.1 // indirect
	github.com/spf13/pflag v1.0.5 // indirect
	github.com/subosito/gotenv v1.6.0 // indirect
	go.uber.org/atomic v1.9.0 // indirect
	go.uber.org/multierr v1.9.0 // indirect
	golang.org/x/exp v0.0.0-20230905200255-921286631fa9 // indirect
	golang.org/x/sys v0.12.0 // indirect
	golang.org/x/text v0.13.0 // indirect
	gopkg.in/ini.v1 v1.67.0 // indirect
	gopkg.in/yaml.v3 v3.0.1 // indirect
)
