{
  "$schema": "https://docs.renovatebot.com/renovate-schema.json",
  "extends": [
    "config:recommended"
  ],
  "packageRules": [
    {
      "matchUpdateTypes": ["minor", "patch", "pin", "pinDigest", "digest", "lockFileMaintenance"],
      "matchCurrentVersion": "!/^0/",
      "automerge": true
    },
    {
      "matchDepTypes": ["devDependencies"],
      "automerge": true
    }
  ],
  "platformAutomerge": true
}
