module gitlab.com/digilab.overheid.nl/ecosystem/it-hygiene-validator

go 1.20

require (
	github.com/gofiber/fiber/v2 v2.52.0
	github.com/gofiber/template/html/v2 v2.1.0
	github.com/miekg/dns v1.1.58
	github.com/peterzen/goresolver v1.0.2
	golang.org/x/sync v0.6.0
)

require (
	github.com/andybalholm/brotli v1.1.0 // indirect
	github.com/gofiber/template v1.8.2 // indirect
	github.com/gofiber/utils v1.1.0 // indirect
	github.com/google/uuid v1.6.0 // indirect
	github.com/klauspost/compress v1.17.6 // indirect
	github.com/mattn/go-colorable v0.1.13 // indirect
	github.com/mattn/go-isatty v0.0.20 // indirect
	github.com/mattn/go-runewidth v0.0.15 // indirect
	github.com/rivo/uniseg v0.4.7 // indirect
	github.com/valyala/bytebufferpool v1.0.0 // indirect
	github.com/valyala/fasthttp v1.51.0 // indirect
	github.com/valyala/tcplisten v1.0.0 // indirect
	golang.org/x/mod v0.15.0 // indirect
	golang.org/x/net v0.21.0 // indirect
	golang.org/x/sys v0.17.0 // indirect
	golang.org/x/tools v0.17.0 // indirect
)
