{
  "db_name": "PostgreSQL",
  "query": "\n                UPDATE organisations\n                SET oin = $1, name = $2, updated_at = $3\n                WHERE id = $4\n            ",
  "describe": {
    "columns": [],
    "parameters": {
      "Left": [
        "Varchar",
        "Varchar",
        "Timestamptz",
        "Text"
      ]
    },
    "nullable": []
  },
  "hash": "8a883469bfb9b325d883f14a67a1a7a2ae043e7171c6a4e7d039b914d920fb8c"
}
