module gitlab.com/digilab.overheid.nl/ecosystem/synthetic-data-generator/generator-frontend

go 1.20

require (
	github.com/gofiber/contrib/websocket v1.2.1
	github.com/gofiber/fiber/v2 v2.49.1
	github.com/gofiber/template v1.8.1
	github.com/nats-io/nats.go v1.28.0
)

require (
	github.com/andybalholm/brotli v1.0.5 // indirect
	github.com/fasthttp/websocket v1.5.4 // indirect
	github.com/google/uuid v1.3.1 // indirect
	github.com/klauspost/compress v1.16.7 // indirect
	github.com/mattn/go-colorable v0.1.13 // indirect
	github.com/mattn/go-isatty v0.0.19 // indirect
	github.com/mattn/go-runewidth v0.0.15 // indirect
	github.com/nats-io/nats-server/v2 v2.9.22 // indirect
	github.com/nats-io/nkeys v0.4.4 // indirect
	github.com/nats-io/nuid v1.0.1 // indirect
	github.com/rivo/uniseg v0.4.4 // indirect
	github.com/savsgio/gotils v0.0.0-20230208104028-c358bd845dee // indirect
	github.com/valyala/bytebufferpool v1.0.0 // indirect
	github.com/valyala/fasthttp v1.49.0 // indirect
	github.com/valyala/tcplisten v1.0.0 // indirect
	golang.org/x/crypto v0.13.0 // indirect
	golang.org/x/sys v0.12.0 // indirect
	golang.org/x/text v0.13.0 // indirect
)
