module gitlab.com/digilab.overheid.nl/ecosystem/synthetic-data-generator/fictief-register-kadaster-frontend

go 1.20

require (
	github.com/gofiber/fiber/v2 v2.48.0
	github.com/gofiber/template/html/v2 v2.0.5
	github.com/google/uuid v1.3.1
	golang.org/x/text v0.8.0
)

require (
	github.com/andybalholm/brotli v1.0.5 // indirect
	github.com/gofiber/template v1.8.2 // indirect
	github.com/gofiber/utils v1.1.0 // indirect
	github.com/klauspost/compress v1.16.7 // indirect
	github.com/mattn/go-colorable v0.1.13 // indirect
	github.com/mattn/go-isatty v0.0.19 // indirect
	github.com/mattn/go-runewidth v0.0.15 // indirect
	github.com/rivo/uniseg v0.4.4 // indirect
	github.com/valyala/bytebufferpool v1.0.0 // indirect
	github.com/valyala/fasthttp v1.48.0 // indirect
	github.com/valyala/tcplisten v1.0.0 // indirect
	golang.org/x/sys v0.11.0 // indirect
)
