// Code generated by "go.opentelemetry.io/collector/cmd/builder". DO NOT EDIT.

module go.opentelemetry.io/collector/cmd/builder

go 1.22.2

replace gitlab.com/digilab.overheid.nl/ecosystem/migratieketen/ldv-metadata-enrichen-processor => ../ldv-metadata-enrichen-processor

replace gitlab.com/digilab.overheid.nl/ecosystem/migratieketen/ldv-metadata-enrichen-processor/api => ../ldv-metadata-enrichen-processor/api

replace gitlab.com/digilab.overheid.nl/ecosystem/migratieketen/bsn-pseudonimiseren-processor => ../bsn-pseudonimiseren-processor

replace gitlab.com/digilab.overheid.nl/ecosystem/migratieketen/vid-bloom-filter-exporter => ../vid-bloom-filter-exporter

require (
	github.com/open-telemetry/opentelemetry-collector-contrib/exporter/clickhouseexporter v0.102.0
	github.com/open-telemetry/opentelemetry-collector-contrib/exporter/kafkaexporter v0.102.0
	github.com/stretchr/testify v1.9.0
	gitlab.com/digilab.overheid.nl/ecosystem/migratieketen/bsn-pseudonimiseren-processor v0.0.0-20240618093539-da7c16419cae
	gitlab.com/digilab.overheid.nl/ecosystem/migratieketen/ldv-metadata-enrichen-processor v0.0.0-20240618093539-da7c16419cae
	gitlab.com/digilab.overheid.nl/ecosystem/migratieketen/vid-bloom-filter-exporter v0.0.0
	go.opentelemetry.io/collector/component v0.103.0
	go.opentelemetry.io/collector/connector v0.103.0
	go.opentelemetry.io/collector/exporter v0.103.0
	go.opentelemetry.io/collector/exporter/debugexporter v0.103.0
	go.opentelemetry.io/collector/exporter/otlpexporter v0.103.0
	go.opentelemetry.io/collector/extension v0.103.0
	go.opentelemetry.io/collector/otelcol v0.103.0
	go.opentelemetry.io/collector/processor v0.103.0
	go.opentelemetry.io/collector/processor/batchprocessor v0.103.0
	go.opentelemetry.io/collector/receiver v0.103.0
	go.opentelemetry.io/collector/receiver/otlpreceiver v0.103.0
)

require (
	github.com/Azure/go-ansiterm v0.0.0-20230124172434-306776ec8161 // indirect
	github.com/ClickHouse/ch-go v0.61.5 // indirect
	github.com/ClickHouse/clickhouse-go/v2 v2.25.0 // indirect
	github.com/IBM/sarama v1.43.2 // indirect
	github.com/andybalholm/brotli v1.1.0 // indirect
	github.com/apache/thrift v0.20.0 // indirect
	github.com/apapsch/go-jsonmerge/v2 v2.0.0 // indirect
	github.com/aws/aws-sdk-go v1.54.4 // indirect
	github.com/beorn7/perks v1.0.1 // indirect
	github.com/bits-and-blooms/bitset v1.13.0 // indirect
	github.com/cenkalti/backoff/v4 v4.3.0 // indirect
	github.com/cespare/xxhash/v2 v2.3.0 // indirect
	github.com/davecgh/go-spew v1.1.2-0.20180830191138-d8f796af33cc // indirect
	github.com/dmarkham/enumer v1.5.10 // indirect
	github.com/eapache/go-resiliency v1.6.0 // indirect
	github.com/eapache/go-xerial-snappy v0.0.0-20230731223053-c322873962e3 // indirect
	github.com/eapache/queue v1.1.0 // indirect
	github.com/felixge/httpsnoop v1.0.4 // indirect
	github.com/fsnotify/fsnotify v1.7.0 // indirect
	github.com/getkin/kin-openapi v0.125.0 // indirect
	github.com/go-chi/chi/v5 v5.0.13 // indirect
	github.com/go-faster/city v1.0.1 // indirect
	github.com/go-faster/errors v0.7.1 // indirect
	github.com/go-logr/logr v1.4.2 // indirect
	github.com/go-logr/stdr v1.2.2 // indirect
	github.com/go-ole/go-ole v1.3.0 // indirect
	github.com/go-openapi/jsonpointer v0.21.0 // indirect
	github.com/go-openapi/swag v0.23.0 // indirect
	github.com/go-viper/mapstructure/v2 v2.0.0 // indirect
	github.com/gogo/protobuf v1.3.2 // indirect
	github.com/golang/groupcache v0.0.0-20210331224755-41bb18bfe9da // indirect
	github.com/golang/snappy v0.0.4 // indirect
	github.com/google/uuid v1.6.0 // indirect
	github.com/grpc-ecosystem/grpc-gateway/v2 v2.20.0 // indirect
	github.com/hashicorp/errwrap v1.1.0 // indirect
	github.com/hashicorp/go-multierror v1.1.1 // indirect
	github.com/hashicorp/go-uuid v1.0.3 // indirect
	github.com/hashicorp/go-version v1.7.0 // indirect
	github.com/inconshreveable/mousetrap v1.1.0 // indirect
	github.com/invopop/yaml v0.3.1 // indirect
	github.com/jaegertracing/jaeger v1.58.0 // indirect
	github.com/jcmturner/aescts/v2 v2.0.0 // indirect
	github.com/jcmturner/dnsutils/v2 v2.0.0 // indirect
	github.com/jcmturner/gofork v1.7.6 // indirect
	github.com/jcmturner/gokrb5/v8 v8.4.4 // indirect
	github.com/jcmturner/rpc/v2 v2.0.3 // indirect
	github.com/jmespath/go-jmespath v0.4.0 // indirect
	github.com/josharian/intern v1.0.0 // indirect
	github.com/json-iterator/go v1.1.12 // indirect
	github.com/klauspost/compress v1.17.9 // indirect
	github.com/knadh/koanf/maps v0.1.1 // indirect
	github.com/knadh/koanf/providers/confmap v0.1.0 // indirect
	github.com/knadh/koanf/v2 v2.1.1 // indirect
	github.com/lufia/plan9stats v0.0.0-20240513124658-fba389f38bae // indirect
	github.com/mailru/easyjson v0.7.7 // indirect
	github.com/mitchellh/copystructure v1.2.0 // indirect
	github.com/mitchellh/reflectwalk v1.0.2 // indirect
	github.com/modern-go/concurrent v0.0.0-20180306012644-bacd9c7ef1dd // indirect
	github.com/modern-go/reflect2 v1.0.2 // indirect
	github.com/mohae/deepcopy v0.0.0-20170929034955-c48cc78d4826 // indirect
	github.com/mostynb/go-grpc-compression v1.2.3 // indirect
	github.com/oapi-codegen/runtime v1.1.1 // indirect
	github.com/open-telemetry/opentelemetry-collector-contrib/internal/coreinternal v0.102.0 // indirect
	github.com/open-telemetry/opentelemetry-collector-contrib/internal/kafka v0.102.0 // indirect
	github.com/open-telemetry/opentelemetry-collector-contrib/pkg/batchpersignal v0.102.0 // indirect
	github.com/open-telemetry/opentelemetry-collector-contrib/pkg/pdatautil v0.102.0 // indirect
	github.com/open-telemetry/opentelemetry-collector-contrib/pkg/translator/jaeger v0.102.0 // indirect
	github.com/open-telemetry/opentelemetry-collector-contrib/pkg/translator/zipkin v0.102.0 // indirect
	github.com/openzipkin/zipkin-go v0.4.3 // indirect
	github.com/pascaldekloe/name v1.0.1 // indirect
	github.com/paulmach/orb v0.11.1 // indirect
	github.com/perimeterx/marshmallow v1.1.5 // indirect
	github.com/pierrec/lz4/v4 v4.1.21 // indirect
	github.com/pkg/errors v0.9.1 // indirect
	github.com/pmezard/go-difflib v1.0.1-0.20181226105442-5d4384ee4fb2 // indirect
	github.com/power-devops/perfstat v0.0.0-20240221224432-82ca36839d55 // indirect
	github.com/prometheus/client_golang v1.19.1 // indirect
	github.com/prometheus/client_model v0.6.1 // indirect
	github.com/prometheus/common v0.54.0 // indirect
	github.com/prometheus/procfs v0.15.1 // indirect
	github.com/rcrowley/go-metrics v0.0.0-20201227073835-cf1acfcdf475 // indirect
	github.com/rs/cors v1.11.0 // indirect
	github.com/segmentio/asm v1.2.0 // indirect
	github.com/shirou/gopsutil/v3 v3.24.5 // indirect
	github.com/shirou/gopsutil/v4 v4.24.5 // indirect
	github.com/shoenig/go-m1cpu v0.1.6 // indirect
	github.com/shopspring/decimal v1.4.0 // indirect
	github.com/spaolacci/murmur3 v1.1.0 // indirect
	github.com/spf13/cobra v1.8.1 // indirect
	github.com/spf13/pflag v1.0.5 // indirect
	github.com/tklauser/go-sysconf v0.3.14 // indirect
	github.com/tklauser/numcpus v0.8.0 // indirect
	github.com/xdg-go/pbkdf2 v1.0.0 // indirect
	github.com/xdg-go/scram v1.1.2 // indirect
	github.com/xdg-go/stringprep v1.0.4 // indirect
	github.com/yusufpapurcu/wmi v1.2.4 // indirect
	gitlab.com/digilab.overheid.nl/ecosystem/migratieketen/ldv-metadata-enrichen-processor/api v0.0.0-20240618093539-da7c16419cae // indirect
	go.opencensus.io v0.24.0 // indirect
	go.opentelemetry.io/collector v0.103.0 // indirect
	go.opentelemetry.io/collector/config/configauth v0.103.0 // indirect
	go.opentelemetry.io/collector/config/configcompression v1.10.0 // indirect
	go.opentelemetry.io/collector/config/configgrpc v0.103.0 // indirect
	go.opentelemetry.io/collector/config/confighttp v0.103.0 // indirect
	go.opentelemetry.io/collector/config/confignet v0.103.0 // indirect
	go.opentelemetry.io/collector/config/configopaque v1.10.0 // indirect
	go.opentelemetry.io/collector/config/configretry v0.103.0 // indirect
	go.opentelemetry.io/collector/config/configtelemetry v0.103.0 // indirect
	go.opentelemetry.io/collector/config/configtls v0.103.0 // indirect
	go.opentelemetry.io/collector/config/internal v0.103.0 // indirect
	go.opentelemetry.io/collector/confmap v0.103.0 // indirect
	go.opentelemetry.io/collector/confmap/converter/expandconverter v0.103.0 // indirect
	go.opentelemetry.io/collector/confmap/provider/envprovider v0.103.0 // indirect
	go.opentelemetry.io/collector/confmap/provider/fileprovider v0.103.0 // indirect
	go.opentelemetry.io/collector/confmap/provider/httpprovider v0.103.0 // indirect
	go.opentelemetry.io/collector/confmap/provider/httpsprovider v0.103.0 // indirect
	go.opentelemetry.io/collector/confmap/provider/yamlprovider v0.103.0 // indirect
	go.opentelemetry.io/collector/consumer v0.103.0 // indirect
	go.opentelemetry.io/collector/extension/auth v0.103.0 // indirect
	go.opentelemetry.io/collector/featuregate v1.10.0 // indirect
	go.opentelemetry.io/collector/pdata v1.10.0 // indirect
	go.opentelemetry.io/collector/semconv v0.103.0 // indirect
	go.opentelemetry.io/collector/service v0.103.0 // indirect
	go.opentelemetry.io/contrib/config v0.7.0 // indirect
	go.opentelemetry.io/contrib/instrumentation/google.golang.org/grpc/otelgrpc v0.52.0 // indirect
	go.opentelemetry.io/contrib/instrumentation/net/http/otelhttp v0.52.0 // indirect
	go.opentelemetry.io/contrib/propagators/b3 v1.27.0 // indirect
	go.opentelemetry.io/otel v1.27.0 // indirect
	go.opentelemetry.io/otel/bridge/opencensus v1.27.0 // indirect
	go.opentelemetry.io/otel/exporters/otlp/otlpmetric/otlpmetricgrpc v1.27.0 // indirect
	go.opentelemetry.io/otel/exporters/otlp/otlpmetric/otlpmetrichttp v1.27.0 // indirect
	go.opentelemetry.io/otel/exporters/otlp/otlptrace v1.27.0 // indirect
	go.opentelemetry.io/otel/exporters/otlp/otlptrace/otlptracegrpc v1.27.0 // indirect
	go.opentelemetry.io/otel/exporters/otlp/otlptrace/otlptracehttp v1.27.0 // indirect
	go.opentelemetry.io/otel/exporters/prometheus v0.49.0 // indirect
	go.opentelemetry.io/otel/exporters/stdout/stdoutmetric v1.27.0 // indirect
	go.opentelemetry.io/otel/exporters/stdout/stdouttrace v1.27.0 // indirect
	go.opentelemetry.io/otel/metric v1.27.0 // indirect
	go.opentelemetry.io/otel/sdk v1.27.0 // indirect
	go.opentelemetry.io/otel/sdk/metric v1.27.0 // indirect
	go.opentelemetry.io/otel/trace v1.27.0 // indirect
	go.opentelemetry.io/proto/otlp v1.3.1 // indirect
	go.uber.org/atomic v1.11.0 // indirect
	go.uber.org/multierr v1.11.0 // indirect
	go.uber.org/zap v1.27.0 // indirect
	golang.org/x/crypto v0.24.0 // indirect
	golang.org/x/exp v0.0.0-20240613232115-7f521ea00fb8 // indirect
	golang.org/x/mod v0.18.0 // indirect
	golang.org/x/net v0.26.0 // indirect
	golang.org/x/sync v0.7.0 // indirect
	golang.org/x/sys v0.21.0 // indirect
	golang.org/x/text v0.16.0 // indirect
	golang.org/x/tools v0.22.0 // indirect
	gonum.org/v1/gonum v0.15.0 // indirect
	google.golang.org/genproto/googleapis/api v0.0.0-20240617180043-68d350f18fd4 // indirect
	google.golang.org/genproto/googleapis/rpc v0.0.0-20240617180043-68d350f18fd4 // indirect
	google.golang.org/grpc v1.64.0 // indirect
	google.golang.org/protobuf v1.34.2 // indirect
	gopkg.in/yaml.v3 v3.0.1 // indirect
)
